All pastes #1859064 Raw Edit

Miscellany

public text v1 · immutable
#1859064 ·published 2010-04-10 16:02 UTC
rendered paste body
 [32;01m*[0m CPV:  kde-base/attica-4.4.2
 [32;01m*[0m REPO: gentoo
 [32;01m*[0m USE:  amd64 elibc_glibc kernel_linux multilib userland_GNU
>>> Unpacking source...
 [32;01m*[0m Unpacking parts of kdebase-runtime-4.4.2.tar.bz2 to /home/portage/tmp/portage/kde-base/attica-4.4.2/work ...
[A[219C  [34;01m[ [32;01mok[34;01m ][0m
>>> Source unpacked in /home/portage/tmp/portage/kde-base/attica-4.4.2/work
>>> Preparing source in /home/portage/tmp/portage/kde-base/attica-4.4.2/work/attica-4.4.2 ...
>>> Source prepared.
>>> Configuring source in /home/portage/tmp/portage/kde-base/attica-4.4.2/work/attica-4.4.2 ...
>>> Working in BUILD_DIR: "/home/portage/tmp/portage/kde-base/attica-4.4.2/work/attica-4.4.2_build"
cmake -C /home/portage/tmp/portage/kde-base/attica-4.4.2/temp/gentoo_common_config.cmake -DCMAKE_INSTALL_PREFIX=/usr -DKDE4_BUILD_TESTS=OFF -DCMAKE_INSTALL_PREFIX=/usr -DSYSCONF_INSTALL_DIR=/etc -DCMAKE_BUILD_TYPE=Gentoo -DCMAKE_INSTALL_DO_STRIP=OFF -DCMAKE_USER_MAKE_RULES_OVERRIDE=/home/portage/tmp/portage/kde-base/attica-4.4.2/temp/gentoo_rules.cmake  /home/portage/tmp/portage/kde-base/attica-4.4.2/work/attica-4.4.2
loading initial cache file /home/portage/tmp/portage/kde-base/attica-4.4.2/temp/gentoo_common_config.cmake
-- The C compiler identification is GNU
-- The CXX compiler identification is GNU
-- Check for working C compiler: /usr/bin/x86_64-pc-linux-gnu-gcc
-- Check for working C compiler: /usr/bin/x86_64-pc-linux-gnu-gcc -- works
-- Detecting C compiler ABI info
-- Detecting C compiler ABI info - done
-- Check for working CXX compiler: /usr/bin/x86_64-pc-linux-gnu-g++
-- Check for working CXX compiler: /usr/bin/x86_64-pc-linux-gnu-g++ -- works
-- Detecting CXX compiler ABI info
-- Detecting CXX compiler ABI info - done
-- Looking for Q_WS_X11
-- Looking for Q_WS_X11 - found
-- Looking for Q_WS_WIN
-- Looking for Q_WS_WIN - not found.
-- Looking for Q_WS_QWS
-- Looking for Q_WS_QWS - not found.
-- Looking for Q_WS_MAC
-- Looking for Q_WS_MAC - not found.
-- Found Qt-Version 4.6.2 (using /usr/bin/qmake)
-- Looking for XOpenDisplay in /usr/lib64/libX11.so;/usr/lib64/libXext.so;/usr/lib64/libXft.so;/usr/lib64/libXau.so;/usr/lib64/libXdmcp.so;/usr/lib64/libXpm.so
-- Looking for XOpenDisplay in /usr/lib64/libX11.so;/usr/lib64/libXext.so;/usr/lib64/libXft.so;/usr/lib64/libXau.so;/usr/lib64/libXdmcp.so;/usr/lib64/libXpm.so - found
-- Looking for gethostbyname
-- Looking for gethostbyname - found
-- Looking for connect
-- Looking for connect - found
-- Looking for remove
-- Looking for remove - found
-- Looking for shmat
-- Looking for shmat - found
-- Looking for IceConnectionNumber in ICE
-- Looking for IceConnectionNumber in ICE - found
-- Found X11: /usr/lib64/libX11.so
-- Looking for include files CMAKE_HAVE_PTHREAD_H
-- Looking for include files CMAKE_HAVE_PTHREAD_H - found
-- Looking for pthread_create in pthreads
-- Looking for pthread_create in pthreads - not found
-- Looking for pthread_create in pthread
-- Looking for pthread_create in pthread - found
-- Found Threads: TRUE
-- Looking for _POSIX_TIMERS
-- Looking for _POSIX_TIMERS - found
-- Found Automoc4: /usr/bin/automoc4
-- Found Perl: /usr/bin/perl
-- Phonon Version: 4.4.0
-- Found Phonon: /usr/lib64/libphonon.so
-- Found Phonon Includes: /usr/include/KDE;/usr/include
-- Performing Test _OFFT_IS_64BIT
-- Performing Test _OFFT_IS_64BIT - Success
-- Performing Test HAVE_FPIE_SUPPORT
-- Performing Test HAVE_FPIE_SUPPORT - Success
-- Performing Test __KDE_HAVE_W_OVERLOADED_VIRTUAL
-- Performing Test __KDE_HAVE_W_OVERLOADED_VIRTUAL - Success
-- Performing Test __KDE_HAVE_GCC_VISIBILITY
-- Performing Test __KDE_HAVE_GCC_VISIBILITY - Success
-- Found KDE 4.4 include dir: /usr/include
-- Found KDE 4.4 library dir: /usr/lib64
-- Found the KDE4 kconfig_compiler preprocessor: /usr/bin/kconfig_compiler
-- Found automoc4: /usr/bin/automoc4
-- Strigi API needs 'signed char'
-- Found Strigi: /usr/lib64/libstreams.so
-- Soprano version 2.3.0 is too old. Please install 2.3.70 or newer
-- Found Soprano: /usr/include
-- Could NOT find SharedDesktopOntologies  (missing:  SHAREDDESKTOPONTOLOGIES_ROOT_DIR)
-- Could NOT find Nepomuk  (missing:  NEPOMUK_INCLUDE_DIR SOPRANO_PLUGIN_REDLANDBACKEND_FOUND SHAREDDESKTOPONTOLOGIES_FOUND)
-- Found SLP: /usr/lib64/libslp.so
-- Found libattica: /usr/local/lib64/libattica.so
-- Looking for include files HAVE_SYS_WAIT_H
-- Looking for include files HAVE_SYS_WAIT_H - found
-- Looking for include files HAVE_SYS_TIME_H
-- Looking for include files HAVE_SYS_TIME_H - found

-----------------------------------------------------------------------------
-- The following external packages were located on your system.
-- This installation will have the extra features provided by these packages.
-----------------------------------------------------------------------------
   * Soprano - Semantic Desktop Storing
   * Soprano Raptor Parser - RDF parser plugin for Soprano
   * OpenSLP - SLP (Service Location Protocol) implementation
   * libattica - A library to access Open Collaboration Service providers

-----------------------------------------------------------------------------
-- The following OPTIONAL packages could NOT be located on your system.
-- Consider installing them to enable more features from this software.
-----------------------------------------------------------------------------
   * Shared desktop ontologies  <http://oscaf.sourceforge.net>
     Desktop ontologies
     Ontologies necessary for the Nepomuk semantic desktop.
   * Nepomuk  <kdelibs>
     Nepomuk Libraries
     Required to build Nepomuk.
   * Soprano Virtuoso Backend  <http://soprano.sourceforge.net>
     Virtuoso storage backend for Soprano
     The Soprano Virtuoso backend is required to run the Nepomuk semantic desktop system.
   * Soprano Redland Backend  <http://soprano.sourceforge.net>
     Redland storage backend for Soprano
     The Soprano redland backend is required to build the Nepomuk semantic desktop system.

-----------------------------------------------------------------------------

-- <<< Gentoo configuration >>>
Build type      Gentoo
Install path    /usr
Compiler flags:
C               -march=athlon64 -O2 -pipe  -Wno-long-long -std=iso9899:1990 -Wundef -Wcast-align -Werror-implicit-function-declaration -Wchar-subscripts -Wall -W -Wpointer-arith -Wwrite-strings -Wformat-security -Wmissing-format-attribute -fno-common
C++             -march=athlon64 -O2 -pipe  -Wnon-virtual-dtor -Wno-long-long -ansi -Wundef -Wcast-align -Wchar-subscripts -Wall -W -Wpointer-arith -Wformat-security -fno-exceptions -DQT_NO_EXCEPTIONS -fno-check-new -fno-common -Woverloaded-virtual -fno-threadsafe-statics -fvisibility=hidden -fvisibility-inlines-hidden
Linker flags:
Executable      -Wl,--enable-new-dtags -Wl,-O1
Module          -Wl,--enable-new-dtags -Wl,--fatal-warnings -Wl,--no-undefined -lc -Wl,-O1
Shared          -Wl,--enable-new-dtags -Wl,--fatal-warnings -Wl,--no-undefined -lc -Wl,-O1

-- Configuring done
-- Generating done
-- Build files have been written to: /home/portage/tmp/portage/kde-base/attica-4.4.2/work/attica-4.4.2_build
>>> Source configured.
>>> Compiling source in /home/portage/tmp/portage/kde-base/attica-4.4.2/work/attica-4.4.2 ...
>>> Working in BUILD_DIR: "/home/portage/tmp/portage/kde-base/attica-4.4.2/work/attica-4.4.2_build"
make -j3 
[35m[1mScanning dependencies of target attica_kde_automoc
[0m[35m[1mScanning dependencies of target kcm_attica_automoc
[0m[34m[1mGenerating kdeplatformdependent.moc
[0m[34m[1mGenerating atticamodule.moc
[0m[  0%] Built target attica_kde_automoc
[34m[1mGenerating providerconfigwidget.moc
[0m[35m[1mScanning dependencies of target attica_kde
[  0%] Built target kcm_attica_automoc
[ 14%] [ 28%] [34m[1mGenerating ui_providerconfigwidget.h
[0m[34m[1mGenerating ui_providermanagement.h
[0m[35m[1mScanning dependencies of target kcm_attica
[0m[ 42%] [ 57%] [32mBuilding CXX object attica/kdeplugin/CMakeFiles/attica_kde.dir/kdeplatformdependent.o
[0m[32mBuilding CXX object attica/kdeplugin/CMakeFiles/attica_kde.dir/attica_kde_automoc.o
[0m[0m[ 71%] [ 85%] [32mBuilding CXX object attica/kcm/CMakeFiles/kcm_attica.dir/kcm_attica_automoc.o
[0m[32mBuilding CXX object attica/kcm/CMakeFiles/kcm_attica.dir/providerconfigwidget.o
[0m[100%] [32mBuilding CXX object attica/kcm/CMakeFiles/kcm_attica.dir/atticamodule.o
[0m/home/portage/tmp/portage/kde-base/attica-4.4.2/work/attica-4.4.2/attica/kdeplugin/kdeplatformdependent.cpp:193: attention : unused parameter 'baseUrl'
/home/portage/tmp/portage/kde-base/attica-4.4.2/work/attica-4.4.2/attica/kdeplugin/kdeplatformdependent.cpp:193: attention : unused parameter 'user'
/home/portage/tmp/portage/kde-base/attica-4.4.2/work/attica-4.4.2/attica/kdeplugin/kdeplatformdependent.cpp:193: attention : unused parameter 'password'
/home/portage/tmp/portage/kde-base/attica-4.4.2/work/attica-4.4.2/attica/kdeplugin/kdeplatformdependent.cpp: In function 'QObject* qt_plugin_instance()':
/home/portage/tmp/portage/kde-base/attica-4.4.2/work/attica-4.4.2/attica/kdeplugin/kdeplatformdependent.cpp:225: erreur: cannot allocate an object of abstract type 'Attica::KdePlatformDependent'
/home/portage/tmp/portage/kde-base/attica-4.4.2/work/attica-4.4.2/attica/kdeplugin/kdeplatformdependent.h:42: note:   because the following virtual functions are pure within 'Attica::KdePlatformDependent':
/usr/local/include/attica/platformdependent.h:47: note: 	virtual void Attica::PlatformDependent::addDefaultProviderFile(const QUrl&)
/usr/local/include/attica/platformdependent.h:48: note: 	virtual void Attica::PlatformDependent::removeDefaultProviderFile(const QUrl&)
/usr/local/include/attica/platformdependent.h:53: note: 	virtual void Attica::PlatformDependent::enableProvider(const QUrl&, bool) const
/usr/local/include/attica/platformdependent.h:54: note: 	virtual bool Attica::PlatformDependent::isEnabled(const QUrl&) const
make[2]: *** [attica/kdeplugin/CMakeFiles/attica_kde.dir/kdeplatformdependent.o] Erreur 1
make[1]: *** [attica/kdeplugin/CMakeFiles/attica_kde.dir/all] Erreur 2
make[1]: *** Attente des tches non termines....
[31m[1mLinking CXX shared module ../../lib/kcm_attica.so
[0m[100%] Built target kcm_attica
make: *** [all] Erreur 2
 [31;01m*[0m ERROR: kde-base/attica-4.4.2 failed:
 [31;01m*[0m   Make failed!
 [31;01m*[0m 
 [31;01m*[0m Call stack:
 [31;01m*[0m     ebuild.sh, line   54:  Called src_compile
 [31;01m*[0m   environment, line 4207:  Called kde4-meta_src_compile
 [31;01m*[0m   environment, line 3288:  Called kde4-base_src_compile
 [31;01m*[0m   environment, line 2965:  Called cmake-utils_src_compile
 [31;01m*[0m   environment, line 1104:  Called _execute_optionaly 'src_compile'
 [31;01m*[0m   environment, line  517:  Called enable_cmake-utils_src_compile
 [31;01m*[0m   environment, line 1469:  Called cmake-utils_src_make
 [31;01m*[0m   environment, line 1123:  Called die
 [31;01m*[0m The specific snippet of code:
 [31;01m*[0m           emake "$@" || die "Make failed!";
 [31;01m*[0m 
 [31;01m*[0m If you need support, post the output of 'emerge --info =kde-base/attica-4.4.2',
 [31;01m*[0m the complete build log and the output of 'emerge -pqv =kde-base/attica-4.4.2'.
 [31;01m*[0m The complete build log is located at '/home/portage/tmp/portage/kde-base/attica-4.4.2/temp/build.log'.
 [31;01m*[0m The ebuild environment file is located at '/home/portage/tmp/portage/kde-base/attica-4.4.2/temp/environment'.
 [31;01m*[0m S: '/home/portage/tmp/portage/kde-base/attica-4.4.2/work/attica-4.4.2'