All pastes #185573 Raw Edit

Mine

public text v1 · immutable
#185573 ·published 2006-09-29 02:39 UTC
rendered paste body
rpe.c:452: warning: unused parameter 'S'
rpe.c: In function 'Gsm_RPE_Decoding':
rpe.c:475: warning: unused parameter 'S'
if /bin/sh ../../../libtool --silent --mode=compile gcc -DHAVE_CONFIG_H -I. -I. -I../../.. -I../../../src/dialogs -I../../../src/dialogs/config -I../../../src/dialogs/wizard -I/usr/include/kde -I/usr/share/qt3/include -I.   -DQT_THREAD_SUPPORT  -D_REENTRANT  -ansi -W -Wall -Wchar-subscripts -Wshadow -Wpointer-arith -Wmissing-prototypes -Wwrite-strings -D_XOPEN_SOURCE=500 -D_BSD_SOURCE -O2   -Wformat-security -Wmissing-format-attribute -MT short_term.lo -MD -MP -MF ".deps/short_term.Tpo" \
          -c -o short_term.lo `test -f 'short_term.c' || echo './'`short_term.c; \
        then mv -f ".deps/short_term.Tpo" ".deps/short_term.Plo"; \
        else rm -f ".deps/short_term.Tpo"; exit 1; \
        fi
short_term.c: In function 'Decoding_of_the_coded_Log_Area_Ratios':
short_term.c:33: warning: unused variable 'ltmp'
short_term.c: In function 'Coefficients_0_12':
short_term.c:102: warning: unused variable 'ltmp'
short_term.c: In function 'Coefficients_13_26':
short_term.c:116: warning: unused variable 'ltmp'
short_term.c: In function 'Coefficients_27_39':
short_term.c:128: warning: unused variable 'ltmp'
short_term.c: In function 'LARp_to_rp':
short_term.c:159: warning: unused variable 'ltmp'
short_term.c: In function 'Gsm_Short_Term_Analysis_Filter':
short_term.c:381: warning: unused variable 'i'
if /bin/sh ../../../libtool --silent --mode=compile gcc -DHAVE_CONFIG_H -I. -I. -I../../.. -I../../../src/dialogs -I../../../src/dialogs/config -I../../../src/dialogs/wizard -I/usr/include/kde -I/usr/share/qt3/include -I.   -DQT_THREAD_SUPPORT  -D_REENTRANT  -ansi -W -Wall -Wchar-subscripts -Wshadow -Wpointer-arith -Wmissing-prototypes -Wwrite-strings -D_XOPEN_SOURCE=500 -D_BSD_SOURCE -O2   -Wformat-security -Wmissing-format-attribute -MT table.lo -MD -MP -MF ".deps/table.Tpo" \
          -c -o table.lo `test -f 'table.c' || echo './'`table.c; \
        then mv -f ".deps/table.Tpo" ".deps/table.Plo"; \
        else rm -f ".deps/table.Tpo"; exit 1; \
        fi
/bin/sh ../../../libtool --silent --mode=link gcc  -ansi -W -Wall -Wchar-subscripts -Wshadow -Wpointer-arith -Wmissing-prototypes -Wwrite-strings -D_XOPEN_SOURCE=500 -D_BSD_SOURCE -O2   -Wformat-security -Wmissing-format-attribute   -o libgsm.la  -L/usr/lib -L/usr/share/qt3/lib -L/usr/X11R6/lib    add.lo code.lo debug.lo decode.lo gsm_create.lo gsm_decode.lo gsm_destroy.lo gsm_encode.lo gsm_explode.lo gsm_implode.lo gsm_option.lo gsm_print.lo long_term.lo lpc.lo preprocess.lo rpe.lo short_term.lo table.lo
make[4]: Leaving directory `/home/daemonicus/Documents/konference-0.1/src/codecs/gsm'
make[4]: Entering directory `/home/daemonicus/Documents/konference-0.1/src/codecs'
if /bin/sh ../../libtool --silent --mode=compile --tag=CXX g++ -DHAVE_CONFIG_H -I. -I. -I../.. -I../../src/dialogs -I../../src/dialogs/config -I../../src/dialogs/wizard -I/usr/include/kde -I/usr/share/qt3/include -I.   -DQT_THREAD_SUPPORT  -D_REENTRANT  -Wnon-virtual-dtor -Wno-long-long -Wundef -ansi -D_XOPEN_SOURCE=500 -D_BSD_SOURCE -Wcast-align -Wconversion -Wchar-subscripts -Wall -W -Wpointer-arith -Wwrite-strings -O2 -Wformat-security -Wmissing-format-attribute -fno-exceptions -fno-check-new -fno-common  -MT h263.lo -MD -MP -MF ".deps/h263.Tpo" \
          -c -o h263.lo `test -f 'h263.cpp' || echo './'`h263.cpp; \
        then mv -f ".deps/h263.Tpo" ".deps/h263.Plo"; \
        else rm -f ".deps/h263.Tpo"; exit 1; \
        fi
In file included from h263.cpp:25:
h263.h:24:28: error: ffmpeg/avcodec.h: No such file or directory
h263.h:58: error: 'AVFrame' does not name a type
h263.h:59: error: ISO C++ forbids declaration of 'AVCodec' with no type
h263.h:59: error: expected ';' before '*' token
h263.h:60: error: ISO C++ forbids declaration of 'AVCodecContext' with no type
h263.h:60: error: expected ';' before '*' token
/usr/include/linux/videodev2.h:489: error: '__u64' does not name a type
/usr/include/linux/videodev2.h:560: error: 'v4l2_std_id' does not name a type
/usr/include/linux/videodev2.h:578: error: 'v4l2_std_id' does not name a type
/usr/include/linux/videodev2.h:615: error: 'v4l2_std_id' does not name a type
h263.cpp: In constructor 'H263Container::H263Container()':
h263.cpp:32: error: 'h263Encoder' was not declared in this scope
h263.cpp:33: error: 'h263EncContext' was not declared in this scope
h263.cpp:35: error: 'h263Decoder' was not declared in this scope
h263.cpp:36: error: 'h263DecContext' was not declared in this scope
h263.cpp:37: error: 'pictureIn' was not declared in this scope
h263.cpp:39: error: 'avcodec_init' was not declared in this scope
h263.cpp:40: error: 'avcodec_register_all' was not declared in this scope
h263.cpp: In member function 'bool H263Container::H263StartEncoder(int, int, int)':
h263.cpp:48: error: 'h263Encoder' was not declared in this scope
h263.cpp:48: error: 'CODEC_ID_H263' was not declared in this scope
h263.cpp:48: error: 'avcodec_find_encoder' was not declared in this scope
h263.cpp:55: error: 'h263EncContext' was not declared in this scope
h263.cpp:55: error: 'avcodec_alloc_context' was not declared in this scope
h263.cpp:69: error: 'avcodec_open' was not declared in this scope
h263.cpp:79: error: 'pictureOut' was not declared in this scope
h263.cpp: In member function 'bool H263Container::H263StartDecoder(int, int)':
h263.cpp:88: error: 'h263Decoder' was not declared in this scope
h263.cpp:88: error: 'CODEC_ID_H263' was not declared in this scope
h263.cpp:88: error: 'avcodec_find_decoder' was not declared in this scope
h263.cpp:95: error: 'h263DecContext' was not declared in this scope
h263.cpp:95: error: 'avcodec_alloc_context' was not declared in this scope
h263.cpp:96: error: 'pictureIn' was not declared in this scope
h263.cpp:96: error: 'avcodec_alloc_frame' was not declared in this scope
h263.cpp:103: error: 'avcodec_open' was not declared in this scope
h263.cpp: In member function 'uchar* H263Container::H263EncodeFrame(const uchar*, int*)':
h263.cpp:114: error: 'h263EncContext' was not declared in this scope
h263.cpp:115: error: 'pictureOut' was not declared in this scope
h263.cpp:119: error: 'avcodec_encode_video' was not declared in this scope
h263.cpp: In member function 'uchar* H263Container::H263DecodeFrame(const uchar*, int, uchar*, int)':
h263.cpp:128: error: 'h263DecContext' was not declared in this scope
h263.cpp:128: error: 'pictureIn' was not declared in this scope
h263.cpp:128: error: 'avcodec_decode_video' was not declared in this scope
h263.cpp: In member function 'void H263Container::H263StopEncoder()':
h263.cpp:147: error: 'h263EncContext' was not declared in this scope
h263.cpp:147: error: 'avcodec_encode_video' was not declared in this scope
h263.cpp:156: error: 'h263EncContext' was not declared in this scope
h263.cpp:158: error: 'avcodec_close' was not declared in this scope
h263.cpp: In member function 'void H263Container::H263StopDecoder()':
h263.cpp:169: error: 'h263DecContext' was not declared in this scope
h263.cpp:169: error: 'pictureIn' was not declared in this scope
h263.cpp:169: error: 'avcodec_decode_video' was not declared in this scope
h263.cpp:173: error: 'avcodec_close' was not declared in this scope
make[4]: *** [h263.lo] Error 1
make[4]: Leaving directory `/home/daemonicus/Documents/konference-0.1/src/codecs'
make[3]: *** [all-recursive] Error 1
make[3]: Leaving directory `/home/daemonicus/Documents/konference-0.1/src/codecs'
make[2]: *** [all-recursive] Error 1
make[2]: Leaving directory `/home/daemonicus/Documents/konference-0.1/src'
make[1]: *** [all-recursive] Error 1
make[1]: Leaving directory `/home/daemonicus/Documents/konference-0.1'
make: *** [all] Error 2