All pastes #185127 Raw Edit

Unnamed

public text v1 · immutable
#185127 ·published 2006-09-28 17:24 UTC
rendered paste body
1>------ Build started: Project: Download APR, Configuration: Debug Win32 ------
1>Downloading APR.
2>------ Build started: Project: Download SPIDERMONKEY, Configuration: Debug Win32 ------
2>Downloading SPIDERMONKEY.
1>Downloading: http://svn.freeswitch.org/downloads/libs/apr-1.2.7.tar.gz
2>Downloading: http://svn.freeswitch.org/downloads/libs/js20051231.zip
1>Extracting: C:\FreeSwitch\libs\apr-1.2.7.tar.gz
2>Extracting: C:\FreeSwitch\libs\js20051231.zip
1>7-Zip (A) 4.32  Copyright (c) 1999-2005 Igor Pavlov  2005-12-09
1>Processing archive: C:\FreeSwitch\libs\apr-1.2.7.tar.gz
1>Extracting  apr-1.2.7.tar
1>Everything is Ok
2>7-Zip (A) 4.32  Copyright (c) 1999-2005 Igor Pavlov  2005-12-09
2>Processing archive: C:\FreeSwitch\libs\js20051231.zip
2>Extracting  src
2>Extracting  src\config
2>Extracting  src\config\AIX4.1.mk
2>Extracting  src\config\AIX4.2.mk
2>Extracting  src\config\AIX4.3.mk
2>Extracting  src\config\Darwin.mk
2>Extracting  src\config\Darwin1.3.mk
2>Extracting  src\config\Darwin1.4.mk
2>Extracting  src\config\Darwin5.2.mk
2>Extracting  src\config\Darwin5.3.mk
2>Extracting  src\config\dgux.mk
2>Extracting  src\config\HP-UXB.10.10.mk
2>Extracting  src\config\HP-UXB.10.20.mk
2>Extracting  src\config\HP-UXB.11.00.mk
2>Extracting  src\config\IRIX.mk
2>Extracting  src\config\IRIX5.3.mk
2>Extracting  src\config\IRIX6.1.mk
2>Extracting  src\config\IRIX6.2.mk
2>Extracting  src\config\IRIX6.3.mk
2>Extracting  src\config\IRIX6.5.mk
2>Extracting  src\config\Linux_All.mk
2>Extracting  src\config\Mac_OS10.0.mk
2>Extracting  src\config\OSF1V4.0.mk
2>Extracting  src\config\OSF1V5.0.mk
2>Extracting  src\config\SunOS4.1.4.mk
2>Extracting  src\config\SunOS5.3.mk
2>Extracting  src\config\SunOS5.4.mk
2>Extracting  src\config\SunOS5.5.1.mk
2>Extracting  src\config\SunOS5.5.mk
2>Extracting  src\config\SunOS5.6.mk
2>Extracting  src\config\SunOS5.7.mk
2>Extracting  src\config\SunOS5.8.mk
2>Extracting  src\config\SunOS5.9.mk
2>Extracting  src\config\WINNT4.0.mk
2>Extracting  src\config\WINNT5.0.mk
2>Extracting  src\config\WINNT5.1.mk
2>Extracting  src\config\WINNT5.2.mk
2>Extracting  src\config.mk
2>Extracting  src\editline
2>Extracting  src\editline\editline.3
2>Extracting  src\editline\editline.c
2>Extracting  src\editline\editline.h
2>Extracting  src\editline\Makefile.ref
2>Extracting  src\editline\README
2>Extracting  src\editline\sysunix.c
2>Extracting  src\editline\unix.h
2>Extracting  src\fdlibm
2>Extracting  src\fdlibm\e_acos.c
2>Extracting  src\fdlibm\e_acosh.c
2>Extracting  src\fdlibm\e_asin.c
2>Extracting  src\fdlibm\e_atan2.c
2>Extracting  src\fdlibm\e_atanh.c
2>Extracting  src\fdlibm\e_cosh.c
2>Extracting  src\fdlibm\e_exp.c
2>Extracting  src\fdlibm\e_fmod.c
2>Extracting  src\fdlibm\e_gamma.c
2>Extracting  src\fdlibm\e_gamma_r.c
2>Extracting  src\fdlibm\e_hypot.c
2>Extracting  src\fdlibm\e_j0.c
2>Extracting  src\fdlibm\e_j1.c
2>Extracting  src\fdlibm\e_jn.c
2>Extracting  src\fdlibm\e_lgamma.c
2>Extracting  src\fdlibm\e_lgamma_r.c
2>Extracting  src\fdlibm\e_log.c
2>Extracting  src\fdlibm\e_log10.c
2>Extracting  src\fdlibm\e_pow.c
2>Extracting  src\fdlibm\e_remainder.c
2>Extracting  src\fdlibm\e_rem_pio2.c
2>Extracting  src\fdlibm\e_scalb.c
2>Extracting  src\fdlibm\e_sinh.c
2>Extracting  src\fdlibm\e_sqrt.c
2>Extracting  src\fdlibm\fdlibm.h
2>Extracting  src\fdlibm\fdlibm.mak
2>Extracting  src\fdlibm\fdlibm.mdp
2>Extracting  src\fdlibm\fdlibm.vcproj
2>Extracting  src\fdlibm\fdlibm.vcproj.RMR.mjerris.user
2>Extracting  src\fdlibm\k_cos.c
2>Extracting  src\fdlibm\k_rem_pio2.c
2>Extracting  src\fdlibm\k_sin.c
2>Extracting  src\fdlibm\k_standard.c
2>Extracting  src\fdlibm\k_tan.c
2>Extracting  src\fdlibm\Makefile.in
2>Extracting  src\fdlibm\Makefile.ref
2>Extracting  src\fdlibm\s_asinh.c
2>Extracting  src\fdlibm\s_atan.c
2>Extracting  src\fdlibm\s_cbrt.c
2>Extracting  src\fdlibm\s_ceil.c
2>Extracting  src\fdlibm\s_copysign.c
2>Extracting  src\fdlibm\s_cos.c
2>Extracting  src\fdlibm\s_erf.c
2>Extracting  src\fdlibm\s_expm1.c
2>Extracting  src\fdlibm\s_fabs.c
2>Extracting  src\fdlibm\s_finite.c
2>Extracting  src\fdlibm\s_floor.c
2>Extracting  src\fdlibm\s_frexp.c
2>Extracting  src\fdlibm\s_ilogb.c
2>Extracting  src\fdlibm\s_isnan.c
2>Extracting  src\fdlibm\s_ldexp.c
2>Extracting  src\fdlibm\s_lib_version.c
2>Extracting  src\fdlibm\s_log1p.c
2>Extracting  src\fdlibm\s_logb.c
2>Extracting  src\fdlibm\s_matherr.c
2>Extracting  src\fdlibm\s_modf.c
2>Extracting  src\fdlibm\s_nextafter.c
2>Extracting  src\fdlibm\s_rint.c
2>Extracting  src\fdlibm\s_scalbn.c
2>Extracting  src\fdlibm\s_signgam.c
2>Extracting  src\fdlibm\s_significand.c
2>Extracting  src\fdlibm\s_sin.c
2>Extracting  src\fdlibm\s_tan.c
2>Extracting  src\fdlibm\s_tanh.c
2>Extracting  src\fdlibm\w_acos.c
2>Extracting  src\fdlibm\w_acosh.c
2>Extracting  src\fdlibm\w_asin.c
2>Extracting  src\fdlibm\w_atan2.c
2>Extracting  src\fdlibm\w_atanh.c
2>Extracting  src\fdlibm\w_cosh.c
2>Extracting  src\fdlibm\w_exp.c
1>7-Zip (A) 4.32  Copyright (c) 1999-2005 Igor Pavlov  2005-12-09
1>Processing archive: C:\FreeSwitch\libs\apr-1.2.7.tar
1>Extracting  apr-1.2.7
1>Extracting  apr-1.2.7\configure.in
1>Extracting  apr-1.2.7\support
1>Extracting  apr-1.2.7\support\unix
1>Extracting  apr-1.2.7\support\unix\waitio.c
1>Extracting  apr-1.2.7\shmem
1>Extracting  apr-1.2.7\shmem\win32
1>Extracting  apr-1.2.7\shmem\win32\shm.c
1>Extracting  apr-1.2.7\shmem\beos
1>Extracting  apr-1.2.7\shmem\beos\shm.c
1>Extracting  apr-1.2.7\shmem\unix
1>Extracting  apr-1.2.7\shmem\unix\shm.c
1>Extracting  apr-1.2.7\shmem\os2
1>Extracting  apr-1.2.7\shmem\os2\shm.c
1>Extracting  apr-1.2.7\test
1>Extracting  apr-1.2.7\test\testvsn.c
1>Extracting  apr-1.2.7\test\nw_misc.c
1>Extracting  apr-1.2.7\test\testutil.c
1>Extracting  apr-1.2.7\test\testprocmutex.c
1>Extracting  apr-1.2.7\test\testfmt.c
1>Extracting  apr-1.2.7\test\teststr.c
1>Extracting  apr-1.2.7\test\tryread.c
1>Extracting  apr-1.2.7\test\abts.h
1>Extracting  apr-1.2.7\test\aprtest.dsp
1>Extracting  apr-1.2.7\test\nwgnutryread
1>Extracting  apr-1.2.7\test\testtime.c
1>Extracting  apr-1.2.7\test\testtemp.c
1>Extracting  apr-1.2.7\test\testpools.c
1>Extracting  apr-1.2.7\test\testud.c
1>Extracting  apr-1.2.7\test\testglobalmutex.h
1>Extracting  apr-1.2.7\test\testdso.c
1>Extracting  apr-1.2.7\test\testhash.c
1>Extracting  apr-1.2.7\test\testapp.c
1>Extracting  apr-1.2.7\test\teststrnatcmp.c
1>Extracting  apr-1.2.7\test\nwgnuproc_child
1>Extracting  apr-1.2.7\test\Makefile.win
1>Extracting  apr-1.2.7\test\testpoll.c
1>Extracting  apr-1.2.7\test\testenv.c
1>Extracting  apr-1.2.7\test\testrand.c
1>Extracting  apr-1.2.7\test\abts_tests.h
1>Extracting  apr-1.2.7\test\aprtest.def
1>Extracting  apr-1.2.7\test\testglobalmutex.c
1>Extracting  apr-1.2.7\test\testtable.c
1>Extracting  apr-1.2.7\test\testshmproducer.c
1>Extracting  apr-1.2.7\test\testproc.c
1>Extracting  apr-1.2.7\test\testmmap.c
1>Extracting  apr-1.2.7\test\testnames.c
1>Extracting  apr-1.2.7\test\testrand2.c
1>Extracting  apr-1.2.7\test\testmutexscope.c
1>Extracting  apr-1.2.7\test\testflock.h
1>Extracting  apr-1.2.7\test\globalmutexchild.c
1>Extracting  apr-1.2.7\test\testthread.c
1>Extracting  apr-1.2.7\test\testall.dsp
1>Extracting  apr-1.2.7\test\testfileinfo.c
1>Extracting  apr-1.2.7\test\README
1>Extracting  apr-1.2.7\test\testsleep.c
1>Extracting  apr-1.2.7\test\nwgnutestatmc
1>Extracting  apr-1.2.7\test\testpath.c
1>Extracting  apr-1.2.7\test\proc_child.c
1>Extracting  apr-1.2.7\test\nwgnusockchild
1>Extracting  apr-1.2.7\test\testpipe.c
1>Extracting  apr-1.2.7\test\testutil.h
1>Extracting  apr-1.2.7\test\abts.c
1>Extracting  apr-1.2.7\test\testshm.h
1>Extracting  apr-1.2.7\test\testipsub.c
1>Extracting  apr-1.2.7\test\internal
1>Extracting  apr-1.2.7\test\internal\testucs.c
1>Extracting  apr-1.2.7\test\internal\testregex.c
1>Extracting  apr-1.2.7\test\internal\Makefile.in
1>Extracting  apr-1.2.7\test\nwgnuglobalmutexchild
1>Extracting  apr-1.2.7\test\testshm.c
1>Extracting  apr-1.2.7\test\nwgnuaprtest
1>Extracting  apr-1.2.7\test\testsock.c
1>Extracting  apr-1.2.7\test\testshmconsumer.c
1>Extracting  apr-1.2.7\test\aprtest.win
1>Extracting  apr-1.2.7\test\testsockopt.c
1>Extracting  apr-1.2.7\test\testfilecopy.c
1>Extracting  apr-1.2.7\test\testargs.c
1>Extracting  apr-1.2.7\test\readchild.c
1>Extracting  apr-1.2.7\test\testuser.c
1>Extracting  apr-1.2.7\test\testall.dsw
1>Extracting  apr-1.2.7\test\testoc.c
1>Extracting  apr-1.2.7\test\testlockperf.c
1>Extracting  apr-1.2.7\test\testfile.c
1>Extracting  apr-1.2.7\test\NWGNUmakefile
1>Extracting  apr-1.2.7\test\testatomic.c
1>Extracting  apr-1.2.7\test\testdir.c
1>Extracting  apr-1.2.7\test\testlock.c
1>Extracting  apr-1.2.7\test\data
1>Extracting  apr-1.2.7\test\data\file_datafile.txt
1>Extracting  apr-1.2.7\test\data\mmap_datafile.txt
1>Extracting  apr-1.2.7\test\sockchild.c
1>Extracting  apr-1.2.7\test\testsockets.c
1>Extracting  apr-1.2.7\test\testfnmatch.c
1>Extracting  apr-1.2.7\test\occhild.c
1>Extracting  apr-1.2.7\test\testapp.dsp
1>Extracting  apr-1.2.7\test\nwgnumod_test
1>Extracting  apr-1.2.7\test\testflock.c
1>Extracting  apr-1.2.7\test\nwgnureadchild
1>Extracting  apr-1.2.7\test\testsock.h
1>Extracting  apr-1.2.7\test\testdup.c
1>Extracting  apr-1.2.7\test\testlfs.c
1>Extracting  apr-1.2.7\test\mod_test.c
1>Extracting  apr-1.2.7\test\Makefile.in
1>Extracting  apr-1.2.7\test\testappnt.dsp
1>Extracting  apr-1.2.7\test\sendfile.c
1>Extracting  apr-1.2.7\apr.dsp
1>Extracting  apr-1.2.7\buildconf
1>Extracting  apr-1.2.7\apr.pc.in
1>Extracting  apr-1.2.7\NOTICE
1>Extracting  apr-1.2.7\poll
1>Extracting  apr-1.2.7\poll\unix
1>Extracting  apr-1.2.7\poll\unix\epoll.c
1>Extracting  apr-1.2.7\poll\unix\select.c
1>Extracting  apr-1.2.7\poll\unix\poll.c
1>Extracting  apr-1.2.7\poll\unix\port.c
1>Extracting  apr-1.2.7\poll\unix\kqueue.c
1>Extracting  apr-1.2.7\poll\os2
1>Extracting  apr-1.2.7\poll\os2\pollset.c
1>Extracting  apr-1.2.7\poll\os2\poll.c
1>Extracting  apr-1.2.7\build-outputs.mk
1>Extracting  apr-1.2.7\helpers
1>Extracting  apr-1.2.7\helpers\apr_rename.pl
1>Extracting  apr-1.2.7\libapr.rc
1>Extracting  apr-1.2.7\apr.dsw
1>Extracting  apr-1.2.7\atomic
1>Extracting  apr-1.2.7\atomic\netware
1>Extracting  apr-1.2.7\atomic\netware\apr_atomic.c
1>Extracting  apr-1.2.7\atomic\win32
1>Extracting  apr-1.2.7\atomic\win32\apr_atomic.c
1>Extracting  apr-1.2.7\atomic\os390
1>Extracting  apr-1.2.7\atomic\os390\atomic.c
1>Extracting  apr-1.2.7\atomic\unix
1>Extracting  apr-1.2.7\atomic\unix\apr_atomic.c
1>Extracting  apr-1.2.7\passwd
1>Extracting  apr-1.2.7\passwd\apr_getpass.c
1>Extracting  apr-1.2.7\include
1>Extracting  apr-1.2.7\include\apr_thread_mutex.h
1>Extracting  apr-1.2.7\include\apr_env.h
1>Extracting  apr-1.2.7\include\apr_poll.h
1>Extracting  apr-1.2.7\include\apr_fnmatch.h
1>Extracting  apr-1.2.7\include\apr_global_mutex.h
1>Extracting  apr-1.2.7\include\apr_pools.h
1>Extracting  apr-1.2.7\include\apr.hnw
1>Extracting  apr-1.2.7\include\apr_want.h
1>Extracting  apr-1.2.7\include\apr_file_io.h
1>Extracting  apr-1.2.7\include\apr_version.h
1>Extracting  apr-1.2.7\include\apr_mmap.h
1>Extracting  apr-1.2.7\include\apr_dso.h
1>Extracting  apr-1.2.7\include\apr_thread_proc.h
1>Extracting  apr-1.2.7\include\apr.hw
1>Extracting  apr-1.2.7\include\arch
1>Extracting  apr-1.2.7\include\arch\netware
1>Extracting  apr-1.2.7\include\arch\netware\apr_arch_threadproc.h
1>Extracting  apr-1.2.7\include\arch\netware\apr_arch_file_io.h
1>Extracting  apr-1.2.7\include\arch\netware\apr_arch_proc_mutex.h
1>Extracting  apr-1.2.7\include\arch\netware\apr_arch_thread_mutex.h
1>Extracting  apr-1.2.7\include\arch\netware\apr_arch_thread_cond.h
2>Extracting  src\fdlibm\w_fmod.c
2>Extracting  src\fdlibm\w_gamma.c
2>Extracting  src\fdlibm\w_gamma_r.c
2>Extracting  src\fdlibm\w_hypot.c
1>Extracting  apr-1.2.7\include\arch\netware\apr_private.h
1>Extracting  apr-1.2.7\include\arch\netware\apr_arch_global_mutex.h
1>Extracting  apr-1.2.7\include\arch\netware\apr_arch_dso.h
1>Extracting  apr-1.2.7\include\arch\netware\apr_arch_internal_time.h
2>Extracting  src\fdlibm\w_j0.c
1>Extracting  apr-1.2.7\include\arch\netware\apr_arch_thread_rwlock.h
1>Extracting  apr-1.2.7\include\arch\netware\apr_arch_pre_nw.h
2>Extracting  src\fdlibm\w_j1.c
2>Extracting  src\fdlibm\w_jn.c
1>Extracting  apr-1.2.7\include\arch\netware\apr_arch_networkio.h
1>Extracting  apr-1.2.7\include\arch\apr_private_common.h
2>Extracting  src\fdlibm\w_lgamma.c
2>Extracting  src\fdlibm\w_lgamma_r.c
1>Extracting  apr-1.2.7\include\arch\win32
2>Extracting  src\fdlibm\w_log.c
2>Extracting  src\fdlibm\w_log10.c
1>Extracting  apr-1.2.7\include\arch\win32\apr_arch_misc.h
1>Extracting  apr-1.2.7\include\arch\win32\apr_dbg_win32_handles.h
2>Extracting  src\fdlibm\w_pow.c
2>Extracting  src\fdlibm\w_remainder.c
1>Extracting  apr-1.2.7\include\arch\win32\apr_arch_threadproc.h
1>Extracting  apr-1.2.7\include\arch\win32\apr_arch_file_io.h
2>Extracting  src\fdlibm\w_scalb.c
2>Extracting  src\fdlibm\w_sinh.c
1>Extracting  apr-1.2.7\include\arch\win32\apr_arch_atime.h
1>Extracting  apr-1.2.7\include\arch\win32\apr_arch_proc_mutex.h
2>Extracting  src\fdlibm\w_sqrt.c
2>Extracting  src\js.c
1>Extracting  apr-1.2.7\include\arch\win32\apr_arch_thread_mutex.h
1>Extracting  apr-1.2.7\include\arch\win32\apr_arch_thread_cond.h
2>Extracting  src\js.mak
2>Extracting  src\js.mdp
1>Extracting  apr-1.2.7\include\arch\win32\apr_private.h
1>Extracting  apr-1.2.7\include\arch\win32\apr_arch_dso.h
2>Extracting  src\js.msg
2>Extracting  src\js.pkg
1>Extracting  apr-1.2.7\include\arch\win32\apr_arch_inherit.h
2>Extracting  src\js.sln
1>Extracting  apr-1.2.7\include\arch\win32\apr_arch_thread_rwlock.h
1>Extracting  apr-1.2.7\include\arch\win32\apr_arch_networkio.h
2>Extracting  src\js.vcproj
2>Extracting  src\js3240.rc
1>Extracting  apr-1.2.7\include\arch\win32\apr_arch_utf8.h
1>Extracting  apr-1.2.7\include\arch\beos
2>Extracting  src\jsapi.c
2>Extracting  src\jsapi.h
1>Extracting  apr-1.2.7\include\arch\beos\apr_arch_threadproc.h
1>Extracting  apr-1.2.7\include\arch\beos\apr_arch_proc_mutex.h
2>Extracting  src\jsarena.c
2>Extracting  src\jsarena.h
1>Extracting  apr-1.2.7\include\arch\beos\apr_arch_thread_mutex.h
1>Extracting  apr-1.2.7\include\arch\beos\apr_arch_thread_cond.h
2>Extracting  src\jsarray.c
1>Extracting  apr-1.2.7\include\arch\beos\apr_arch_dso.h
2>Extracting  src\jsarray.h
2>Extracting  src\jsatom.c
1>Extracting  apr-1.2.7\include\arch\beos\apr_arch_thread_rwlock.h
2>Extracting  src\jsatom.h
2>Extracting  src\jsbit.h
2>Extracting  src\jsbool.c
2>Extracting  src\jsbool.h
2>Extracting  src\jsclist.h
2>Extracting  src\jscntxt.c
2>Extracting  src\jscntxt.h
2>Extracting  src\jscompat.h
2>Extracting  src\jsconfig.h
2>Extracting  src\jsconfig.mk
2>Extracting  src\jscpucfg.c
2>Extracting  src\jscpucfg.h
2>Extracting  src\jsdate.c
2>Extracting  src\jsdate.h
2>Extracting  src\jsdbgapi.c
2>Extracting  src\jsdbgapi.h
2>Extracting  src\jsdhash.c
2>Extracting  src\jsdhash.h
2>Extracting  src\jsdtoa.c
2>Extracting  src\jsdtoa.h
2>Extracting  src\jsemit.c
2>Extracting  src\jsemit.h
2>Extracting  src\jsexn.c
2>Extracting  src\jsexn.h
2>Extracting  src\jsfile.c
2>Extracting  src\jsfile.h
2>Extracting  src\jsfile.msg
2>Extracting  src\jsfun.c
2>Extracting  src\jsfun.h
2>Extracting  src\jsgc.c
2>Extracting  src\jsgc.h
2>Extracting  src\jshash.c
2>Extracting  src\jshash.h
2>Extracting  src\jsify.pl
2>Extracting  src\jsinterp.c
2>Extracting  src\jsinterp.h
2>Extracting  src\jslibmath.h
2>Extracting  src\jslock.c
2>Extracting  src\jslock.h
2>Extracting  src\jslocko.asm
2>Extracting  src\jslog2.c
2>Extracting  src\jslong.c
2>Extracting  src\jslong.h
2>Extracting  src\jsmath.c
2>Extracting  src\jsmath.h
2>Extracting  src\jsnum.c
2>Extracting  src\jsnum.h
2>Extracting  src\jsobj.c
2>Extracting  src\jsobj.h
2>Extracting  src\jsopcode.c
2>Extracting  src\jsopcode.h
2>Extracting  src\jsopcode.tbl
2>Extracting  src\jsOS240.def
2>Extracting  src\jsosdep.h
2>Extracting  src\jsotypes.h
2>Extracting  src\jsparse.c
2>Extracting  src\jsparse.h
2>Extracting  src\jsprf.c
2>Extracting  src\jsprf.h
2>Extracting  src\jsprvtd.h
2>Extracting  src\jspubtd.h
2>Extracting  src\jsregexp.c
2>Extracting  src\jsregexp.h
2>Extracting  src\jsscan.c
2>Extracting  src\jsscan.h
2>Extracting  src\jsscope.c
2>Extracting  src\jsscope.h
2>Extracting  src\jsscript.c
2>Extracting  src\jsscript.h
2>Extracting  src\jsshell.msg
2>Extracting  src\jsshell.vcproj
2>Extracting  src\jsstddef.h
2>Extracting  src\jsstr.c
2>Extracting  src\jsstr.h
2>Extracting  src\jstypes.h
2>Extracting  src\jsutil.c
2>Extracting  src\jsutil.h
2>Extracting  src\jsxdrapi.c
2>Extracting  src\jsxdrapi.h
2>Extracting  src\jsxml.c
2>Extracting  src\jsxml.h
2>Extracting  src\liveconnect
2>Extracting  src\liveconnect\classes
2>Extracting  src\liveconnect\classes\Makefile.in
2>Extracting  src\liveconnect\classes\Makefile.ref
2>Extracting  src\liveconnect\classes\netscape
2>Extracting  src\liveconnect\classes\netscape\javascript
2>Extracting  src\liveconnect\classes\netscape\javascript\JSException.java
2>Extracting  src\liveconnect\classes\netscape\javascript\JSObject.java
2>Extracting  src\liveconnect\classes\netscape\javascript\JSProxy.java
2>Extracting  src\liveconnect\classes\netscape\javascript\JSRunnable.java
2>Extracting  src\liveconnect\classes\netscape\javascript\JSUtil.java
2>Extracting  src\liveconnect\classes\netscape\javascript\Makefile.ref
2>Extracting  src\liveconnect\classes\netscape\Makefile.ref
2>Extracting  src\liveconnect\config
2>Extracting  src\liveconnect\config\AIX4.1.mk
2>Extracting  src\liveconnect\config\AIX4.2.mk
2>Extracting  src\liveconnect\config\AIX4.3.mk
2>Extracting  src\liveconnect\config\HP-UXB.10.10.mk
2>Extracting  src\liveconnect\config\HP-UXB.10.20.mk
2>Extracting  src\liveconnect\config\HP-UXB.11.00.mk
2>Extracting  src\liveconnect\config\IRIX6.2.mk
1>Extracting  apr-1.2.7\include\arch\os390
1>Extracting  apr-1.2.7\include\arch\os390\apr_arch_dso.h
1>Extracting  apr-1.2.7\include\arch\unix
1>Extracting  apr-1.2.7\include\arch\unix\apr_arch_misc.h
1>Extracting  apr-1.2.7\include\arch\unix\apr_arch_threadproc.h
1>Extracting  apr-1.2.7\include\arch\unix\apr_arch_file_io.h
1>Extracting  apr-1.2.7\include\arch\unix\apr_private.h.in
1>Extracting  apr-1.2.7\include\arch\unix\apr_arch_proc_mutex.h
1>Extracting  apr-1.2.7\include\arch\unix\apr_arch_thread_mutex.h
1>Extracting  apr-1.2.7\include\arch\unix\apr_arch_thread_cond.h
1>Extracting  apr-1.2.7\include\arch\unix\apr_arch_poll_private.h
1>Extracting  apr-1.2.7\include\arch\unix\apr_arch_global_mutex.h
1>Extracting  apr-1.2.7\include\arch\unix\apr_arch_dso.h
1>Extracting  apr-1.2.7\include\arch\unix\apr_arch_internal_time.h
1>Extracting  apr-1.2.7\include\arch\unix\apr_arch_inherit.h
1>Extracting  apr-1.2.7\include\arch\unix\apr_arch_thread_rwlock.h
1>Extracting  apr-1.2.7\include\arch\unix\apr_arch_networkio.h
1>Extracting  apr-1.2.7\include\arch\unix\apr_arch_shm.h
1>Extracting  apr-1.2.7\include\arch\aix
1>Extracting  apr-1.2.7\include\arch\aix\apr_arch_dso.h
1>Extracting  apr-1.2.7\include\arch\os2
1>Extracting  apr-1.2.7\include\arch\os2\apr_arch_threadproc.h
1>Extracting  apr-1.2.7\include\arch\os2\apr_arch_file_io.h
1>Extracting  apr-1.2.7\include\arch\os2\apr_arch_proc_mutex.h
1>Extracting  apr-1.2.7\include\arch\os2\apr_arch_os2calls.h
1>Extracting  apr-1.2.7\include\arch\os2\apr_arch_thread_mutex.h
1>Extracting  apr-1.2.7\include\arch\os2\apr_arch_thread_cond.h
1>Extracting  apr-1.2.7\include\arch\os2\apr_arch_dso.h
1>Extracting  apr-1.2.7\include\arch\os2\apr_arch_thread_rwlock.h
1>Extracting  apr-1.2.7\include\arch\os2\apr_arch_networkio.h
1>Extracting  apr-1.2.7\include\apr_errno.h
1>Extracting  apr-1.2.7\include\apr_shm.h
1>Extracting  apr-1.2.7\include\apr_network_io.h
1>Extracting  apr-1.2.7\include\apr_signal.h
1>Extracting  apr-1.2.7\include\apr_user.h
1>Extracting  apr-1.2.7\include\apr_support.h
1>Extracting  apr-1.2.7\include\apr_atomic.h
1>Extracting  apr-1.2.7\include\apr_random.h
1>Extracting  apr-1.2.7\include\apr_thread_cond.h
1>Extracting  apr-1.2.7\include\apr_thread_rwlock.h
1>Extracting  apr-1.2.7\include\apr_getopt.h
1>Extracting  apr-1.2.7\include\apr_inherit.h
1>Extracting  apr-1.2.7\include\apr_strings.h
1>Extracting  apr-1.2.7\include\apr_general.h
1>Extracting  apr-1.2.7\include\apr_proc_mutex.h
1>Extracting  apr-1.2.7\include\apr_tables.h
1>Extracting  apr-1.2.7\include\apr_ring.h
1>Extracting  apr-1.2.7\include\apr_file_info.h
1>Extracting  apr-1.2.7\include\apr_allocator.h
1>Extracting  apr-1.2.7\include\apr_portable.h
1>Extracting  apr-1.2.7\include\apr.h.in
1>Extracting  apr-1.2.7\include\apr_hash.h
1>Extracting  apr-1.2.7\include\apr_time.h
1>Extracting  apr-1.2.7\include\apr_lib.h
1>Extracting  apr-1.2.7\docs
1>Extracting  apr-1.2.7\docs\APRDesign.html
1>Extracting  apr-1.2.7\docs\incomplete_types
1>Extracting  apr-1.2.7\docs\canonical_filenames.html
1>Extracting  apr-1.2.7\docs\doxygen.conf
1>Extracting  apr-1.2.7\docs\non_apr_programs
1>Extracting  apr-1.2.7\docs\pool-design.html
1>Extracting  apr-1.2.7\docs\win32_builds.html
1>Extracting  apr-1.2.7\memory
1>Extracting  apr-1.2.7\memory\unix
1>Extracting  apr-1.2.7\memory\unix\apr_pools.c
1>Extracting  apr-1.2.7\build
1>Extracting  apr-1.2.7\build\mkdir.sh
1>Extracting  apr-1.2.7\build\install.sh
1>Extracting  apr-1.2.7\build\config.sub
1>Extracting  apr-1.2.7\build\find_apr.m4
1>Extracting  apr-1.2.7\build\jlibtool.c
1>Extracting  apr-1.2.7\build\make_var_export.awk
1>Extracting  apr-1.2.7\build\run-gcov.sh
1>Extracting  apr-1.2.7\build\libtool.m4
1>Extracting  apr-1.2.7\build\NWGNUtail.inc
1>Extracting  apr-1.2.7\build\make_exports.awk
1>Extracting  apr-1.2.7\build\NWGNUenvironment.inc
1>Extracting  apr-1.2.7\build\NWGNUhead.inc
1>Extracting  apr-1.2.7\build\apr_common.m4
1>Extracting  apr-1.2.7\build\nw_ver.awk
1>Extracting  apr-1.2.7\build\pkg
1>Extracting  apr-1.2.7\build\pkg\buildpkg.sh
1>Extracting  apr-1.2.7\build\pkg\README
1>Extracting  apr-1.2.7\build\pkg\pkginfo.in
1>Extracting  apr-1.2.7\build\ltmain.sh
1>Extracting  apr-1.2.7\build\apr_rules.mk.in
1>Extracting  apr-1.2.7\build\rpm
2>Extracting  src\liveconnect\config\IRIX6.3.mk
2>Extracting  src\liveconnect\config\IRIX6.5.mk
2>Extracting  src\liveconnect\config\Linux_All.mk
2>Extracting  src\liveconnect\config\OSF1V4.0.mk
2>Extracting  src\liveconnect\config\OSF1V5.0.mk
2>Extracting  src\liveconnect\config\SunOS5.5.1.mk
2>Extracting  src\liveconnect\config\SunOS5.6.mk
2>Extracting  src\liveconnect\config\SunOS5.7.mk
2>Extracting  src\liveconnect\config\SunOS5.8.mk
2>Extracting  src\liveconnect\config\WINNT4.0.mk
2>Extracting  src\liveconnect\jsj.c
2>Extracting  src\liveconnect\jsj.msg
2>Extracting  src\liveconnect\jsjava.h
2>Extracting  src\liveconnect\jsj_array.c
2>Extracting  src\liveconnect\jsj_class.c
2>Extracting  src\liveconnect\jsj_convert.c
2>Extracting  src\liveconnect\jsj_field.c
2>Extracting  src\liveconnect\jsj_hash.c
2>Extracting  src\liveconnect\jsj_hash.h
2>Extracting  src\liveconnect\jsj_JavaArray.c
2>Extracting  src\liveconnect\jsj_JavaClass.c
2>Extracting  src\liveconnect\jsj_JavaMember.c
2>Extracting  src\liveconnect\jsj_JavaObject.c
2>Extracting  src\liveconnect\jsj_JavaPackage.c
2>Extracting  src\liveconnect\jsj_JSObject.c
2>Extracting  src\liveconnect\jsj_method.c
2>Extracting  src\liveconnect\jsj_nodl.c
2>Extracting  src\liveconnect\jsj_private.h
2>Extracting  src\liveconnect\jsj_simpleapi.c
2>Extracting  src\liveconnect\jsj_utils.c
2>Extracting  src\liveconnect\LiveConnect.dsp
2>Extracting  src\liveconnect\liveconnect.pkg
2>Extracting  src\liveconnect\LiveConnectShell.dsp
2>Extracting  src\liveconnect\LiveConnectShell.dsw
2>Extracting  src\liveconnect\macbuild
2>Extracting  src\liveconnect\macbuild\JavaSession
2>Extracting  src\liveconnect\Makefile.in
2>Extracting  src\liveconnect\Makefile.ref
2>Extracting  src\liveconnect\netscape_javascript_JSObject.h
2>Extracting  src\liveconnect\nsCLiveconnect.cpp
2>Extracting  src\liveconnect\nsCLiveconnect.h
2>Extracting  src\liveconnect\nsCLiveconnectFactory.cpp
2>Extracting  src\liveconnect\nsCLiveconnectFactory.h
2>Extracting  src\liveconnect\nsILiveconnect.h
2>Extracting  src\liveconnect\nsISecureLiveconnect.h
2>Extracting  src\liveconnect\nsISecurityContext.h
2>Extracting  src\liveconnect\README.html
2>Extracting  src\liveconnect\win32.order
2>Extracting  src\liveconnect\_jni
2>Extracting  src\liveconnect\_jni\netscape_javascript_JSException.h
2>Extracting  src\liveconnect\_jni\netscape_javascript_JSObject.h
2>Extracting  src\liveconnect\_jri
2>Extracting  src\lock_SunOS.s
2>Extracting  src\Makefile.in
2>Extracting  src\Makefile.ref
2>Extracting  src\perfect.js
2>Extracting  src\perlconnect
2>Extracting  src\perlconnect\bg.jpg
2>Extracting  src\perlconnect\JS.def
2>Extracting  src\perlconnect\JS.dsp
2>Extracting  src\perlconnect\JS.pm
2>Extracting  src\perlconnect\JS.xs
2>Extracting  src\perlconnect\jsperl.c
2>Extracting  src\perlconnect\jsperl.h
2>Extracting  src\perlconnect\jsperlbuild.pl
2>Extracting  src\perlconnect\jsperlpvt.h
2>Extracting  src\perlconnect\Makefile.PL
2>Extracting  src\perlconnect\Makefile.ref
2>Extracting  src\perlconnect\PerlConnect.dsp
2>Extracting  src\perlconnect\PerlConnect.dsw
2>Extracting  src\perlconnect\PerlConnect.pm
2>Extracting  src\perlconnect\PerlConnectShell.dsp
2>Extracting  src\perlconnect\README.html
2>Extracting  src\perlconnect\test.js
2>Extracting  src\perlconnect\test.pl
2>Extracting  src\perlconnect\typemap
2>Extracting  src\plify_jsdhash.sed
2>Extracting  src\prmjtime.c
2>Extracting  src\prmjtime.h
2>Extracting  src\README.html
2>Extracting  src\resource.h
2>Extracting  src\rules.mk
2>Extracting  src\SpiderMonkey.rsp
2>Extracting  src\win32.order
2>Extracting  src\xpconnect
2>Extracting  src\xpconnect\codelib
2>Extracting  src\xpconnect\DispIDL
2>Extracting  src\xpconnect\idl
2>Extracting  src\xpconnect\idl\Makefile.in
2>Extracting  src\xpconnect\idl\mozIJSSubScriptLoader.idl
2>Extracting  src\xpconnect\idl\nsIActiveXSecurityPolicy.idl
2>Extracting  src\xpconnect\idl\nsIDispatchSupport.idl
2>Extracting  src\xpconnect\idl\nsIJSContextStack.idl
2>Extracting  src\xpconnect\idl\nsIJSRuntimeService.idl
2>Extracting  src\xpconnect\idl\nsIScriptableInterfaces.idl
2>Extracting  src\xpconnect\idl\nsIScriptError.idl
2>Extracting  src\xpconnect\idl\nsIXPConnect.idl
2>Extracting  src\xpconnect\idl\nsIXPCScriptable.idl
2>Extracting  src\xpconnect\idl\nsIXPCScriptNotify.idl
1>Extracting  apr-1.2.7\build\rpm\apr.spec.in
1>Extracting  apr-1.2.7\build\win32ver.awk
1>Extracting  apr-1.2.7\build\MakeEtags
1>Extracting  apr-1.2.7\build\PrintPath
1>Extracting  apr-1.2.7\build\libapr_app.dsp
1>Extracting  apr-1.2.7\build\gen-build.py
1>Extracting  apr-1.2.7\build\aplibtool.c
1>Extracting  apr-1.2.7\build\config.guess
1>Extracting  apr-1.2.7\build\apr_hints.m4
1>Extracting  apr-1.2.7\build\lineends.pl
1>Extracting  apr-1.2.7\build\apr_network.m4
1>Extracting  apr-1.2.7\build\get-version.sh
1>Extracting  apr-1.2.7\build\buildcheck.sh
1>Extracting  apr-1.2.7\build\NWGNUmakefile
1>Extracting  apr-1.2.7\build\prebuildNW.bat
1>Extracting  apr-1.2.7\build\cvtdsp.pl
1>Extracting  apr-1.2.7\build\nw_export.inc
1>Extracting  apr-1.2.7\build\fixwin32mak.pl
1>Extracting  apr-1.2.7\build\apr_threads.m4
1>Extracting  apr-1.2.7\build\apr_app.dsp
1>Extracting  apr-1.2.7\build\make_nw_export.awk
1>Extracting  apr-1.2.7\misc
1>Extracting  apr-1.2.7\misc\netware
1>Extracting  apr-1.2.7\misc\netware\charset.c
1>Extracting  apr-1.2.7\misc\netware\rand.c
1>Extracting  apr-1.2.7\misc\netware\start.c
1>Extracting  apr-1.2.7\misc\netware\aprlib.def
1>Extracting  apr-1.2.7\misc\netware\libprews.c
1>Extracting  apr-1.2.7\misc\netware\apr.xdc
1>Extracting  apr-1.2.7\misc\win32
1>Extracting  apr-1.2.7\misc\win32\charset.c
1>Extracting  apr-1.2.7\misc\win32\misc.c
1>Extracting  apr-1.2.7\misc\win32\apr_app.c
1>Extracting  apr-1.2.7\misc\win32\env.c
1>Extracting  apr-1.2.7\misc\win32\rand.c
1>Extracting  apr-1.2.7\misc\win32\start.c
1>Extracting  apr-1.2.7\misc\win32\internal.c
1>Extracting  apr-1.2.7\misc\win32\utf8.c
1>Extracting  apr-1.2.7\misc\unix
1>Extracting  apr-1.2.7\misc\unix\charset.c
1>Extracting  apr-1.2.7\misc\unix\env.c
1>Extracting  apr-1.2.7\misc\unix\version.c
1>Extracting  apr-1.2.7\misc\unix\randbyte_os2.inc
1>Extracting  apr-1.2.7\misc\unix\rand.c
1>Extracting  apr-1.2.7\misc\unix\start.c
1>Extracting  apr-1.2.7\misc\unix\errorcodes.c
1>Extracting  apr-1.2.7\misc\unix\getopt.c
1>Extracting  apr-1.2.7\misc\unix\otherchild.c
1>Extracting  apr-1.2.7\strings
1>Extracting  apr-1.2.7\strings\apr_cpystrn.c
1>Extracting  apr-1.2.7\strings\apr_strnatcmp.c
1>Extracting  apr-1.2.7\strings\apr_strings.c
1>Extracting  apr-1.2.7\strings\apr_strtok.c
1>Extracting  apr-1.2.7\strings\apr_fnmatch.c
1>Extracting  apr-1.2.7\strings\apr_snprintf.c
1>Extracting  apr-1.2.7\emacs-mode
1>Extracting  apr-1.2.7\images
1>Extracting  apr-1.2.7\images\tip.png
1>Extracting  apr-1.2.7\images\ScanDocBig.jpg
1>Extracting  apr-1.2.7\images\ScanDocSmall.jpg
1>Extracting  apr-1.2.7\images\bug.png
1>Extracting  apr-1.2.7\images\ball2.gif
1>Extracting  apr-1.2.7\images\warning.png
1>Extracting  apr-1.2.7\images\master.png
1>Extracting  apr-1.2.7\images\ball1.gif
1>Extracting  apr-1.2.7\images\caution.png
1>Extracting  apr-1.2.7\images\caution.gif
1>Extracting  apr-1.2.7\images\ball2.png
1>Extracting  apr-1.2.7\images\tip.gif
1>Extracting  apr-1.2.7\images\warning.gif
1>Extracting  apr-1.2.7\images\bug.gif
1>Extracting  apr-1.2.7\images\ball1.png
1>Extracting  apr-1.2.7\images\master.gif
1>Extracting  apr-1.2.7\tables
1>Extracting  apr-1.2.7\tables\apr_tables.c
1>Extracting  apr-1.2.7\tables\apr_hash.c
1>Extracting  apr-1.2.7\libapr.dsp
1>Extracting  apr-1.2.7\apr-config.in
1>Extracting  apr-1.2.7\README.dev
1>Extracting  apr-1.2.7\random
1>Extracting  apr-1.2.7\random\unix
1>Extracting  apr-1.2.7\random\unix\sha2.c
1>Extracting  apr-1.2.7\random\unix\sha2.h
1>Extracting  apr-1.2.7\random\unix\apr_random.c
1>Extracting  apr-1.2.7\random\unix\sha2_glue.c
1>Extracting  apr-1.2.7\mmap
1>Extracting  apr-1.2.7\mmap\win32
1>Extracting  apr-1.2.7\mmap\win32\mmap.c
1>Extracting  apr-1.2.7\mmap\unix
1>Extracting  apr-1.2.7\mmap\unix\mmap.c
1>Extracting  apr-1.2.7\mmap\unix\common.c
1>Extracting  apr-1.2.7\user
1>Extracting  apr-1.2.7\user\netware
1>Extracting  apr-1.2.7\user\netware\userinfo.c
1>Extracting  apr-1.2.7\user\netware\groupinfo.c
1>Extracting  apr-1.2.7\user\win32
1>Extracting  apr-1.2.7\user\win32\userinfo.c
1>Extracting  apr-1.2.7\user\win32\groupinfo.c
1>Extracting  apr-1.2.7\user\unix
1>Extracting  apr-1.2.7\user\unix\userinfo.c
1>Extracting  apr-1.2.7\user\unix\groupinfo.c
1>Extracting  apr-1.2.7\locks
1>Extracting  apr-1.2.7\locks\netware
2>Extracting  src\xpconnect\idl\nsIXPCSecurityManager.idl
2>Extracting  src\xpconnect\idl\xpccomponents.idl
2>Extracting  src\xpconnect\idl\xpcexception.idl
2>Extracting  src\xpconnect\idl\XPCIDispatch.idl
2>Extracting  src\xpconnect\idl\xpcjsid.idl
2>Extracting  src\xpconnect\loader
2>Extracting  src\xpconnect\loader\Makefile.in
2>Extracting  src\xpconnect\loader\mozJSComponentLoader.cpp
2>Extracting  src\xpconnect\loader\mozJSComponentLoader.h
2>Extracting  src\xpconnect\loader\mozJSLoaderConstructors.h
2>Extracting  src\xpconnect\loader\mozJSSubScriptLoader.cpp
2>Extracting  src\xpconnect\loader\mozJSSubScriptLoader.h
2>Extracting  src\xpconnect\loader\win32.order
2>Extracting  src\xpconnect\Makefile.in
2>Extracting  src\xpconnect\md
2>Extracting  src\xpconnect\md\test
2>Extracting  src\xpconnect\md\unix
2>Extracting  src\xpconnect\md\win32
2>Extracting  src\xpconnect\public
2>Extracting  src\xpconnect\public\Makefile.in
2>Extracting  src\xpconnect\public\xpc_map_end.h
2>Extracting  src\xpconnect\sample
2>Extracting  src\xpconnect\sample\Makefile.in
2>Extracting  src\xpconnect\sample\README
2>Extracting  src\xpconnect\sample\xpcsample1.cpp
2>Extracting  src\xpconnect\sample\xpcsample1.idl
2>Extracting  src\xpconnect\sample\xpcsample1.js
2>Extracting  src\xpconnect\shared
2>Extracting  src\xpconnect\shell
2>Extracting  src\xpconnect\shell\jsshell.msg
2>Extracting  src\xpconnect\shell\Makefile.in
2>Extracting  src\xpconnect\shell\xpcshell.cpp
2>Extracting  src\xpconnect\src
2>Extracting  src\xpconnect\src\Makefile.in
2>Extracting  src\xpconnect\src\nsDispatchSupport.cpp
2>Extracting  src\xpconnect\src\nsScriptError.cpp
2>Extracting  src\xpconnect\src\nsXPConnect.cpp
2>Extracting  src\xpconnect\src\README
2>Extracting  src\xpconnect\src\win32.order
2>Extracting  src\xpconnect\src\xpc.msg
2>Extracting  src\xpconnect\src\xpccallcontext.cpp
2>Extracting  src\xpconnect\src\xpccomponents.cpp
2>Extracting  src\xpconnect\src\xpccontext.cpp
2>Extracting  src\xpconnect\src\xpcconvert.cpp
2>Extracting  src\xpconnect\src\xpcdebug.cpp
2>Extracting  src\xpconnect\src\XPCDispConvert.cpp
2>Extracting  src\xpconnect\src\XPCDispInlines.h
2>Extracting  src\xpconnect\src\XPCDispInterface.cpp
2>Extracting  src\xpconnect\src\XPCDispObject.cpp
2>Extracting  src\xpconnect\src\XPCDispParamPropJSClass.cpp
2>Extracting  src\xpconnect\src\XPCDispParams.cpp
2>Extracting  src\xpconnect\src\XPCDispPrivate.h
2>Extracting  src\xpconnect\src\XPCDispTearOff.cpp
2>Extracting  src\xpconnect\src\XPCDispTypeInfo.cpp
2>Extracting  src\xpconnect\src\xpcexception.cpp
2>Extracting  src\xpconnect\src\xpcforwards.h
2>Extracting  src\xpconnect\src\XPCIDispatchClassInfo.cpp
2>Extracting  src\xpconnect\src\XPCIDispatchExtension.cpp
2>Extracting  src\xpconnect\src\xpcinlines.h
2>Extracting  src\xpconnect\src\xpcjsid.cpp
2>Extracting  src\xpconnect\src\xpcjsruntime.cpp
2>Extracting  src\xpconnect\src\xpclog.cpp
2>Extracting  src\xpconnect\src\xpclog.h
2>Extracting  src\xpconnect\src\xpcmaps.cpp
2>Extracting  src\xpconnect\src\xpcmaps.h
2>Extracting  src\xpconnect\src\xpcmodule.cpp
2>Extracting  src\xpconnect\src\XPCNativeWrapper.cpp
2>Extracting  src\xpconnect\src\XPCNativeWrapper.h
2>Extracting  src\xpconnect\src\xpconnect.pkg
2>Extracting  src\xpconnect\src\xpcprivate.h
2>Extracting  src\xpconnect\src\xpcruntimesvc.cpp
2>Extracting  src\xpconnect\src\xpcstack.cpp
2>Extracting  src\xpconnect\src\xpcstring.cpp
2>Extracting  src\xpconnect\src\xpcthreadcontext.cpp
2>Extracting  src\xpconnect\src\xpcthrower.cpp
2>Extracting  src\xpconnect\src\xpcvariant.cpp
2>Extracting  src\xpconnect\src\xpcwrappedjs.cpp
2>Extracting  src\xpconnect\src\xpcwrappedjsclass.cpp
2>Extracting  src\xpconnect\src\xpcwrappednative.cpp
2>Extracting  src\xpconnect\src\xpcwrappednativeinfo.cpp
2>Extracting  src\xpconnect\src\xpcwrappednativejsops.cpp
2>Extracting  src\xpconnect\src\xpcwrappednativeproto.cpp
2>Extracting  src\xpconnect\src\xpcwrappednativescope.cpp
2>Extracting  src\xpconnect\test
2>Extracting  src\xpconnect\tests
2>Extracting  src\xpconnect\tests\components
2>Extracting  src\xpconnect\tests\components\Makefile.in
2>Extracting  src\xpconnect\tests\components\win32.order
2>Extracting  src\xpconnect\tests\components\xpctest_array.cpp
1>Extracting  apr-1.2.7\locks\netware\thread_rwlock.c
1>Extracting  apr-1.2.7\locks\netware\thread_mutex.c
1>Extracting  apr-1.2.7\locks\netware\thread_cond.c
1>Extracting  apr-1.2.7\locks\netware\proc_mutex.c
1>Extracting  apr-1.2.7\locks\win32
1>Extracting  apr-1.2.7\locks\win32\thread_rwlock.c
1>Extracting  apr-1.2.7\locks\win32\thread_mutex.c
1>Extracting  apr-1.2.7\locks\win32\thread_cond.c
1>Extracting  apr-1.2.7\locks\win32\proc_mutex.c
1>Extracting  apr-1.2.7\locks\beos
1>Extracting  apr-1.2.7\locks\beos\thread_rwlock.c
1>Extracting  apr-1.2.7\locks\beos\thread_mutex.c
1>Extracting  apr-1.2.7\locks\beos\thread_cond.c
1>Extracting  apr-1.2.7\locks\beos\proc_mutex.c
1>Extracting  apr-1.2.7\locks\unix
1>Extracting  apr-1.2.7\locks\unix\thread_rwlock.c
1>Extracting  apr-1.2.7\locks\unix\thread_mutex.c
1>Extracting  apr-1.2.7\locks\unix\thread_cond.c
1>Extracting  apr-1.2.7\locks\unix\proc_mutex.c
1>Extracting  apr-1.2.7\locks\unix\global_mutex.c
1>Extracting  apr-1.2.7\locks\os2
1>Extracting  apr-1.2.7\locks\os2\thread_rwlock.c
1>Extracting  apr-1.2.7\locks\os2\thread_mutex.c
1>Extracting  apr-1.2.7\locks\os2\thread_cond.c
1>Extracting  apr-1.2.7\locks\os2\proc_mutex.c
1>Extracting  apr-1.2.7\threadproc
1>Extracting  apr-1.2.7\threadproc\netware
1>Extracting  apr-1.2.7\threadproc\netware\procsup.c
1>Extracting  apr-1.2.7\threadproc\netware\thread.c
1>Extracting  apr-1.2.7\threadproc\netware\signals.c
1>Extracting  apr-1.2.7\threadproc\netware\proc.c
1>Extracting  apr-1.2.7\threadproc\netware\threadpriv.c
1>Extracting  apr-1.2.7\threadproc\win32
1>Extracting  apr-1.2.7\threadproc\win32\thread.c
1>Extracting  apr-1.2.7\threadproc\win32\signals.c
1>Extracting  apr-1.2.7\threadproc\win32\proc.c
1>Extracting  apr-1.2.7\threadproc\win32\threadpriv.c
1>Extracting  apr-1.2.7\threadproc\beos
1>Extracting  apr-1.2.7\threadproc\beos\apr_proc_stub.c
1>Extracting  apr-1.2.7\threadproc\beos\thread.c
1>Extracting  apr-1.2.7\threadproc\beos\proc.c
1>Extracting  apr-1.2.7\threadproc\beos\threadpriv.c
1>Extracting  apr-1.2.7\threadproc\beos\threadproc_common.c
1>Extracting  apr-1.2.7\threadproc\unix
1>Extracting  apr-1.2.7\threadproc\unix\procsup.c
1>Extracting  apr-1.2.7\threadproc\unix\thread.c
1>Extracting  apr-1.2.7\threadproc\unix\signals.c
1>Extracting  apr-1.2.7\threadproc\unix\proc.c
1>Extracting  apr-1.2.7\threadproc\unix\threadpriv.c
1>Extracting  apr-1.2.7\threadproc\os2
1>Extracting  apr-1.2.7\threadproc\os2\thread.c
1>Extracting  apr-1.2.7\threadproc\os2\signals.c
1>Extracting  apr-1.2.7\threadproc\os2\proc.c
1>Extracting  apr-1.2.7\threadproc\os2\threadpriv.c
1>Extracting  apr-1.2.7\renames_pending
1>Extracting  apr-1.2.7\build.conf
1>Extracting  apr-1.2.7\file_io
1>Extracting  apr-1.2.7\file_io\netware
1>Extracting  apr-1.2.7\file_io\netware\filesys.c
1>Extracting  apr-1.2.7\file_io\netware\flock.c
1>Extracting  apr-1.2.7\file_io\netware\mktemp.c
1>Extracting  apr-1.2.7\file_io\netware\filepath.c
1>Extracting  apr-1.2.7\file_io\netware\pipe.c
1>Extracting  apr-1.2.7\file_io\netware\filestat.c
1>Extracting  apr-1.2.7\file_io\win32
1>Extracting  apr-1.2.7\file_io\win32\filesys.c
1>Extracting  apr-1.2.7\file_io\win32\flock.c
1>Extracting  apr-1.2.7\file_io\win32\readwrite.c
1>Extracting  apr-1.2.7\file_io\win32\seek.c
1>Extracting  apr-1.2.7\file_io\win32\dir.c
1>Extracting  apr-1.2.7\file_io\win32\filedup.c
1>Extracting  apr-1.2.7\file_io\win32\filepath.c
1>Extracting  apr-1.2.7\file_io\win32\pipe.c
1>Extracting  apr-1.2.7\file_io\win32\open.c
1>Extracting  apr-1.2.7\file_io\win32\filestat.c
1>Extracting  apr-1.2.7\file_io\unix
1>Extracting  apr-1.2.7\file_io\unix\flock.c
1>Extracting  apr-1.2.7\file_io\unix\readwrite.c
1>Extracting  apr-1.2.7\file_io\unix\filepath_util.c
1>Extracting  apr-1.2.7\file_io\unix\seek.c
1>Extracting  apr-1.2.7\file_io\unix\dir.c
1>Extracting  apr-1.2.7\file_io\unix\mktemp.c
1>Extracting  apr-1.2.7\file_io\unix\filedup.c
1>Extracting  apr-1.2.7\file_io\unix\tempdir.c
1>Extracting  apr-1.2.7\file_io\unix\filepath.c
1>Extracting  apr-1.2.7\file_io\unix\pipe.c
1>Extracting  apr-1.2.7\file_io\unix\open.c
1>Extracting  apr-1.2.7\file_io\unix\filestat.c
1>Extracting  apr-1.2.7\file_io\unix\copy.c
1>Extracting  apr-1.2.7\file_io\unix\fileacc.c
1>Extracting  apr-1.2.7\file_io\unix\fullrw.c
2>Extracting  src\xpconnect\tests\components\xpctest_attributes.cpp
2>Extracting  src\xpconnect\tests\components\xpctest_calljs.cpp
2>Extracting  src\xpconnect\tests\components\xpctest_child.cpp
2>Extracting  src\xpconnect\tests\components\xpctest_const.cpp
2>Extracting  src\xpconnect\tests\components\xpctest_domstring.cpp
2>Extracting  src\xpconnect\tests\components\xpctest_echo.cpp
2>Extracting  src\xpconnect\tests\components\xpctest_in.cpp
2>Extracting  src\xpconnect\tests\components\xpctest_inout.cpp
2>Extracting  src\xpconnect\tests\components\xpctest_module.cpp
2>Extracting  src\xpconnect\tests\components\xpctest_multiple.cpp
2>Extracting  src\xpconnect\tests\components\xpctest_noisy.cpp
2>Extracting  src\xpconnect\tests\components\xpctest_out.cpp
2>Extracting  src\xpconnect\tests\components\xpctest_overloaded.cpp
2>Extracting  src\xpconnect\tests\components\xpctest_private.h
2>Extracting  src\xpconnect\tests\components\xpctest_string.cpp
2>Extracting  src\xpconnect\tests\components\xpctest_variant.cpp
2>Extracting  src\xpconnect\tests\idispatch
2>Extracting  src\xpconnect\tests\idispatch\COM
2>Extracting  src\xpconnect\tests\idispatch\COM\nsXPCDispSimple.cpp
2>Extracting  src\xpconnect\tests\idispatch\COM\nsXPCDispSimple.h
2>Extracting  src\xpconnect\tests\idispatch\COM\nsXPCDispSimple.rgs
2>Extracting  src\xpconnect\tests\idispatch\COM\nsXPCDispTestArrays.cpp
2>Extracting  src\xpconnect\tests\idispatch\COM\nsXPCDispTestArrays.h
2>Extracting  src\xpconnect\tests\idispatch\COM\nsXPCDispTestArrays.rgs
2>Extracting  src\xpconnect\tests\idispatch\COM\nsXPCDispTestMethods.cpp
2>Extracting  src\xpconnect\tests\idispatch\COM\nsXPCDispTestMethods.h
2>Extracting  src\xpconnect\tests\idispatch\COM\nsXPCDispTestMethods.rgs
2>Extracting  src\xpconnect\tests\idispatch\COM\nsXPCDispTestNoIDispatch.cpp
2>Extracting  src\xpconnect\tests\idispatch\COM\nsXPCDispTestNoIDispatch.h
2>Extracting  src\xpconnect\tests\idispatch\COM\nsXPCDispTestNoIDispatch.rgs
2>Extracting  src\xpconnect\tests\idispatch\COM\nsXPCDispTestProperties.cpp
2>Extracting  src\xpconnect\tests\idispatch\COM\nsXPCDispTestProperties.h
2>Extracting  src\xpconnect\tests\idispatch\COM\nsXPCDispTestProperties.rgs
2>Extracting  src\xpconnect\tests\idispatch\COM\nsXPCDispTestScriptOff.cpp
2>Extracting  src\xpconnect\tests\idispatch\COM\nsXPCDispTestScriptOff.h
2>Extracting  src\xpconnect\tests\idispatch\COM\nsXPCDispTestScriptOff.rgs
2>Extracting  src\xpconnect\tests\idispatch\COM\nsXPCDispTestScriptOn.cpp
2>Extracting  src\xpconnect\tests\idispatch\COM\nsXPCDispTestScriptOn.h
2>Extracting  src\xpconnect\tests\idispatch\COM\nsXPCDispTestScriptOn.rgs
2>Extracting  src\xpconnect\tests\idispatch\COM\nsXPCDispTestWrappedJS.cpp
2>Extracting  src\xpconnect\tests\idispatch\COM\nsXPCDispTestWrappedJS.h
2>Extracting  src\xpconnect\tests\idispatch\COM\nsXPCDispTestWrappedJS.rgs
2>Extracting  src\xpconnect\tests\idispatch\COM\resource.h
2>Extracting  src\xpconnect\tests\idispatch\COM\StdAfx.cpp
2>Extracting  src\xpconnect\tests\idispatch\COM\StdAfx.h
2>Extracting  src\xpconnect\tests\idispatch\COM\XPCDispUtilities.h
2>Extracting  src\xpconnect\tests\idispatch\COM\XPCIDispatchTest.cpp
2>Extracting  src\xpconnect\tests\idispatch\COM\XPCIDispatchTest.def
2>Extracting  src\xpconnect\tests\idispatch\COM\XPCIDispatchTest.dsp
2>Extracting  src\xpconnect\tests\idispatch\COM\XPCIDispatchTest.dsw
2>Extracting  src\xpconnect\tests\idispatch\COM\XPCIDispatchTest.idl
2>Extracting  src\xpconnect\tests\idispatch\COM\XPCIDispatchTest.rc
2>Extracting  src\xpconnect\tests\idispatch\Tests
2>Extracting  src\xpconnect\tests\idispatch\Tests\exectests.cmd
2>Extracting  src\xpconnect\tests\idispatch\Tests\jsDriver.pl
2>Extracting  src\xpconnect\tests\idispatch\Tests\WrappedCOM
2>Extracting  src\xpconnect\tests\idispatch\Tests\WrappedCOM\Arrays
2>Extracting  src\xpconnect\tests\idispatch\Tests\WrappedCOM\Arrays\XPCIDispatchArrayTests.js
2>Extracting  src\xpconnect\tests\idispatch\Tests\WrappedCOM\Attributes
2>Extracting  src\xpconnect\tests\idispatch\Tests\WrappedCOM\Attributes\XPCIDispatchAttributeTests.js
2>Extracting  src\xpconnect\tests\idispatch\Tests\WrappedCOM\General
1>Extracting  apr-1.2.7\file_io\os2
1>Extracting  apr-1.2.7\file_io\os2\dir_make_recurse.c
1>Extracting  apr-1.2.7\file_io\os2\filesys.c
1>Extracting  apr-1.2.7\file_io\os2\flock.c
1>Extracting  apr-1.2.7\file_io\os2\readwrite.c
1>Extracting  apr-1.2.7\file_io\os2\filepath_util.c
1>Extracting  apr-1.2.7\file_io\os2\seek.c
1>Extracting  apr-1.2.7\file_io\os2\dir.c
1>Extracting  apr-1.2.7\file_io\os2\mktemp.c
1>Extracting  apr-1.2.7\file_io\os2\filedup.c
1>Extracting  apr-1.2.7\file_io\os2\tempdir.c
1>Extracting  apr-1.2.7\file_io\os2\maperrorcode.c
1>Extracting  apr-1.2.7\file_io\os2\filepath.c
1>Extracting  apr-1.2.7\file_io\os2\pipe.c
1>Extracting  apr-1.2.7\file_io\os2\open.c
1>Extracting  apr-1.2.7\file_io\os2\filestat.c
1>Extracting  apr-1.2.7\file_io\os2\copy.c
1>Extracting  apr-1.2.7\file_io\os2\fileacc.c
1>Extracting  apr-1.2.7\file_io\os2\fullrw.c
1>Extracting  apr-1.2.7\network_io
1>Extracting  apr-1.2.7\network_io\win32
1>Extracting  apr-1.2.7\network_io\win32\sockopt.c
1>Extracting  apr-1.2.7\network_io\win32\sendrecv.c
1>Extracting  apr-1.2.7\network_io\win32\sockets.c
1>Extracting  apr-1.2.7\network_io\beos
1>Extracting  apr-1.2.7\network_io\beos\socketcommon.c
1>Extracting  apr-1.2.7\network_io\beos\sendrecv.c
1>Extracting  apr-1.2.7\network_io\unix
1>Extracting  apr-1.2.7\network_io\unix\sockaddr.c
1>Extracting  apr-1.2.7\network_io\unix\sockopt.c
1>Extracting  apr-1.2.7\network_io\unix\sendrecv.c
1>Extracting  apr-1.2.7\network_io\unix\multicast.c
1>Extracting  apr-1.2.7\network_io\unix\sockets.c
1>Extracting  apr-1.2.7\network_io\unix\inet_ntop.c
1>Extracting  apr-1.2.7\network_io\unix\inet_pton.c
1>Extracting  apr-1.2.7\network_io\os2
1>Extracting  apr-1.2.7\network_io\os2\sockaddr.c
1>Extracting  apr-1.2.7\network_io\os2\sockopt.c
1>Extracting  apr-1.2.7\network_io\os2\sendrecv_udp.c
1>Extracting  apr-1.2.7\network_io\os2\sendrecv.c
1>Extracting  apr-1.2.7\network_io\os2\os2calls.c
1>Extracting  apr-1.2.7\network_io\os2\sockets.c
1>Extracting  apr-1.2.7\network_io\os2\inet_ntop.c
1>Extracting  apr-1.2.7\network_io\os2\inet_pton.c
1>Extracting  apr-1.2.7\time
1>Extracting  apr-1.2.7\time\win32
1>Extracting  apr-1.2.7\time\win32\access.c
1>Extracting  apr-1.2.7\time\win32\time.c
1>Extracting  apr-1.2.7\time\win32\timestr.c
1>Extracting  apr-1.2.7\time\unix
1>Extracting  apr-1.2.7\time\unix\time.c
1>Extracting  apr-1.2.7\time\unix\timestr.c
1>Extracting  apr-1.2.7\configure
1>Extracting  apr-1.2.7\CHANGES
1>Extracting  apr-1.2.7\NWGNUmakefile
1>Extracting  apr-1.2.7\apr.spec
1>Extracting  apr-1.2.7\dso
1>Extracting  apr-1.2.7\dso\netware
1>Extracting  apr-1.2.7\dso\netware\dso.c
1>Extracting  apr-1.2.7\dso\win32
1>Extracting  apr-1.2.7\dso\win32\dso.c
1>Extracting  apr-1.2.7\dso\beos
1>Extracting  apr-1.2.7\dso\beos\dso.c
1>Extracting  apr-1.2.7\dso\os390
1>Extracting  apr-1.2.7\dso\os390\dso.c
1>Extracting  apr-1.2.7\dso\unix
1>Extracting  apr-1.2.7\dso\unix\dso.c
1>Extracting  apr-1.2.7\dso\aix
1>Extracting  apr-1.2.7\dso\aix\dso.c
1>Extracting  apr-1.2.7\dso\os2
1>Extracting  apr-1.2.7\dso\os2\dso.c
1>Extracting  apr-1.2.7\LICENSE
1>Extracting  apr-1.2.7\Makefile.in
1>Extracting  apr-1.2.7\config.layout
1>Extracting  apr-1.2.7\libaprnw.mcp.zip
1>Everything is Ok
2>Extracting  src\xpconnect\tests\idispatch\Tests\WrappedCOM\General\XPCIDispatchInstantiations.js
2>Extracting  src\xpconnect\tests\idispatch\Tests\WrappedCOM\General\XPCStress.js
2>Extracting  src\xpconnect\tests\idispatch\Tests\WrappedCOM\Methods
2>Extracting  src\xpconnect\tests\idispatch\Tests\WrappedCOM\Methods\XPCIDispatchMethodTests.js
2>Extracting  src\xpconnect\tests\idispatch\Tests\WrappedCOM\shell.js
2>Extracting  src\xpconnect\tests\idispatch\Tests\WrappedJS
2>Extracting  src\xpconnect\tests\idispatch\Tests\WrappedJS\General
2>Extracting  src\xpconnect\tests\idispatch\Tests\WrappedJS\General\XPCIDispatchTestWrappedJS.js
2>Extracting  src\xpconnect\tests\idispatch\Tests\WrappedJS\shell.js
2>Extracting  src\xpconnect\tests\idl
2>Extracting  src\xpconnect\tests\idl\Makefile.in
2>Extracting  src\xpconnect\tests\idl\xpctest.idl
2>Extracting  src\xpconnect\tests\idl\xpctest2.idl
2>Extracting  src\xpconnect\tests\idl\xpctest_attributes.idl
2>Extracting  src\xpconnect\tests\idl\xpctest_calljs.idl
2>Extracting  src\xpconnect\tests\idl\xpctest_const.idl
2>Extracting  src\xpconnect\tests\idl\xpctest_domstring.idl
2>Extracting  src\xpconnect\tests\idl\xpctest_in.idl
2>Extracting  src\xpconnect\tests\idl\xpctest_inout.idl
2>Extracting  src\xpconnect\tests\idl\xpctest_multiple.idl
2>Extracting  src\xpconnect\tests\idl\xpctest_out.idl
2>Extracting  src\xpconnect\tests\js
2>Extracting  src\xpconnect\tests\js\checkid.js
2>Extracting  src\xpconnect\tests\js\evaluate.js
2>Extracting  src\xpconnect\tests\js\exceptions-2.js
2>Extracting  src\xpconnect\tests\js\exceptions-3.js
2>Extracting  src\xpconnect\tests\js\exceptions-4.js
2>Extracting  src\xpconnect\tests\js\exceptions-5.js
2>Extracting  src\xpconnect\tests\js\exceptions.js
2>Extracting  src\xpconnect\tests\js\javascript.js
2>Extracting  src\xpconnect\tests\js\multiple-2.js
2>Extracting  src\xpconnect\tests\js\multiple-3.js
2>Extracting  src\xpconnect\tests\js\multiple-4.js
2>Extracting  src\xpconnect\tests\js\multiple.js
2>Extracting  src\xpconnect\tests\js\notscriptable.js
2>Extracting  src\xpconnect\tests\js\old
2>Extracting  src\xpconnect\tests\js\old\simpletest.js
2>Extracting  src\xpconnect\tests\js\old\speed.js
2>Extracting  src\xpconnect\tests\js\old\testxpc.js
2>Extracting  src\xpconnect\tests\js\old\threads.js
2>Extracting  src\xpconnect\tests\js\old\try.js
2>Extracting  src\xpconnect\tests\js\old\xpctest_array.js
2>Extracting  src\xpconnect\tests\js\old\xpctest_callcontext.js
2>Extracting  src\xpconnect\tests\js\old\xpctest_echo.js
2>Extracting  src\xpconnect\tests\js\old\xpctest_enum_and_sort.js
2>Extracting  src\xpconnect\tests\js\old\xpctest_enum_constants.js
2>Extracting  src\xpconnect\tests\js\old\xpctest_enum_create.js
2>Extracting  src\xpconnect\tests\js\old\xpctest_exceptions.js
2>Extracting  src\xpconnect\tests\js\old\xpctest_ids.js
2>Extracting  src\xpconnect\tests\js\old\xpctest_observer.js
2>Extracting  src\xpconnect\tests\js\old\xpctest_overloaded.js
2>Extracting  src\xpconnect\tests\js\old\xpctest_primitives.js
2>Extracting  src\xpconnect\tests\js\old\xpctest_propertybag.js
2>Extracting  src\xpconnect\tests\js\old\xpctest_variant.js
2>Extracting  src\xpconnect\tests\js\old\xpctest_variant_array.js
2>Extracting  src\xpconnect\tests\js\readonlyattributes.js
2>Extracting  src\xpconnect\tests\js\readwriteattributes.js
2>Extracting  src\xpconnect\tests\js\scriptable.js
2>Extracting  src\xpconnect\tests\js\testin.js
2>Extracting  src\xpconnect\tests\js\xpcfun.js
2>Extracting  src\xpconnect\tests\js\xpctest_primitives.js
2>Extracting  src\xpconnect\tests\Makefile.in
2>Extracting  src\xpconnect\tests\TestXPC.cpp
2>Extracting  src\xpconnect\tools
2>Extracting  src\xpconnect\tools\idl
2>Extracting  src\xpconnect\tools\idl\Makefile.in
2>Extracting  src\xpconnect\tools\idl\nsIXPCToolsCompiler.idl
2>Extracting  src\xpconnect\tools\idl\nsIXPCToolsProfiler.idl
2>Extracting  src\xpconnect\tools\js
2>Extracting  src\xpconnect\tools\js\CompileJSFiles.js
2>Extracting  src\xpconnect\tools\js\ListJSFiles.js
2>Extracting  src\xpconnect\tools\Makefile.in
2>Extracting  src\xpconnect\tools\src
2>Extracting  src\xpconnect\tools\src\Makefile.in
2>Extracting  src\xpconnect\tools\src\nsXPCToolsCompiler.cpp
2>Extracting  src\xpconnect\tools\src\nsXPCToolsModule.cpp
2>Extracting  src\xpconnect\tools\src\nsXPCToolsProfiler.cpp
2>Extracting  src\xpconnect\tools\src\xpctools_private.h
2>Extracting  src\xpconnect\typelib
2>Extracting  src\Y.js
2>Everything is Ok
1>Build log was saved at "file://c:\FreeSwitch\libs\win32\Debug\BuildLog Download APR.htm"
2>Build log was saved at "file://c:\FreeSwitch\libs\win32\Debug\BuildLog Download SPIDERMONKEY.htm"
2>Download SPIDERMONKEY - 0 error(s), 0 warning(s)
1>Download APR - 0 error(s), 0 warning(s)
3>------ Build started: Project: libapr, Configuration: Debug Win32 ------
4>------ Build started: Project: fdlibm, Configuration: Debug Win32 ------
4>Compiling...
3>Performing Pre-Build Event...
4>w_sqrt.c
3>C:\FreeSwitch\libs\win32\apr\..\..\apr-1.2.7\include\apr.h
3>C:\FreeSwitch\libs\win32\apr\..\..\apr-1.2.7\include\apr_allocator.h
3>C:\FreeSwitch\libs\win32\apr\..\..\apr-1.2.7\include\apr_atomic.h
3>C:\FreeSwitch\libs\win32\apr\..\..\apr-1.2.7\include\apr_dso.h
3>C:\FreeSwitch\libs\win32\apr\..\..\apr-1.2.7\include\apr_env.h
3>C:\FreeSwitch\libs\win32\apr\..\..\apr-1.2.7\include\apr_errno.h
3>C:\FreeSwitch\libs\win32\apr\..\..\apr-1.2.7\include\apr_file_info.h
3>C:\FreeSwitch\libs\win32\apr\..\..\apr-1.2.7\include\apr_file_io.h
3>C:\FreeSwitch\libs\win32\apr\..\..\apr-1.2.7\include\apr_fnmatch.h
3>C:\FreeSwitch\libs\win32\apr\..\..\apr-1.2.7\include\apr_general.h
3>C:\FreeSwitch\libs\win32\apr\..\..\apr-1.2.7\include\apr_getopt.h
3>C:\FreeSwitch\libs\win32\apr\..\..\apr-1.2.7\include\apr_global_mutex.h
3>C:\FreeSwitch\libs\win32\apr\..\..\apr-1.2.7\include\apr_hash.h
3>C:\FreeSwitch\libs\win32\apr\..\..\apr-1.2.7\include\apr_inherit.h
3>C:\FreeSwitch\libs\win32\apr\..\..\apr-1.2.7\include\apr_lib.h
3>C:\FreeSwitch\libs\win32\apr\..\..\apr-1.2.7\include\apr_mmap.h
3>C:\FreeSwitch\libs\win32\apr\..\..\apr-1.2.7\include\apr_network_io.h
3>C:\FreeSwitch\libs\win32\apr\..\..\apr-1.2.7\include\apr_poll.h
3>C:\FreeSwitch\libs\win32\apr\..\..\apr-1.2.7\include\apr_pools.h
3>C:\FreeSwitch\libs\win32\apr\..\..\apr-1.2.7\include\apr_portable.h
3>C:\FreeSwitch\libs\win32\apr\..\..\apr-1.2.7\include\apr_proc_mutex.h
3>C:\FreeSwitch\libs\win32\apr\..\..\apr-1.2.7\include\apr_random.h
3>C:\FreeSwitch\libs\win32\apr\..\..\apr-1.2.7\include\apr_ring.h
3>C:\FreeSwitch\libs\win32\apr\..\..\apr-1.2.7\include\apr_shm.h
3>C:\FreeSwitch\libs\win32\apr\..\..\apr-1.2.7\include\apr_signal.h
3>C:\FreeSwitch\libs\win32\apr\..\..\apr-1.2.7\include\apr_strings.h
3>C:\FreeSwitch\libs\win32\apr\..\..\apr-1.2.7\include\apr_support.h
3>C:\FreeSwitch\libs\win32\apr\..\..\apr-1.2.7\include\apr_tables.h
3>C:\FreeSwitch\libs\win32\apr\..\..\apr-1.2.7\include\apr_thread_cond.h
3>C:\FreeSwitch\libs\win32\apr\..\..\apr-1.2.7\include\apr_thread_mutex.h
3>C:\FreeSwitch\libs\win32\apr\..\..\apr-1.2.7\include\apr_thread_proc.h
3>C:\FreeSwitch\libs\win32\apr\..\..\apr-1.2.7\include\apr_thread_rwlock.h
3>C:\FreeSwitch\libs\win32\apr\..\..\apr-1.2.7\include\apr_time.h
3>C:\FreeSwitch\libs\win32\apr\..\..\apr-1.2.7\include\apr_user.h
3>C:\FreeSwitch\libs\win32\apr\..\..\apr-1.2.7\include\apr_version.h
3>C:\FreeSwitch\libs\win32\apr\..\..\apr-1.2.7\include\apr_want.h
3>36 File(s) copied
4>w_pow.c
4>w_atan2.c
4>s_scalbn.c
3>Compiling...
4>s_rint.c
4>s_matherr.c
4>s_isnan.c
4>s_finite.c
3>userinfo.c
4>s_fabs.c
4>s_copysign.c
4>s_atan.c
4>k_standard.c
4>e_sqrt.c
4>e_pow.c
4>e_atan2.c
4>Generating Code...
4>Creating library...
4>Build log was saved at "file://c:\FreeSwitch\libs\win32\js\Debug\BuildLog.htm"
4>fdlibm - 0 error(s), 0 warning(s)
3>groupinfo.c
3>timestr.c
3>time.c
3>access.c
5>------ Build started: Project: libdingaling, Configuration: Debug Win32 ------
5>Compiling...
5>libdingaling.c
3>threadpriv.c
5>Creating library...
3>thread.c
5>Build log was saved at "file://c:\FreeSwitch\libs\libdingaling\Debug\BuildLog.htm"
5>libdingaling - 0 error(s), 0 warning(s)
3>signals.c
3>proc.c
6>------ Build started: Project: js, Configuration: Debug Win32 ------
6>js : warning PRJ0009 : Build log could not be opened for writing.
6>Make sure that the file is not open by another process and is not write-protected.
3>apr_tables.c
6>Compiling...
6>jsapi.c
3>apr_hash.c
3>apr_strtok.c
3>apr_strnatcmp.c
3>apr_strings.c
6>jsarena.c
6>jsarray.c
3>apr_snprintf.c
6>jsatom.c
6>jsbool.c
6>jscntxt.c
3>apr_fnmatch.c
6>jsdate.c
6>jsdbgapi.c
3>apr_cpystrn.c
6>jsdhash.c
6>jsdtoa.c
6>jsemit.c
3>shm.c
6>jsexn.c
6>jsfun.c
6>jsgc.c
6>jshash.c
6>jsinterp.c
3>sha2_glue.c
3>sha2.c
6>jslock.c
6>jslog2.c
6>jslong.c
6>jsmath.c
3>Generating Code...
6>Generating Code...
3>Compiling...
3>apr_random.c
3>apr_getpass.c
3>sockopt.c
6>Compiling...
6>jsnum.c
3>sockets.c
6>jsobj.c
6>jsopcode.c
3>sockaddr.c
6>jsparse.c
6>jsprf.c
3>sendrecv.c
6>jsregexp.c
6>jsscan.c
6>jsscope.c
6>jsscript.c
3>select.c
6>jsstr.c
6>jsutil.c
3>multicast.c
3>inet_pton.c
6>jsxdrapi.c
6>jsxml.c
3>inet_ntop.c
6>prmjtime.c
6>..\..\js20051231\src\prmjtime.c(104) : warning C4244: 'return' : conversion from 'time_t' to 'JSInt32', possible loss of data
6>Generating Code...
3>mmap.c
3>common.c
3>version.c
6>Linking...
3>utf8.c
3>start.c
6>   Creating library .\Debug/js32.lib and object .\Debug/js32.exp
6>Embedding manifest...
3>rand.c
6>Performing Post-Build Event...
3>otherchild.c
6>C:\FreeSwitch\libs\win32\js\..\..\nspr-4.6.1.winnt5.debug\nspr-4.6.1\lib\libnspr4.dll
3>misc.c
6>1 File(s) copied
6>C:\FreeSwitch\libs\win32\js\..\..\nspr-4.6.1.winnt5.debug\nspr-4.6.1\lib\libplc4.dll
6>1 File(s) copied
3>internal.c
6>C:\FreeSwitch\libs\win32\js\..\..\nspr-4.6.1.winnt5.debug\nspr-4.6.1\lib\libplds4.dll
6>1 File(s) copied
6>Build log was saved at "file://c:\FreeSwitch\libs\win32\js\Debug\BuildLog.htm"
6>js - 0 error(s), 2 warning(s)
3>getopt.c
3>Generating Code...
3>Compiling...
3>errorcodes.c
3>env.c
3>charset.c
7>------ Skipped Build: Project: docs (Docs\docs), Configuration: Debug Win32 ------
7>Project not selected to build for this solution configuration 
8>------ Skipped Build: Project: FreeSwitch.NET, Configuration: Debug Any CPU ------
8>Project not selected to build for this solution configuration 
3>apr_pools.c
3>thread_rwlock.c
3>thread_mutex.c
3>thread_cond.c
3>proc_mutex.c
3>tempdir.c
3>seek.c
3>readwrite.c
3>pipe.c
3>open.c
3>mktemp.c
3>fullrw.c
3>flock.c
3>filesys.c
3>filestat.c
3>filepath_util.c
3>filepath.c
3>Generating Code...
3>Compiling...
3>filedup.c
3>fileacc.c
3>dir.c
3>copy.c
3>dso.c
3>apr_atomic.c
3>Generating Code...
3>Compiling resources...
3>Linking...
3>   Creating library .\Debug/libapr-1.lib and object .\Debug/libapr-1.exp
3>Embedding manifest...
3>Build log was saved at "file://c:\FreeSwitch\libs\win32\apr\Debug\BuildLog.htm"
3>libapr - 0 error(s), 0 warning(s)
9>------ Build started: Project: libapriconv, Configuration: Debug Win32 ------
9>Performing Pre-Build Event...
9>0 File(s) copied
9>Compiling...
9>iconv_uc.c
9>iconv_module.c
9>iconv_int.c
9>iconv_ces_iso2022.c
9>iconv_ces_euc.c
9>iconv_ces.c
9>iconv.c
9>Generating Code...
9>Compiling resources...
9>Linking...
9>   Creating library .\Debug/libapriconv-1.lib and object .\Debug/libapriconv-1.exp
9>Embedding manifest...
9>Build log was saved at "file://c:\FreeSwitch\libs\win32\apr-iconv\Debug\BuildLog.htm"
9>libapriconv - 0 error(s), 0 warning(s)
10>------ Build started: Project: libaprutil, Configuration: Debug Win32 ------
10>Performing Pre-Build Event...
10>0 File(s) copied
10>Compiling...
10>xlate.c
10>apr_uri.c
10>apr_strmatch.c
10>sdbm_pair.c
10>sdbm_lock.c
10>sdbm_hash.c
10>sdbm.c
10>apr_rmm.c
10>apr_reslist.c
10>apr_queue.c
10>apr_date.c
10>apr_ldap_url.c
10>apr_ldap_option.c
10>apr_ldap_init.c
10>apr_hooks.c
10>apr_base64.c
10>apr_dbm_sdbm.c
10>apr_dbm_gdbm.c
10>apr_dbm_berkeleydb.c
10>apr_dbm.c
10>Generating Code...
10>Compiling...
10>apr_dbd.c
10>uuid.c
10>getuuid.c
10>apr_sha1.c
10>apr_md5.c
10>apr_md4.c
10>apr_buckets_socket.c
10>apr_buckets_simple.c
10>apr_buckets_refcount.c
10>apr_buckets_pool.c
10>apr_buckets_pipe.c
10>apr_buckets_mmap.c
10>apr_buckets_heap.c
10>apr_buckets_flush.c
10>apr_buckets_file.c
10>apr_buckets_eos.c
10>apr_buckets_alloc.c
10>apr_buckets.c
10>apr_brigade.c
10>Generating Code...
10>Compiling resources...
10>Linking...
10>   Creating library .\Debug/libaprutil-1.lib and object .\Debug/libaprutil-1.exp
10>Embedding manifest...
10>Performing Post-Build Event...
10>Build log was saved at "file://c:\FreeSwitch\libs\win32\apr-util\Debug\BuildLog.htm"
10>libaprutil - 0 error(s), 0 warning(s)
11>------ Build started: Project: FreeSwitchCoreLib, Configuration: Debug Win32 ------
11>Compiling...
11>switch_buffer.c
11>Compiling...
11>switch_caller.c
11>switch_channel.c
11>switch_config.c
11>switch_console.c
11>switch_core.c
11>switch_event.c
11>switch_ivr.c
11>switch_loadable_module.c
11>switch_log.c
11>switch_resample.c
11>switch_rtp.c
11>switch_stun.c
11>switch_utils.c
11>switch_xml.c
11>Generating Code...
11>Linking...
11>   Creating library Debug/FreeSwitchCore.lib and object Debug/FreeSwitchCore.exp
11>Embedding manifest...
11>Performing Post-Build Event...
11>C:\FreeSwitch\conf\freeswitch.xml
11>1 File(s) copied
11>Build log was saved at "file://c:\FreeSwitch\w32\Library\Debug\BuildLog FreeSwitchCoreLib.htm"
11>FreeSwitchCoreLib - 0 error(s), 0 warning(s)
12>------ Build started: Project: mod_event_test, Configuration: Debug Win32 ------
13>------ Build started: Project: mod_bridgecall, Configuration: Debug Win32 ------
12>Compiling...
13>Compiling...
13>mod_bridgecall.c
12>mod_event_test.c
12>Linking...
13>Linking...
12>   Creating library Debug/mod_event_test.lib and object Debug/mod_event_test.exp
13>   Creating library Debug/mod_bridgecall.lib and object Debug/mod_bridgecall.exp
12>Embedding manifest...
13>Embedding manifest...
12>Build log was saved at "file://c:\FreeSwitch\src\mod\event_handlers\mod_event_test\Debug\BuildLog.htm"
12>mod_event_test - 0 error(s), 0 warning(s)
14>------ Build started: Project: mod_sndfile, Configuration: Debug Win32 ------
14>Compiling...
13>Build log was saved at "file://c:\FreeSwitch\src\mod\applications\mod_bridgecall\Debug\BuildLog.htm"
13>mod_bridgecall - 0 error(s), 0 warning(s)
14>mod_sndfile.c
15>------ Build started: Project: mod_xmpp_event, Configuration: Debug Win32 ------
15>Compiling...
15>mod_xmpp_event.c
14>Linking...
14>   Creating library Debug/mod_sndfile.lib and object Debug/mod_sndfile.exp
15>Linking...
14>Embedding manifest...
15>   Creating library Debug/mod_xmpp_event.lib and object Debug/mod_xmpp_event.exp
15>Embedding manifest...
14>Build log was saved at "file://c:\FreeSwitch\src\mod\formats\mod_sndfile\Debug\BuildLog.htm"
14>mod_sndfile - 0 error(s), 0 warning(s)
15>Build log was saved at "file://c:\FreeSwitch\src\mod\event_handlers\mod_xmpp_event\Debug\BuildLog.htm"
15>mod_xmpp_event - 0 error(s), 0 warning(s)
16>------ Build started: Project: mod_gsm, Configuration: Debug Win32 ------
16>Compiling...
16>mod_gsm.c
17>------ Build started: Project: FreeSwitchConsole, Configuration: Debug Win32 ------
17>Compiling...
17>switch.c
16>Linking...
16>   Creating library Debug/mod_gsm.lib and object Debug/mod_gsm.exp
17>Linking...
16>Embedding manifest...
17>Embedding manifest...
16>Build log was saved at "file://c:\FreeSwitch\src\mod\codecs\mod_gsm\Debug\BuildLog.htm"
16>mod_gsm - 0 error(s), 0 warning(s)
17>Build log was saved at "file://c:\FreeSwitch\w32\Console\Debug\BuildLog FreeSwitchConsole.htm"
17>FreeSwitchConsole - 0 error(s), 0 warning(s)
18>------ Build started: Project: mod_g711, Configuration: Debug Win32 ------
19>------ Build started: Project: mod_iax, Configuration: Debug Win32 ------
19>Compiling...
18>Compiling...
18>mod_g711.c
19>mod_iax.c
18>Linking...
19>Linking...
18>   Creating library Debug/mod_g711.lib and object Debug/mod_g711.exp
19>   Creating library Debug/mod_iax.lib and object Debug/mod_iax.exp
19>Embedding manifest...
18>Embedding manifest...
19>Build log was saved at "file://c:\FreeSwitch\src\mod\endpoints\mod_iax\Debug\BuildLog.htm"
19>mod_iax - 0 error(s), 0 warning(s)
20>------ Build started: Project: mod_playback, Configuration: Debug Win32 ------
20>Compiling...
18>Build log was saved at "file://c:\FreeSwitch\src\mod\codecs\mod_g711\Debug\BuildLog.htm"
18>mod_g711 - 0 error(s), 0 warning(s)
20>mod_playback.c
21>------ Build started: Project: mod_dptools, Configuration: Debug Win32 ------
21>Compiling...
21>mod_dptools.c
20>Linking...
20>   Creating library Debug/mod_playback.lib and object Debug/mod_playback.exp
21>Linking...
21>   Creating library Debug/mod_dptools.lib and object Debug/mod_dptools.exp
20>Embedding manifest...
21>Embedding manifest...
20>Build log was saved at "file://c:\FreeSwitch\src\mod\applications\mod_playback\Debug\BuildLog.htm"
20>mod_playback - 0 error(s), 0 warning(s)
22>------ Build started: Project: mod_conference, Configuration: Debug Win32 ------
22>Compiling...
21>Build log was saved at "file://c:\FreeSwitch\src\mod\applications\mod_dptools\Debug\BuildLog.htm"
21>mod_dptools - 0 error(s), 0 warning(s)
22>mod_conference.c
23>------ Build started: Project: mod_rss, Configuration: Debug Win32 ------
23>Compiling...
23>mod_rss.c
22>Linking...
22>   Creating library Debug/mod_conference.lib and object Debug/mod_conference.exp
23>Linking...
22>Embedding manifest...
23>   Creating library Debug/mod_rss.lib and object Debug/mod_rss.exp
22>Build log was saved at "file://c:\FreeSwitch\src\mod\applications\mod_conference\Debug\BuildLog.htm"
22>mod_conference - 0 error(s), 0 warning(s)
23>Embedding manifest...
24>------ Build started: Project: mod_xml_rpc, Configuration: Debug Win32 ------
24>Compiling...
24>mod_xml_rpc.c
23>Build log was saved at "file://c:\FreeSwitch\src\mod\applications\mod_rss\Debug\BuildLog.htm"
23>mod_rss - 0 error(s), 0 warning(s)
25>------ Build started: Project: mod_PortAudio, Configuration: Debug Win32 ------
25>Compiling...
25>mod_portaudio.c
24>Linking...
24>   Creating library Debug/mod_xml_rpc.lib and object Debug/mod_xml_rpc.exp
25>Linking...
25>   Creating library Debug/mod_PortAudio.lib and object Debug/mod_PortAudio.exp
24>Embedding manifest...
25>Embedding manifest...
24>Build log was saved at "file://c:\FreeSwitch\src\mod\xml_int\mod_xml_rpc\Debug\BuildLog.htm"
24>mod_xml_rpc - 0 error(s), 0 warning(s)
25>Build log was saved at "file://c:\FreeSwitch\src\mod\endpoints\mod_portaudio\Debug\BuildLog.htm"
25>mod_PortAudio - 0 error(s), 0 warning(s)
26>------ Build started: Project: mod_console, Configuration: Debug Win32 ------
26>Compiling...
26>mod_console.c
27>------ Build started: Project: mod_l16, Configuration: Debug Win32 ------
27>Compiling...
27>mod_l16.c
26>Linking...
26>   Creating library Debug/mod_console.lib and object Debug/mod_console.exp
27>Linking...
26>Embedding manifest...
27>   Creating library Debug/mod_l16.lib and object Debug/mod_l16.exp
26>Build log was saved at "file://c:\FreeSwitch\src\mod\loggers\mod_console\Debug\BuildLog.htm"
26>mod_console - 0 error(s), 0 warning(s)
28>------ Build started: Project: mod_commands, Configuration: Debug Win32 ------
28>Compiling...
27>Embedding manifest...
28>mod_commands.c
27>Build log was saved at "file://c:\FreeSwitch\src\mod\codecs\mod_l16\Debug\BuildLog.htm"
27>mod_l16 - 0 error(s), 0 warning(s)
29>------ Build started: Project: mod_dingaling, Configuration: Debug Win32 ------
29>Compiling...
29>mod_dingaling.c
28>Linking...
28>   Creating library Debug/mod_commands.lib and object Debug/mod_commands.exp
28>Embedding manifest...
29>Linking...
28>Build log was saved at "file://c:\FreeSwitch\src\mod\applications\mod_commands\Debug\BuildLog.htm"
28>mod_commands - 0 error(s), 0 warning(s)
29>   Creating library Debug/mod_dingaling.lib and object Debug/mod_dingaling.exp
30>------ Build started: Project: mod_ilbc, Configuration: Debug Win32 ------
29>Embedding manifest...
30>Compiling...
30>mod_ilbc.c
29>Build log was saved at "file://c:\FreeSwitch\src\mod\endpoints\mod_dingaling\Debug\BuildLog.htm"
29>mod_dingaling - 0 error(s), 0 warning(s)
31>------ Build started: Project: mod_echo, Configuration: Debug Win32 ------
31>Compiling...
30>Linking...
31>mod_echo.c
30>   Creating library Debug/mod_ilbc.lib and object Debug/mod_ilbc.exp
30>Embedding manifest...
30>Build log was saved at "file://c:\FreeSwitch\src\mod\codecs\mod_ilbc\Debug\BuildLog.htm"
30>mod_ilbc - 0 error(s), 0 warning(s)
31>Linking...
31>   Creating library Debug/mod_echo.lib and object Debug/mod_echo.exp
31>Embedding manifest...
32>------ Build started: Project: mod_softtimer, Configuration: Debug Win32 ------
32>Compiling...
32>mod_softtimer.c
31>Build log was saved at "file://c:\FreeSwitch\src\mod\applications\mod_echo\Debug\BuildLog.htm"
31>mod_echo - 0 error(s), 0 warning(s)
33>------ Build started: Project: mod_speex, Configuration: Debug Win32 ------
33>Compiling...
32>Linking...
33>mod_speex.c
32>   Creating library Debug/mod_softtimer.lib and object Debug/mod_softtimer.exp
32>Embedding manifest...
33>Linking...
32>Build log was saved at "file://c:\FreeSwitch\src\mod\timers\mod_softtimer\Debug\BuildLog.htm"
32>mod_softtimer - 0 error(s), 0 warning(s)
33>   Creating library Debug/mod_speex.lib and object Debug/mod_speex.exp
33>Embedding manifest...
34>------ Build started: Project: mod_woomera, Configuration: Debug Win32 ------
34>Compiling...
33>Build log was saved at "file://c:\FreeSwitch\src\mod\codecs\mod_speex\Debug\BuildLog.htm"
33>mod_speex - 0 error(s), 0 warning(s)
34>mod_woomera.c
35>------ Build started: Project: mod_dialplan_xml, Configuration: Debug Win32 ------
35>Compiling...
34>Linking...
35>mod_dialplan_xml.c
34>   Creating library Debug/mod_woomera.lib and object Debug/mod_woomera.exp
34>Embedding manifest...
35>Linking...
34>Build log was saved at "file://c:\FreeSwitch\src\mod\endpoints\mod_woomera\Debug\BuildLog.htm"
34>mod_woomera - 0 error(s), 0 warning(s)
35>   Creating library Debug/mod_dialplan_xml.lib and object Debug/mod_dialplan_xml.exp
36>------ Build started: Project: mod_spidermonkey, Configuration: Debug Win32 ------
35>Embedding manifest...
36>Compiling...
36>mod_spidermonkey.c
35>Build log was saved at "file://c:\FreeSwitch\src\mod\dialplans\mod_dialplan_xml\Debug\BuildLog.htm"
35>mod_dialplan_xml - 0 error(s), 0 warning(s)
37>------ Build started: Project: mod_ldap, Configuration: Debug MS-LDAP Win32 ------
37>Compiling...
36>Linking...
37>mod_ldap.c
36>   Creating library Debug/mod_spidermonkey.lib and object Debug/mod_spidermonkey.exp
36>Embedding manifest...
37>Linking...
36>Build log was saved at "file://c:\FreeSwitch\src\mod\languages\mod_spidermonkey\Debug\BuildLog.htm"
36>mod_spidermonkey - 0 error(s), 0 warning(s)
37>   Creating library Debug/mod_ldap.lib and object Debug/mod_ldap.exp
38>------ Build started: Project: mod_exosip, Configuration: Debug Win32 ------
38>Compiling...
38>mod_exosip.c
37>Embedding manifest...
37>Build log was saved at "file://c:\FreeSwitch\src\mod\directories\mod_ldap\Debug MS-LDAP\BuildLog.htm"
37>mod_ldap - 0 error(s), 0 warning(s)
38>Compiling...
39>------ Build started: Project: mod_event_multicast, Configuration: Debug Win32 ------
39>Compiling...
38>osip_rfc3264.c
39>mod_event_multicast.c
38>Linking...
39>Linking...
39>   Creating library Debug/mod_event_multicast.lib and object Debug/mod_event_multicast.exp
39>mod_event_multicast.obj : error LNK2019: unresolved external symbol __imp__gethostname@8 referenced in function _load_config
39>C:\FreeSwitch\Debug/mod/mod_event_multicast.dll : fatal error LNK1120: 1 unresolved externals
39>Build log was saved at "file://c:\FreeSwitch\src\mod\event_handlers\mod_event_multicast\Debug\BuildLog.htm"
39>mod_event_multicast - 2 error(s), 0 warning(s)
38>   Creating library Debug/mod_exosip.lib and object Debug/mod_exosip.exp
40>------ Build started: Project: mod_zeroconf, Configuration: Debug Win32 ------
40>Compiling...
40>mod_zeroconf.c
38>Embedding manifest...
38>Build log was saved at "file://c:\FreeSwitch\src\mod\endpoints\mod_exosip\Debug\BuildLog.htm"
38>mod_exosip - 0 error(s), 0 warning(s)
40>Linking...
41>------ Build started: Project: mod_dialplan_directory, Configuration: Debug Win32 ------
41>Compiling...
41>mod_dialplan_directory.c
40>   Creating library Debug/mod_zeroconf.lib and object Debug/mod_zeroconf.exp
41>Linking...
40>Embedding manifest...
41>   Creating library Debug/mod_dialplan_directory.lib and object Debug/mod_dialplan_directory.exp
41>Embedding manifest...
40>Build log was saved at "file://c:\FreeSwitch\src\mod\event_handlers\mod_zeroconf\Debug\BuildLog.htm"
40>mod_zeroconf - 0 error(s), 0 warning(s)
41>Build log was saved at "file://c:\FreeSwitch\src\mod\dialplans\mod_dialplan_directory\Debug\BuildLog.htm"
41>mod_dialplan_directory - 0 error(s), 0 warning(s)
42>------ Skipped Build: Project: FreeSwitchSetup, Configuration: Debug ------
42>Project not selected to build for this solution configuration 
43>------ Skipped Build: Project: mod_cepstral, Configuration: Debug Win32 ------
43>Project not selected to build for this solution configuration 
44>------ Skipped Build: Project: fs_perl, Configuration: Debug Win32 ------
44>Project not selected to build for this solution configuration 
45>------ Build started: Project: mod_ivrtest, Configuration: Debug Win32 ------
46>------ Skipped Build: Project: mod_perl, Configuration: Debug Win32 ------
46>Project not selected to build for this solution configuration 
45>Compiling...
47>------ Build started: Project: mod_event_socket, Configuration: Debug Win32 ------
47>Compiling...
45>mod_ivrtest.c
47>mod_event_socket.c
45>Linking...
47>Linking...
45>   Creating library Debug/mod_ivrtest.lib and object Debug/mod_ivrtest.exp
47>   Creating library Debug/mod_event_socket.lib and object Debug/mod_event_socket.exp
45>Embedding manifest...
47>Embedding manifest...
47>Build log was saved at "file://c:\FreeSwitch\src\mod\event_handlers\mod_event_socket\Debug\BuildLog.htm"
45>Build log was saved at "file://c:\FreeSwitch\src\mod\applications\mod_ivrtest\Debug\BuildLog.htm"
45>mod_ivrtest - 0 error(s), 0 warning(s)
47>mod_event_socket - 0 error(s), 0 warning(s)
48>------ Build started: Project: mod_cdr, Configuration: Debug Win32 ------
49>------ Build started: Project: mod_sofia, Configuration: Debug Win32 ------
48>Compiling...
49>Compiling...
48>basecdr.cpp
49>mod_sofia.c
49>.\mod_sofia.c(1843) : error C2065: 'nua_i_register' : undeclared identifier
49>.\mod_sofia.c(1843) : error C2051: case expression not constant
49>.\mod_sofia.c(2199) : warning C4244: 'initializing' : conversion from 'time_t' to 'long', possible loss of data
49>Build log was saved at "file://c:\FreeSwitch\src\mod\endpoints\mod_sofia\Debug\BuildLog.htm"
49>mod_sofia - 2 error(s), 1 warning(s)
50>------ Build started: Project: mod_g726, Configuration: Debug Win32 ------
50>Compiling...
50>mod_g726.c
50>Linking...
50>   Creating library Debug/mod_g726.lib and object Debug/mod_g726.exp
50>Embedding manifest...
50>Build log was saved at "file://c:\FreeSwitch\src\mod\codecs\mod_g726\Debug\BuildLog.htm"
50>mod_g726 - 0 error(s), 0 warning(s)
48>baseregistry.cpp
51>------ Build started: Project: mod_g722, Configuration: Debug Win32 ------
51>Compiling...
51>mod_g722.c
51>Linking...
51>   Creating library Debug/mod_g722.lib and object Debug/mod_g722.exp
51>Embedding manifest...
48>cdrcontainer.cpp
51>Build log was saved at "file://c:\FreeSwitch\src\mod\codecs\mod_g722\Debug\BuildLog.htm"
51>mod_g722 - 0 error(s), 0 warning(s)
52>------ Build started: Project: mod_park, Configuration: Debug Win32 ------
52>Compiling...
52>mod_park.c
48>csvcdr.cpp
52>Linking...
52>   Creating library Debug/mod_park.lib and object Debug/mod_park.exp
52>Embedding manifest...
52>Build log was saved at "file://c:\FreeSwitch\src\mod\applications\mod_park\Debug\BuildLog.htm"
52>mod_park - 0 error(s), 0 warning(s)
53>------ Build started: Project: mod_g723_1, Configuration: Debug Passthrough Win32 ------
53>Compiling...
53>mod_g723_1.c
48>mod_cdr.cpp
53>Linking...
53>   Creating library Debug/mod_g723_1.lib and object Debug/mod_g723_1.exp
53>Embedding manifest...
53>Build log was saved at "file://c:\FreeSwitch\src\mod\codecs\mod_g723_1\Debug Passthrough\BuildLog.htm"
53>mod_g723_1 - 0 error(s), 0 warning(s)
48>pddcdr.cpp
54>------ Build started: Project: mod_g729, Configuration: Debug Passthrough Win32 ------
54>Compiling...
54>mod_g729.c
54>Linking...
54>   Creating library Debug/mod_g729.lib and object Debug/mod_g729.exp
54>Embedding manifest...
48>Generating Code...
54>Build log was saved at "file://c:\FreeSwitch\src\mod\codecs\mod_g729\Debug Passthrough\BuildLog.htm"
54>mod_g729 - 0 error(s), 0 warning(s)
55>------ Build started: Project: mod_native_file, Configuration: Debug Win32 ------
55>Compiling...
55>mod_native_file.c
48>Linking...
48>   Creating library Debug/mod_cdr.lib and object Debug/mod_cdr.exp
48>Embedding manifest...
55>Linking...
55>   Creating library Debug/mod_native_file.lib and object Debug/mod_native_file.exp
55>Embedding manifest...
48>Build log was saved at "file://c:\FreeSwitch\src\mod\event_handlers\mod_cdr\Debug\BuildLog.htm"
48>mod_cdr - 0 error(s), 0 warning(s)
55>Build log was saved at "file://c:\FreeSwitch\src\mod\formats\mod_native_file\Debug\BuildLog.htm"
55>mod_native_file - 0 error(s), 0 warning(s)
========== Build: 47 succeeded, 2 failed, 41 up-to-date, 6 skipped ==========