1>------ Build started: Project: Download APR, Configuration: Debug Win32 ------
2>------ Build started: Project: Download PCRE, Configuration: Debug Win32 ------
2>Downloading PCRE.
1>Downloading APR.
1>Downloading: http://svn.freeswitch.org/downloads/libs/apr-1.2.7.tar.gz
2>Downloading: http://svn.freeswitch.org/downloads/libs/pcre-6.4.tar.gz
2>Extracting: C:\Documents and Settings\rob\My Documents\FreeSwitch\libs\pcre-6.4.tar.gz
2>c:\Documents and Settings\rob\My Documents\FreeSwitch\libs\win32\util.vbs(99, 2) WshShell.Exec: C:\Documents and Settings\rob\My Documents\FreeSwitch\libs\win32\tmp6893.bat is not a valid Win32 application.
1>Extracting: C:\Documents and Settings\rob\My Documents\FreeSwitch\libs\apr-1.2.7.tar.gz
1>c:\Documents and Settings\rob\My Documents\FreeSwitch\libs\win32\util.vbs(99, 2) WshShell.Exec: C:\Documents and Settings\rob\My Documents\FreeSwitch\libs\win32\tmp6893.bat is not a valid Win32 application.
2>Build log was saved at "file://c:\Documents and Settings\rob\My Documents\FreeSwitch\libs\win32\Debug\BuildLog Download PCRE.htm"
2>Download PCRE - 0 error(s), 0 warning(s)
1>Build log was saved at "file://c:\Documents and Settings\rob\My Documents\FreeSwitch\libs\win32\Debug\BuildLog Download APR.htm"
1>Download APR - 0 error(s), 0 warning(s)
3>------ Build started: Project: libapr, Configuration: Debug Win32 ------
4>------ Build started: Project: Download APR-Iconv, Configuration: Debug Win32 ------
4>Downloading APR-Iconv.
3>Performing Pre-Build Event...
3>The system cannot find the path specified.
3>File not found - *.h
3>0 File(s) copied
3>Project : error PRJ0019: A tool returned an error code from "Performing Pre-Build Event..."
3>Build log was saved at "file://c:\Documents and Settings\rob\My Documents\FreeSwitch\libs\win32\apr\Debug\BuildLog.htm"
3>libapr - 1 error(s), 0 warning(s)
4>Downloading: http://svn.freeswitch.org/downloads/libs/apr-iconv-1.1.1.tar.gz
5>------ Build started: Project: Download EXOSIP, Configuration: Debug Win32 ------
5>Downloading EXOSIP.
4>Extracting: C:\Documents and Settings\rob\My Documents\FreeSwitch\libs\apr-iconv-1.1.1.tar.gz
4>c:\Documents and Settings\rob\My Documents\FreeSwitch\libs\win32\util.vbs(99, 2) WshShell.Exec: C:\Documents and Settings\rob\My Documents\FreeSwitch\libs\win32\tmp9532.bat is not a valid Win32 application.
5>Downloading: http://svn.freeswitch.org/downloads/libs/libosip2-2.2.2.tar.gz
4>Build log was saved at "file://c:\Documents and Settings\rob\My Documents\FreeSwitch\libs\win32\Debug\BuildLog Download APR-Iconv.htm"
4>Download APR-Iconv - 0 error(s), 0 warning(s)
6>------ Build started: Project: Download SQLITE, Configuration: Debug Win32 ------
6>Downloading SQLITE.
5>Extracting: C:\Documents and Settings\rob\My Documents\FreeSwitch\libs\libosip2-2.2.2.tar.gz
5>c:\Documents and Settings\rob\My Documents\FreeSwitch\libs\win32\util.vbs(99, 2) WshShell.Exec: C:\Documents and Settings\rob\My Documents\FreeSwitch\libs\win32\tmp331.bat is not a valid Win32 application.
6>Downloading: http://svn.freeswitch.org/downloads/libs/sqlite-source-3_3_6.zip
5>Downloading: http://svn.freeswitch.org/downloads/libs/libeXosip2-2.2.2.tar.gz
5>Extracting: C:\Documents and Settings\rob\My Documents\FreeSwitch\libs\libeXosip2-2.2.2.tar.gz
6>Extracting: C:\Documents and Settings\rob\My Documents\FreeSwitch\libs\sqlite-source-3_3_6.zip
6>c:\Documents and Settings\rob\My Documents\FreeSwitch\libs\win32\util.vbs(99, 2) WshShell.Exec: C:\Documents and Settings\rob\My Documents\FreeSwitch\libs\win32\tmp272.bat is not a valid Win32 application.
5>c:\Documents and Settings\rob\My Documents\FreeSwitch\libs\win32\util.vbs(99, 2) WshShell.Exec: C:\Documents and Settings\rob\My Documents\FreeSwitch\libs\win32\tmp7127.bat is not a valid Win32 application.
5>Build log was saved at "file://c:\Documents and Settings\rob\My Documents\FreeSwitch\libs\win32\Debug\BuildLog Download EXOSIP.htm"
5>Download EXOSIP - 0 error(s), 0 warning(s)
6>Build log was saved at "file://c:\Documents and Settings\rob\My Documents\FreeSwitch\libs\win32\Debug\BuildLog Download SQLITE.htm"
6>Download SQLITE - 0 error(s), 0 warning(s)
7>------ Build started: Project: Download IKSEMEL, Configuration: Debug Win32 ------
7>Downloading IKSEMEL.
8>------ Build started: Project: Download LIBRESAMPLE, Configuration: Debug Win32 ------
8>Downloading LIBRESAMPLE.
7>Downloading: http://svn.freeswitch.org/downloads/libs/iksemel-1.2.tar.gz
8>Downloading: http://svn.freeswitch.org/downloads/libs/libresample-0.1.3.zip
7>Extracting: C:\Documents and Settings\rob\My Documents\FreeSwitch\libs\iksemel-1.2.tar.gz
7>c:\Documents and Settings\rob\My Documents\FreeSwitch\libs\win32\util.vbs(99, 2) WshShell.Exec: C:\Documents and Settings\rob\My Documents\FreeSwitch\libs\win32\tmp6650.bat is not a valid Win32 application.
7>Build log was saved at "file://c:\Documents and Settings\rob\My Documents\FreeSwitch\libs\win32\Debug\BuildLog Download IKSEMEL.htm"
7>Download IKSEMEL - 0 error(s), 0 warning(s)
8>Extracting: C:\Documents and Settings\rob\My Documents\FreeSwitch\libs\libresample-0.1.3.zip
8>c:\Documents and Settings\rob\My Documents\FreeSwitch\libs\win32\util.vbs(99, 2) WshShell.Exec: C:\Documents and Settings\rob\My Documents\FreeSwitch\libs\win32\tmp9766.bat is not a valid Win32 application.
9>------ Build started: Project: osipparser2, Configuration: Debug Win32 ------
9>Compiling...
8>Build log was saved at "file://c:\Documents and Settings\rob\My Documents\FreeSwitch\libs\win32\Debug\BuildLog Download LIBRESAMPLE.htm"
8>Download LIBRESAMPLE - 0 error(s), 0 warning(s)
10>------ Build started: Project: Download HOWL, Configuration: Debug Win32 ------
10>Downloading HOWL.
9>osip_accept.c
9>c1 : fatal error C1083: Cannot open source file: '..\..\libosip2-2.2.2\src\osipparser2\osip_accept.c': No such file or directory
9>osip_accept_encoding.c
9>c1 : fatal error C1083: Cannot open source file: '..\..\libosip2-2.2.2\src\osipparser2\osip_accept_encoding.c': No such file or directory
9>osip_accept_language.c
9>c1 : fatal error C1083: Cannot open source file: '..\..\libosip2-2.2.2\src\osipparser2\osip_accept_language.c': No such file or directory
9>osip_alert_info.c
9>c1 : fatal error C1083: Cannot open source file: '..\..\libosip2-2.2.2\src\osipparser2\osip_alert_info.c': No such file or directory
9>osip_allow.c
10>Downloading: http://svn.freeswitch.org/downloads/libs/howl-1.0.0.tar.gz
9>c1 : fatal error C1083: Cannot open source file: '..\..\libosip2-2.2.2\src\osipparser2\osip_allow.c': No such file or directory
9>osip_authentication_info.c
9>c1 : fatal error C1083: Cannot open source file: '..\..\libosip2-2.2.2\src\osipparser2\osip_authentication_info.c': No such file or directory
9>osip_authorization.c
9>c1 : fatal error C1083: Cannot open source file: '..\..\libosip2-2.2.2\src\osipparser2\osip_authorization.c': No such file or directory
9>osip_body.c
9>c1 : fatal error C1083: Cannot open source file: '..\..\libosip2-2.2.2\src\osipparser2\osip_body.c': No such file or directory
9>osip_call_id.c
9>c1 : fatal error C1083: Cannot open source file: '..\..\libosip2-2.2.2\src\osipparser2\osip_call_id.c': No such file or directory
9>osip_call_info.c
9>c1 : fatal error C1083: Cannot open source file: '..\..\libosip2-2.2.2\src\osipparser2\osip_call_info.c': No such file or directory
9>osip_contact.c
9>c1 : fatal error C1083: Cannot open source file: '..\..\libosip2-2.2.2\src\osipparser2\osip_contact.c': No such file or directory
9>osip_content_disposition.c
9>c1 : fatal error C1083: Cannot open source file: '..\..\libosip2-2.2.2\src\osipparser2\osip_content_disposition.c': No such file or directory
9>osip_content_encoding.c
9>c1 : fatal error C1083: Cannot open source file: '..\..\libosip2-2.2.2\src\osipparser2\osip_content_encoding.c': No such file or directory
9>osip_content_length.c
9>c1 : fatal error C1083: Cannot open source file: '..\..\libosip2-2.2.2\src\osipparser2\osip_content_length.c': No such file or directory
9>osip_content_type.c
10>Extracting: C:\Documents and Settings\rob\My Documents\FreeSwitch\libs\howl-1.0.0.tar.gz
10>c:\Documents and Settings\rob\My Documents\FreeSwitch\libs\win32\util.vbs(99, 2) WshShell.Exec: C:\Documents and Settings\rob\My Documents\FreeSwitch\libs\win32\tmp1762.bat is not a valid Win32 application.
9>c1 : fatal error C1083: Cannot open source file: '..\..\libosip2-2.2.2\src\osipparser2\osip_content_type.c': No such file or directory
9>osip_cseq.c
9>c1 : fatal error C1083: Cannot open source file: '..\..\libosip2-2.2.2\src\osipparser2\osip_cseq.c': No such file or directory
9>osip_error_info.c
9>c1 : fatal error C1083: Cannot open source file: '..\..\libosip2-2.2.2\src\osipparser2\osip_error_info.c': No such file or directory
9>osip_from.c
9>c1 : fatal error C1083: Cannot open source file: '..\..\libosip2-2.2.2\src\osipparser2\osip_from.c': No such file or directory
10>Build log was saved at "file://c:\Documents and Settings\rob\My Documents\FreeSwitch\libs\win32\Debug\BuildLog Download HOWL.htm"
9>osip_header.c
10>Download HOWL - 0 error(s), 0 warning(s)
9>c1 : fatal error C1083: Cannot open source file: '..\..\libosip2-2.2.2\src\osipparser2\osip_header.c': No such file or directory
9>osip_list.c
9>c1 : fatal error C1083: Cannot open source file: '..\..\libosip2-2.2.2\src\osipparser2\osip_list.c': No such file or directory
9>Generating Code...
9>Compiling...
9>osip_md5c.c
9>c1 : fatal error C1083: Cannot open source file: '..\..\libosip2-2.2.2\src\osipparser2\osip_md5c.c': No such file or directory
9>osip_message.c
9>c1 : fatal error C1083: Cannot open source file: '..\..\libosip2-2.2.2\src\osipparser2\osip_message.c': No such file or directory
9>osip_message_parse.c
9>c1 : fatal error C1083: Cannot open source file: '..\..\libosip2-2.2.2\src\osipparser2\osip_message_parse.c': No such file or directory
9>osip_message_to_str.c
9>c1 : fatal error C1083: Cannot open source file: '..\..\libosip2-2.2.2\src\osipparser2\osip_message_to_str.c': No such file or directory
9>osip_mime_version.c
9>c1 : fatal error C1083: Cannot open source file: '..\..\libosip2-2.2.2\src\osipparser2\osip_mime_version.c': No such file or directory
9>osip_parser_cfg.c
9>c1 : fatal error C1083: Cannot open source file: '..\..\libosip2-2.2.2\src\osipparser2\osip_parser_cfg.c': No such file or directory
9>osip_port.c
9>c1 : fatal error C1083: Cannot open source file: '..\..\libosip2-2.2.2\src\osipparser2\osip_port.c': No such file or directory
9>osip_proxy_authenticate.c
9>c1 : fatal error C1083: Cannot open source file: '..\..\libosip2-2.2.2\src\osipparser2\osip_proxy_authenticate.c': No such file or directory
9>osip_proxy_authentication_info.c
9>c1 : fatal error C1083: Cannot open source file: '..\..\libosip2-2.2.2\src\osipparser2\osip_proxy_authentication_info.c': No such file or directory
9>osip_proxy_authorization.c
9>c1 : fatal error C1083: Cannot open source file: '..\..\libosip2-2.2.2\src\osipparser2\osip_proxy_authorization.c': No such file or directory
9>osip_record_route.c
11>------ Build started: Project: libpcre Generate pcre_chartables.c, Configuration: Debug Win32 ------
9>c1 : fatal error C1083: Cannot open source file: '..\..\libosip2-2.2.2\src\osipparser2\osip_record_route.c': No such file or directory
9>osip_route.c
9>c1 : fatal error C1083: Cannot open source file: '..\..\libosip2-2.2.2\src\osipparser2\osip_route.c': No such file or directory
9>osip_to.c
9>c1 : fatal error C1083: Cannot open source file: '..\..\libosip2-2.2.2\src\osipparser2\osip_to.c': No such file or directory
9>osip_uri.c
9>c1 : fatal error C1083: Cannot open source file: '..\..\libosip2-2.2.2\src\osipparser2\osip_uri.c': No such file or directory
9>osip_via.c
11>Compiling...
9>c1 : fatal error C1083: Cannot open source file: '..\..\libosip2-2.2.2\src\osipparser2\osip_via.c': No such file or directory
9>osip_www_authenticate.c
9>c1 : fatal error C1083: Cannot open source file: '..\..\libosip2-2.2.2\src\osipparser2\osip_www_authenticate.c': No such file or directory
9>sdp_accessor.c
11>dftables.c
9>c1 : fatal error C1083: Cannot open source file: '..\..\libosip2-2.2.2\src\osipparser2\sdp_accessor.c': No such file or directory
9>sdp_message.c
9>c1 : fatal error C1083: Cannot open source file: '..\..\libosip2-2.2.2\src\osipparser2\sdp_message.c': No such file or directory
11>c:\documents and settings\rob\my documents\freeswitch\libs\win32\pcre\dftables.c(50) : fatal error C1083: Cannot open include file: 'pcre_internal.h': No such file or directory
9>Generating Code...
11>Build log was saved at "file://c:\Documents and Settings\rob\My Documents\FreeSwitch\libs\win32\pcre\Debug\BuildLog.htm"
11>libpcre Generate pcre_chartables.c - 1 error(s), 0 warning(s)
9>Build log was saved at "file://c:\Documents and Settings\rob\My Documents\FreeSwitch\libs\win32\exosip\Debug\BuildLog.htm"
9>osipparser2 - 38 error(s), 0 warning(s)
12>------ Build started: Project: libapriconv, Configuration: Debug Win32 ------
12>Performing Pre-Build Event...
12>File not found - *.h
12>0 File(s) copied
12>Project : error PRJ0019: A tool returned an error code from "Performing Pre-Build Event..."
12>Build log was saved at "file://c:\Documents and Settings\rob\My Documents\FreeSwitch\libs\win32\apr-iconv\Debug\BuildLog.htm"
12>libapriconv - 1 error(s), 0 warning(s)
13>------ Build started: Project: Download XMLRPC, Configuration: Debug Win32 ------
13>Downloading XMLRPC.
14>------ Build started: Project: Download SPIDERMONKEY, Configuration: Debug Win32 ------
14>Downloading SPIDERMONKEY.
13>Downloading: http://svn.freeswitch.org/downloads/libs/xmlrpc-c-1.03.14.tgz
14>Downloading: http://svn.freeswitch.org/downloads/libs/js20051231.zip
13>Extracting: C:\Documents and Settings\rob\My Documents\FreeSwitch\libs\xmlrpc-c-1.03.14.tgz
13>c:\Documents and Settings\rob\My Documents\FreeSwitch\libs\win32\util.vbs(99, 2) WshShell.Exec: C:\Documents and Settings\rob\My Documents\FreeSwitch\libs\win32\tmp7663.bat is not a valid Win32 application.
13>Build log was saved at "file://c:\Documents and Settings\rob\My Documents\FreeSwitch\libs\win32\Debug\BuildLog Download XMLRPC.htm"
13>Download XMLRPC - 0 error(s), 0 warning(s)
15>------ Build started: Project: libaprutil, Configuration: Debug Win32 ------
15>Performing Pre-Build Event...
14>Extracting: C:\Documents and Settings\rob\My Documents\FreeSwitch\libs\js20051231.zip
14>c:\Documents and Settings\rob\My Documents\FreeSwitch\libs\win32\util.vbs(99, 2) WshShell.Exec: C:\Documents and Settings\rob\My Documents\FreeSwitch\libs\win32\tmp127.bat is not a valid Win32 application.
15>The system cannot find the path specified.
15>The system cannot find the path specified.
15>The system cannot find the path specified.
15>The system cannot find the path specified.
15>The system cannot find the path specified.
15>File not found - *.h
15>0 File(s) copied
15>Project : error PRJ0019: A tool returned an error code from "Performing Pre-Build Event..."
15>Build log was saved at "file://c:\Documents and Settings\rob\My Documents\FreeSwitch\libs\win32\apr-util\Debug\BuildLog.htm"
15>libaprutil - 1 error(s), 0 warning(s)
14>Downloading: http://svn.freeswitch.org/downloads/libs/nspr-4.6.1.winnt5.debug.zip
16>------ Build started: Project: Download PTHREAD, Configuration: Debug Win32 ------
16>Downloading PTHREAD.
14>Extracting: C:\Documents and Settings\rob\My Documents\FreeSwitch\libs\nspr-4.6.1.winnt5.debug.zip
14>c:\Documents and Settings\rob\My Documents\FreeSwitch\libs\win32\util.vbs(99, 2) WshShell.Exec: C:\Documents and Settings\rob\My Documents\FreeSwitch\libs\win32\tmp4042.bat is not a valid Win32 application.
16>Downloading: http://svn.freeswitch.org/downloads/libs/pthreads-w32-2-7-0-release.tar.gz
14>Downloading: http://svn.freeswitch.org/downloads/libs/nspr-4.6.1.winnt5.release.zip
16>Extracting: C:\Documents and Settings\rob\My Documents\FreeSwitch\libs\pthreads-w32-2-7-0-release.tar.gz
16>c:\Documents and Settings\rob\My Documents\FreeSwitch\libs\win32\util.vbs(99, 2) WshShell.Exec: C:\Documents and Settings\rob\My Documents\FreeSwitch\libs\win32\tmp215.bat is not a valid Win32 application.
14>Extracting: C:\Documents and Settings\rob\My Documents\FreeSwitch\libs\nspr-4.6.1.winnt5.release.zip
14>c:\Documents and Settings\rob\My Documents\FreeSwitch\libs\win32\util.vbs(99, 2) WshShell.Exec: C:\Documents and Settings\rob\My Documents\FreeSwitch\libs\win32\tmp5200.bat is not a valid Win32 application.
16>Build log was saved at "file://c:\Documents and Settings\rob\My Documents\FreeSwitch\libs\win32\Debug\BuildLog Download PTHREAD.htm"
16>Download PTHREAD - 0 error(s), 0 warning(s)
14>Build log was saved at "file://c:\Documents and Settings\rob\My Documents\FreeSwitch\libs\win32\Debug\BuildLog Download SPIDERMONKEY.htm"
14>Download SPIDERMONKEY - 0 error(s), 0 warning(s)
17>------ Build started: Project: xmlrpc, Configuration: Debug Win32 ------
17>Performing Pre-Build Event...
18>------ Build started: Project: fdlibm, Configuration: Debug Win32 ------
17>Compiling...
18>Compiling...
18>w_sqrt.c
17>casprintf.c
18>c1 : fatal error C1083: Cannot open source file: '..\..\js20051231\src\fdlibm\w_sqrt.c': No such file or directory
17>c1 : fatal error C1083: Cannot open source file: '..\..\xmlrpc-c-1.03.14\lib\util\casprintf.c': No such file or directory
18>w_pow.c
17>pthreadx_win32.c
18>c1 : fatal error C1083: Cannot open source file: '..\..\js20051231\src\fdlibm\w_pow.c': No such file or directory
17>c1 : fatal error C1083: Cannot open source file: '..\..\xmlrpc-c-1.03.14\lib\util\pthreadx_win32.c': No such file or directory
18>w_atan2.c
17>xmlrpc_array.c
17>c1 : fatal error C1083: Cannot open source file: '..\..\xmlrpc-c-1.03.14\src\xmlrpc_array.c': No such file or directory
17>xmlrpc_authcookie.c
18>c1 : fatal error C1083: Cannot open source file: '..\..\js20051231\src\fdlibm\w_atan2.c': No such file or directory
17>c1 : fatal error C1083: Cannot open source file: '..\..\xmlrpc-c-1.03.14\src\xmlrpc_authcookie.c': No such file or directory
18>s_scalbn.c
17>xmlrpc_base64.c
17>c1 : fatal error C1083: Cannot open source file: '..\..\xmlrpc-c-1.03.14\src\xmlrpc_base64.c': No such file or directory
18>c1 : fatal error C1083: Cannot open source file: '..\..\js20051231\src\fdlibm\s_scalbn.c': No such file or directory
17>xmlrpc_builddecomp.c
17>c1 : fatal error C1083: Cannot open source file: '..\..\xmlrpc-c-1.03.14\src\xmlrpc_builddecomp.c': No such file or directory
18>s_rint.c
18>c1 : fatal error C1083: Cannot open source file: '..\..\js20051231\src\fdlibm\s_rint.c': No such file or directory
18>s_matherr.c
18>c1 : fatal error C1083: Cannot open source file: '..\..\js20051231\src\fdlibm\s_matherr.c': No such file or directory
18>s_isnan.c
18>c1 : fatal error C1083: Cannot open source file: '..\..\js20051231\src\fdlibm\s_isnan.c': No such file or directory
17>xmlrpc_client.c
18>s_finite.c
18>c1 : fatal error C1083: Cannot open source file: '..\..\js20051231\src\fdlibm\s_finite.c': No such file or directory
18>s_fabs.c
18>c1 : fatal error C1083: Cannot open source file: '..\..\js20051231\src\fdlibm\s_fabs.c': No such file or directory
18>s_copysign.c
18>c1 : fatal error C1083: Cannot open source file: '..\..\js20051231\src\fdlibm\s_copysign.c': No such file or directory
18>s_atan.c
18>c1 : fatal error C1083: Cannot open source file: '..\..\js20051231\src\fdlibm\s_atan.c': No such file or directory
17>c1 : fatal error C1083: Cannot open source file: '..\..\xmlrpc-c-1.03.14\src\xmlrpc_client.c': No such file or directory
18>k_standard.c
17>xmlrpc_data.c
17>c1 : fatal error C1083: Cannot open source file: '..\..\xmlrpc-c-1.03.14\src\xmlrpc_data.c': No such file or directory
18>c1 : fatal error C1083: Cannot open source file: '..\..\js20051231\src\fdlibm\k_standard.c': No such file or directory
18>e_sqrt.c
17>xmlrpc_datetime.c
18>c1 : fatal error C1083: Cannot open source file: '..\..\js20051231\src\fdlibm\e_sqrt.c': No such file or directory
17>c1 : fatal error C1083: Cannot open source file: '..\..\xmlrpc-c-1.03.14\src\xmlrpc_datetime.c': No such file or directory
18>e_pow.c
17>xmlrpc_expat.c
18>c1 : fatal error C1083: Cannot open source file: '..\..\js20051231\src\fdlibm\e_pow.c': No such file or directory
17>c1 : fatal error C1083: Cannot open source file: '..\..\xmlrpc-c-1.03.14\src\xmlrpc_expat.c': No such file or directory
18>e_atan2.c
18>c1 : fatal error C1083: Cannot open source file: '..\..\js20051231\src\fdlibm\e_atan2.c': No such file or directory
17>xmlrpc_parse.c
18>Generating Code...
17>c1 : fatal error C1083: Cannot open source file: '..\..\xmlrpc-c-1.03.14\src\xmlrpc_parse.c': No such file or directory
17>xmlrpc_registry.c
17>c1 : fatal error C1083: Cannot open source file: '..\..\xmlrpc-c-1.03.14\src\xmlrpc_registry.c': No such file or directory
18>Build log was saved at "file://c:\Documents and Settings\rob\My Documents\FreeSwitch\libs\win32\js\Debug\BuildLog.htm"
17>xmlrpc_serialize.c
17>c1 : fatal error C1083: Cannot open source file: '..\..\xmlrpc-c-1.03.14\src\xmlrpc_serialize.c': No such file or directory
17>xmlrpc_server_abyss.c
17>c1 : fatal error C1083: Cannot open source file: '..\..\xmlrpc-c-1.03.14\src\xmlrpc_server_abyss.c': No such file or directory
18>fdlibm - 15 error(s), 0 warning(s)
17>xmlrpc_struct.c
17>c1 : fatal error C1083: Cannot open source file: '..\..\xmlrpc-c-1.03.14\src\xmlrpc_struct.c': No such file or directory
17>xmlrpc_strutil.c
17>c1 : fatal error C1083: Cannot open source file: '..\..\xmlrpc-c-1.03.14\src\xmlrpc_strutil.c': No such file or directory
17>xmlrpc_support.c
17>c1 : fatal error C1083: Cannot open source file: '..\..\xmlrpc-c-1.03.14\src\xmlrpc_support.c': No such file or directory
17>xmlrpc_utf8.c
17>c1 : fatal error C1083: Cannot open source file: '..\..\xmlrpc-c-1.03.14\src\xmlrpc_utf8.c': No such file or directory
17>xmlrpc_wininet_transport.c
17>c1 : fatal error C1083: Cannot open source file: '..\..\xmlrpc-c-1.03.14\lib\wininet_transport\xmlrpc_wininet_transport.c': No such file or directory
19>------ Build started: Project: Download SPEEX, Configuration: Debug Win32 ------
17>Generating Code...
17>Build log was saved at "file://c:\Documents and Settings\rob\My Documents\FreeSwitch\libs\win32\xmlrpc\Debug\xmlrpc\BuildLog.htm"
17>xmlrpc - 19 error(s), 0 warning(s)
19>Downloading SPEEX.
19>Downloading: http://svn.freeswitch.org/downloads/libs/speex-1.1.11.1.tar.gz
20>------ Build started: Project: iksemel, Configuration: Debug Win32 ------
20>Compiling...
19>Extracting: C:\Documents and Settings\rob\My Documents\FreeSwitch\libs\speex-1.1.11.1.tar.gz
19>c:\Documents and Settings\rob\My Documents\FreeSwitch\libs\win32\util.vbs(99, 2) WshShell.Exec: C:\Documents and Settings\rob\My Documents\FreeSwitch\libs\win32\tmp9943.bat is not a valid Win32 application.
20>base64.c
20>c1 : fatal error C1083: Cannot open source file: '..\..\iksemel-1.2\src\base64.c': No such file or directory
20>dom.c
20>c1 : fatal error C1083: Cannot open source file: '..\..\iksemel-1.2\src\dom.c': No such file or directory
19>Build log was saved at "file://c:\Documents and Settings\rob\My Documents\FreeSwitch\libs\win32\Debug\BuildLog Download SPEEX.htm"
20>filter.c
19>Download SPEEX - 0 error(s), 0 warning(s)
20>c1 : fatal error C1083: Cannot open source file: '..\..\iksemel-1.2\src\filter.c': No such file or directory
20>iks.c
20>c1 : fatal error C1083: Cannot open source file: '..\..\iksemel-1.2\src\iks.c': No such file or directory
20>ikstack.c
20>c1 : fatal error C1083: Cannot open source file: '..\..\iksemel-1.2\src\ikstack.c': No such file or directory
20>io-posix.c
20>c1 : fatal error C1083: Cannot open source file: '..\..\iksemel-1.2\src\io-posix.c': No such file or directory
20>jabber.c
20>c1 : fatal error C1083: Cannot open source file: '..\..\iksemel-1.2\src\jabber.c': No such file or directory
20>md5.c
21>------ Build started: Project: Download CURL, Configuration: Debug Win32 ------
20>c1 : fatal error C1083: Cannot open source file: '..\..\iksemel-1.2\src\md5.c': No such file or directory
20>sax.c
21>Downloading CURL.
20>c1 : fatal error C1083: Cannot open source file: '..\..\iksemel-1.2\src\sax.c': No such file or directory
20>sha.c
20>c1 : fatal error C1083: Cannot open source file: '..\..\iksemel-1.2\src\sha.c': No such file or directory
20>stream.c
20>c1 : fatal error C1083: Cannot open source file: '..\..\iksemel-1.2\src\stream.c': No such file or directory
20>utility.c
20>c1 : fatal error C1083: Cannot open source file: '..\..\iksemel-1.2\src\utility.c': No such file or directory
21>Downloading: http://svn.freeswitch.org/downloads/libs/curl-7.15.2.tar.gz
20>Generating Code...
20>Build log was saved at "file://c:\Documents and Settings\rob\My Documents\FreeSwitch\libs\win32\iksemel\Debug\BuildLog.htm"
20>iksemel - 12 error(s), 0 warning(s)
22>------ Build started: Project: Download PORTAUDIO, Configuration: Debug Win32 ------
22>Downloading PORTAUDIO.
22>Downloading: http://svn.freeswitch.org/downloads/libs/portaudio_v18_1.zip
21>Extracting: C:\Documents and Settings\rob\My Documents\FreeSwitch\libs\curl-7.15.2.tar.gz
21>c:\Documents and Settings\rob\My Documents\FreeSwitch\libs\win32\util.vbs(99, 2) WshShell.Exec: C:\Documents and Settings\rob\My Documents\FreeSwitch\libs\win32\tmp8814.bat is not a valid Win32 application.
22>Extracting: C:\Documents and Settings\rob\My Documents\FreeSwitch\libs\portaudio_v18_1.zip
22>c:\Documents and Settings\rob\My Documents\FreeSwitch\libs\win32\util.vbs(99, 2) WshShell.Exec: C:\Documents and Settings\rob\My Documents\FreeSwitch\libs\win32\tmp4622.bat is not a valid Win32 application.
21>Build log was saved at "file://c:\Documents and Settings\rob\My Documents\FreeSwitch\libs\win32\Debug\BuildLog Download CURL.htm"
21>Download CURL - 0 error(s), 0 warning(s)
22>Build log was saved at "file://c:\Documents and Settings\rob\My Documents\FreeSwitch\libs\win32\Debug\BuildLog Download PORTAUDIO.htm"
22>Download PORTAUDIO - 0 error(s), 0 warning(s)
23>------ Build started: Project: libresample, Configuration: Debug Win32 ------
23>Compiling...
23>filterkit.c
23>c1 : fatal error C1083: Cannot open source file: '..\..\libresample-0.1.3\src\filterkit.c': No such file or directory
23>resample.c
23>c1 : fatal error C1083: Cannot open source file: '..\..\libresample-0.1.3\src\resample.c': No such file or directory
23>resamplesubs.c
23>c1 : fatal error C1083: Cannot open source file: '..\..\libresample-0.1.3\src\resamplesubs.c': No such file or directory
23>Generating Code...
23>Build log was saved at "file://c:\Documents and Settings\rob\My Documents\FreeSwitch\libs\win32\libresample\Debug\BuildLog.htm"
23>libresample - 3 error(s), 0 warning(s)
24>------ Build started: Project: howl static library, Configuration: Debug Win32 ------
24>Compiling...
24>address.c
24>c1 : fatal error C1083: Cannot open source file: '..\..\howl-1.0.0\src\lib\howl\address.c': No such file or directory
24>buffer.c
24>c1 : fatal error C1083: Cannot open source file: '..\..\howl-1.0.0\src\lib\howl\buffer.c': No such file or directory
24>channel.c
24>c1 : fatal error C1083: Cannot open source file: '..\..\howl-1.0.0\src\lib\howl\channel.c': No such file or directory
24>debug.c
24>c1 : fatal error C1083: Cannot open source file: '..\..\howl-1.0.0\src\lib\howl\debug.c': No such file or directory
24>discovery.c
24>c1 : fatal error C1083: Cannot open source file: '..\..\howl-1.0.0\src\lib\howl\discovery.c': No such file or directory
24>interface.c
24>c1 : fatal error C1083: Cannot open source file: '..\..\howl-1.0.0\src\lib\howl\interface.c': No such file or directory
24>ior.c
24>c1 : fatal error C1083: Cannot open source file: '..\..\howl-1.0.0\src\lib\howl\ior.c': No such file or directory
24>message.c
24>c1 : fatal error C1083: Cannot open source file: '..\..\howl-1.0.0\src\lib\howl\message.c': No such file or directory
25>------ Build started: Project: libpcre, Configuration: Debug DLL Win32 ------
24>notosx_mdns_stub.c
24>c1 : fatal error C1083: Cannot open source file: '..\..\howl-1.0.0\src\lib\howl\notosx\notosx_mdns_stub.c': No such file or directory
24>object.c
25>Compiling...
24>c1 : fatal error C1083: Cannot open source file: '..\..\howl-1.0.0\src\lib\howl\object.c': No such file or directory
24>orb.c
24>c1 : fatal error C1083: Cannot open source file: '..\..\howl-1.0.0\src\lib\howl\orb.c': No such file or directory
25>pcre_chartables.c
24>platform.c
25>c1 : fatal error C1083: Cannot open source file: '.\pcre_chartables.c': No such file or directory
24>c1 : fatal error C1083: Cannot open source file: '..\..\howl-1.0.0\src\lib\howl\platform.c': No such file or directory
25>pcre_compile.c
24>profile.c
25>c1 : fatal error C1083: Cannot open source file: '..\..\pcre-6.4\pcre_compile.c': No such file or directory
24>c1 : fatal error C1083: Cannot open source file: '..\..\howl-1.0.0\src\lib\howl\profile.c': No such file or directory
25>Generating Code...
24>salt.c
24>c1 : fatal error C1083: Cannot open source file: '..\..\howl-1.0.0\src\lib\howl\salt.c': No such file or directory
25>Build log was saved at "file://c:\Documents and Settings\rob\My Documents\FreeSwitch\libs\win32\pcre\Debug DLL\BuildLog.htm"
24>signal.c
25>libpcre - 2 error(s), 0 warning(s)
24>c1 : fatal error C1083: Cannot open source file: '..\..\howl-1.0.0\src\lib\howl\signal.c': No such file or directory
24>socket.c
24>c1 : fatal error C1083: Cannot open source file: '..\..\howl-1.0.0\src\lib\howl\socket.c': No such file or directory
24>text_record.c
24>c1 : fatal error C1083: Cannot open source file: '..\..\howl-1.0.0\src\lib\howl\text_record.c': No such file or directory
24>time.c
24>c1 : fatal error C1083: Cannot open source file: '..\..\howl-1.0.0\src\lib\howl\time.c': No such file or directory
24>win32_interface.c
24>c1 : fatal error C1083: Cannot open source file: '..\..\howl-1.0.0\src\lib\howl\win32\win32_interface.c': No such file or directory
24>win32_salt.c
24>c1 : fatal error C1083: Cannot open source file: '..\..\howl-1.0.0\src\lib\howl\win32\win32_salt.c': No such file or directory
24>Generating Code...
26>------ Build started: Project: libsqlite, Configuration: Debug DLL Win32 ------
24>Compiling...
24>win32_socket.c
24>c1 : fatal error C1083: Cannot open source file: '..\..\howl-1.0.0\src\lib\howl\win32\win32_socket.c': No such file or directory
24>win32_time.c
26>Compiling...
24>c1 : fatal error C1083: Cannot open source file: '..\..\howl-1.0.0\src\lib\howl\win32\win32_time.c': No such file or directory
24>Generating Code...
24>Build log was saved at "file://c:\Documents and Settings\rob\My Documents\FreeSwitch\libs\win32\howl\Debug\BuildLog.htm"
24>howl static library - 22 error(s), 0 warning(s)
26>alter.c
26>c1 : fatal error C1083: Cannot open source file: '..\..\sqlite-source-3_3_6\alter.c': No such file or directory
26>analyze.c
26>c1 : fatal error C1083: Cannot open source file: '..\..\sqlite-source-3_3_6\analyze.c': No such file or directory
26>attach.c
26>c1 : fatal error C1083: Cannot open source file: '..\..\sqlite-source-3_3_6\attach.c': No such file or directory
26>auth.c
26>c1 : fatal error C1083: Cannot open source file: '..\..\sqlite-source-3_3_6\auth.c': No such file or directory
26>btree.c
26>c1 : fatal error C1083: Cannot open source file: '..\..\sqlite-source-3_3_6\btree.c': No such file or directory
26>build.c
26>c1 : fatal error C1083: Cannot open source file: '..\..\sqlite-source-3_3_6\build.c': No such file or directory
26>callback.c
26>c1 : fatal error C1083: Cannot open source file: '..\..\sqlite-source-3_3_6\callback.c': No such file or directory
26>complete.c
27>------ Build started: Project: osip2, Configuration: Debug Win32 ------
26>c1 : fatal error C1083: Cannot open source file: '..\..\sqlite-source-3_3_6\complete.c': No such file or directory
26>date.c
27>Compiling...
26>c1 : fatal error C1083: Cannot open source file: '..\..\sqlite-source-3_3_6\date.c': No such file or directory
26>delete.c
26>c1 : fatal error C1083: Cannot open source file: '..\..\sqlite-source-3_3_6\delete.c': No such file or directory
27>fsm_misc.c
26>expr.c
26>c1 : fatal error C1083: Cannot open source file: '..\..\sqlite-source-3_3_6\expr.c': No such file or directory
27>c1 : fatal error C1083: Cannot open source file: '..\..\libosip2-2.2.2\src\osip2\fsm_misc.c': No such file or directory
27>ict.c
26>func.c
26>c1 : fatal error C1083: Cannot open source file: '..\..\sqlite-source-3_3_6\func.c': No such file or directory
26>hash.c
26>c1 : fatal error C1083: Cannot open source file: '..\..\sqlite-source-3_3_6\hash.c': No such file or directory
27>c1 : fatal error C1083: Cannot open source file: '..\..\libosip2-2.2.2\src\osip2\ict.c': No such file or directory
26>insert.c
27>ict_fsm.c
27>c1 : fatal error C1083: Cannot open source file: '..\..\libosip2-2.2.2\src\osip2\ict_fsm.c': No such file or directory
26>c1 : fatal error C1083: Cannot open source file: '..\..\sqlite-source-3_3_6\insert.c': No such file or directory
27>ist.c
26>legacy.c
26>c1 : fatal error C1083: Cannot open source file: '..\..\sqlite-source-3_3_6\legacy.c': No such file or directory
27>c1 : fatal error C1083: Cannot open source file: '..\..\libosip2-2.2.2\src\osip2\ist.c': No such file or directory
27>ist_fsm.c
26>main.c
27>c1 : fatal error C1083: Cannot open source file: '..\..\libosip2-2.2.2\src\osip2\ist_fsm.c': No such file or directory
26>c1 : fatal error C1083: Cannot open source file: '..\..\sqlite-source-3_3_6\main.c': No such file or directory
27>nict.c
26>opcodes.c
27>c1 : fatal error C1083: Cannot open source file: '..\..\libosip2-2.2.2\src\osip2\nict.c': No such file or directory
26>c1 : fatal error C1083: Cannot open source file: '..\..\sqlite-source-3_3_6\opcodes.c': No such file or directory
27>nict_fsm.c
26>os.c
27>c1 : fatal error C1083: Cannot open source file: '..\..\libosip2-2.2.2\src\osip2\nict_fsm.c': No such file or directory
26>c1 : fatal error C1083: Cannot open source file: '..\..\sqlite-source-3_3_6\os.c': No such file or directory
27>nist.c
26>os_unix.c
27>c1 : fatal error C1083: Cannot open source file: '..\..\libosip2-2.2.2\src\osip2\nist.c': No such file or directory
26>c1 : fatal error C1083: Cannot open source file: '..\..\sqlite-source-3_3_6\os_unix.c': No such file or directory
27>nist_fsm.c
26>os_win.c
27>c1 : fatal error C1083: Cannot open source file: '..\..\libosip2-2.2.2\src\osip2\nist_fsm.c': No such file or directory
26>c1 : fatal error C1083: Cannot open source file: '..\..\sqlite-source-3_3_6\os_win.c': No such file or directory
27>osip.c
26>Generating Code...
26>Compiling...
27>c1 : fatal error C1083: Cannot open source file: '..\..\libosip2-2.2.2\src\osip2\osip.c': No such file or directory
26>pager.c
27>osip_dialog.c
27>c1 : fatal error C1083: Cannot open source file: '..\..\libosip2-2.2.2\src\osip2\osip_dialog.c': No such file or directory
26>c1 : fatal error C1083: Cannot open source file: '..\..\sqlite-source-3_3_6\pager.c': No such file or directory
27>osip_event.c
26>parse.c
27>c1 : fatal error C1083: Cannot open source file: '..\..\libosip2-2.2.2\src\osip2\osip_event.c': No such file or directory
26>c1 : fatal error C1083: Cannot open source file: '..\..\sqlite-source-3_3_6\parse.c': No such file or directory
27>osip_negotiation.c
26>pragma.c
26>c1 : fatal error C1083: Cannot open source file: '..\..\sqlite-source-3_3_6\pragma.c': No such file or directory
27>c1 : fatal error C1083: Cannot open source file: '..\..\libosip2-2.2.2\src\osip2\osip_negotiation.c': No such file or directory
26>prepare.c
27>osip_time.c
27>c1 : fatal error C1083: Cannot open source file: '..\..\libosip2-2.2.2\src\osip2\osip_time.c': No such file or directory
26>c1 : fatal error C1083: Cannot open source file: '..\..\sqlite-source-3_3_6\prepare.c': No such file or directory
27>osip_transaction.c
26>printf.c
26>c1 : fatal error C1083: Cannot open source file: '..\..\sqlite-source-3_3_6\printf.c': No such file or directory
27>c1 : fatal error C1083: Cannot open source file: '..\..\libosip2-2.2.2\src\osip2\osip_transaction.c': No such file or directory
26>random.c
27>port_condv.c
26>c1 : fatal error C1083: Cannot open source file: '..\..\sqlite-source-3_3_6\random.c': No such file or directory
27>c1 : fatal error C1083: Cannot open source file: '..\..\libosip2-2.2.2\src\osip2\port_condv.c': No such file or directory
26>select.c
27>port_fifo.c
27>c1 : fatal error C1083: Cannot open source file: '..\..\libosip2-2.2.2\src\osip2\port_fifo.c': No such file or directory
26>c1 : fatal error C1083: Cannot open source file: '..\..\sqlite-source-3_3_6\select.c': No such file or directory
27>port_sema.c
26>shell.c
26>c1 : fatal error C1083: Cannot open source file: '..\..\sqlite-source-3_3_6\shell.c': No such file or directory
27>c1 : fatal error C1083: Cannot open source file: '..\..\libosip2-2.2.2\src\osip2\port_sema.c': No such file or directory
26>table.c
27>port_thread.c
27>c1 : fatal error C1083: Cannot open source file: '..\..\libosip2-2.2.2\src\osip2\port_thread.c': No such file or directory
26>c1 : fatal error C1083: Cannot open source file: '..\..\sqlite-source-3_3_6\table.c': No such file or directory
27>Generating Code...
26>tokenize.c
26>c1 : fatal error C1083: Cannot open source file: '..\..\sqlite-source-3_3_6\tokenize.c': No such file or directory
27>Build log was saved at "file://c:\Documents and Settings\rob\My Documents\FreeSwitch\libs\win32\exosip\Debug\BuildLog.htm"
26>trigger.c
27>osip2 - 19 error(s), 0 warning(s)
26>c1 : fatal error C1083: Cannot open source file: '..\..\sqlite-source-3_3_6\trigger.c': No such file or directory
26>update.c
26>c1 : fatal error C1083: Cannot open source file: '..\..\sqlite-source-3_3_6\update.c': No such file or directory
26>utf.c
26>c1 : fatal error C1083: Cannot open source file: '..\..\sqlite-source-3_3_6\utf.c': No such file or directory
26>util.c
26>c1 : fatal error C1083: Cannot open source file: '..\..\sqlite-source-3_3_6\util.c': No such file or directory
26>vacuum.c
26>c1 : fatal error C1083: Cannot open source file: '..\..\sqlite-source-3_3_6\vacuum.c': No such file or directory
26>vdbe.c
26>c1 : fatal error C1083: Cannot open source file: '..\..\sqlite-source-3_3_6\vdbe.c': No such file or directory
26>vdbeapi.c
26>c1 : fatal error C1083: Cannot open source file: '..\..\sqlite-source-3_3_6\vdbeapi.c': No such file or directory
26>vdbeaux.c
28>------ Build started: Project: Download LIBSNDFILE, Configuration: Debug Win32 ------
26>c1 : fatal error C1083: Cannot open source file: '..\..\sqlite-source-3_3_6\vdbeaux.c': No such file or directory
26>vdbefifo.c
28>Downloading LIBSNDFILE.
26>c1 : fatal error C1083: Cannot open source file: '..\..\sqlite-source-3_3_6\vdbefifo.c': No such file or directory
26>vdbemem.c
26>c1 : fatal error C1083: Cannot open source file: '..\..\sqlite-source-3_3_6\vdbemem.c': No such file or directory
28>Downloading: http://svn.freeswitch.org/downloads/libs/libsndfile-1.0.16.tar.gz
26>Generating Code...
26>Compiling...
26>where.c
26>c1 : fatal error C1083: Cannot open source file: '..\..\sqlite-source-3_3_6\where.c': No such file or directory
26>Generating Code...
26>Build log was saved at "file://c:\Documents and Settings\rob\My Documents\FreeSwitch\libs\win32\sqlite\Debug DLL\BuildLog.htm"
26>libsqlite - 41 error(s), 0 warning(s)
28>Extracting: C:\Documents and Settings\rob\My Documents\FreeSwitch\libs\libsndfile-1.0.16.tar.gz
28>c:\Documents and Settings\rob\My Documents\FreeSwitch\libs\win32\util.vbs(99, 2) WshShell.Exec: C:\Documents and Settings\rob\My Documents\FreeSwitch\libs\win32\tmp2122.bat is not a valid Win32 application.
29>------ Build started: Project: mDNSResponder static library, Configuration: Debug Win32 ------
29>Compiling...
28>Build log was saved at "file://c:\Documents and Settings\rob\My Documents\FreeSwitch\libs\win32\Debug\BuildLog Download LIBSNDFILE.htm"
28>Download LIBSNDFILE - 0 error(s), 0 warning(s)
29>DNSServices.c
29>c1 : fatal error C1083: Cannot open source file: '..\..\howl-1.0.0\src\lib\mdnsresponder\DNSServices.c': No such file or directory
29>mDNS.c
29>c1 : fatal error C1083: Cannot open source file: '..\..\howl-1.0.0\src\lib\mdnsresponder\mDNS.c': No such file or directory
29>mDNSPlatform.c
30>------ Build started: Project: PAStaticWMME, Configuration: Debug Win32 ------
29>c1 : fatal error C1083: Cannot open source file: '..\..\howl-1.0.0\src\lib\mdnsresponder\mDNSPlatform.c': No such file or directory
29>mDNSServant.c
30>Compiling...
29>c1 : fatal error C1083: Cannot open source file: '..\..\howl-1.0.0\src\lib\mdnsresponder\mDNSServant.c': No such file or directory
30>pa_lib.c
29>win32_mdns.c
29>c1 : fatal error C1083: Cannot open source file: '..\..\howl-1.0.0\src\lib\mdnsresponder\win32\win32_mdns.c': No such file or directory
30>c1 : fatal error C1083: Cannot open source file: '..\..\portaudio_v18_1\pa_common\pa_lib.c': No such file or directory
29>Generating Code...
30>pa_win_wmme.c
30>c1 : fatal error C1083: Cannot open source file: '..\..\portaudio_v18_1\pa_win_wmme\pa_win_wmme.c': No such file or directory
29>Build log was saved at "file://c:\Documents and Settings\rob\My Documents\FreeSwitch\libs\win32\howl\Debug Static\BuildLog.htm"
30>Generating Code...
29>mDNSResponder static library - 5 error(s), 0 warning(s)
30>Build log was saved at "file://c:\Documents and Settings\rob\My Documents\FreeSwitch\libs\win32\portaudio\Debug\BuildLog.htm"
30>PAStaticWMME - 2 error(s), 0 warning(s)
31>------ Build started: Project: libsndfile, Configuration: Debug Win32 ------
31>Compiling...
31>aiff.c
31>c1 : fatal error C1083: Cannot open source file: '..\..\libsndfile-1.0.16\src\aiff.c': No such file or directory
31>alaw.c
31>c1 : fatal error C1083: Cannot open source file: '..\..\libsndfile-1.0.16\src\alaw.c': No such file or directory
31>au.c
31>c1 : fatal error C1083: Cannot open source file: '..\..\libsndfile-1.0.16\src\au.c': No such file or directory
31>avr.c
32>------ Build started: Project: curllib, Configuration: Debug Win32 ------
31>c1 : fatal error C1083: Cannot open source file: '..\..\libsndfile-1.0.16\src\avr.c': No such file or directory
31>broadcast.c
32>Compiling...
31>c1 : fatal error C1083: Cannot open source file: '..\..\libsndfile-1.0.16\src\broadcast.c': No such file or directory
32>base64.c
31>caf.c
31>c1 : fatal error C1083: Cannot open source file: '..\..\libsndfile-1.0.16\src\caf.c': No such file or directory
32>c1 : fatal error C1083: Cannot open source file: '..\..\curl-7.15.2\lib\base64.c': No such file or directory
31>command.c
32>connect.c
32>c1 : fatal error C1083: Cannot open source file: '..\..\curl-7.15.2\lib\connect.c': No such file or directory
31>c1 : fatal error C1083: Cannot open source file: '..\..\libsndfile-1.0.16\src\command.c': No such file or directory
32>content_encoding.c
31>common.c
32>c1 : fatal error C1083: Cannot open source file: '..\..\curl-7.15.2\lib\content_encoding.c': No such file or directory
31>.\common.c(26) : fatal error C1083: Cannot open include file: 'sfendian.h': No such file or directory
31>dither.c
32>cookie.c
32>c1 : fatal error C1083: Cannot open source file: '..\..\curl-7.15.2\lib\cookie.c': No such file or directory
31>c1 : fatal error C1083: Cannot open source file: '..\..\libsndfile-1.0.16\src\dither.c': No such file or directory
32>dict.c
31>double64.c
31>c1 : fatal error C1083: Cannot open source file: '..\..\libsndfile-1.0.16\src\double64.c': No such file or directory
32>c1 : fatal error C1083: Cannot open source file: '..\..\curl-7.15.2\lib\dict.c': No such file or directory
31>dwd.c
32>easy.c
32>c1 : fatal error C1083: Cannot open source file: '..\..\curl-7.15.2\lib\easy.c': No such file or directory
31>c1 : fatal error C1083: Cannot open source file: '..\..\libsndfile-1.0.16\src\dwd.c': No such file or directory
32>escape.c
31>dwvw.c
31>c1 : fatal error C1083: Cannot open source file: '..\..\libsndfile-1.0.16\src\dwvw.c': No such file or directory
32>c1 : fatal error C1083: Cannot open source file: '..\..\curl-7.15.2\lib\escape.c': No such file or directory
32>file.c
31>file_io.c
31>c1 : fatal error C1083: Cannot open source file: '..\..\libsndfile-1.0.16\src\file_io.c': No such file or directory
32>c1 : fatal error C1083: Cannot open source file: '..\..\curl-7.15.2\lib\file.c': No such file or directory
31>flac.c
32>formdata.c
32>c1 : fatal error C1083: Cannot open source file: '..\..\curl-7.15.2\lib\formdata.c': No such file or directory
31>c1 : fatal error C1083: Cannot open source file: '..\..\libsndfile-1.0.16\src\flac.c': No such file or directory
32>ftp.c
31>float32.c
32>c1 : fatal error C1083: Cannot open source file: '..\..\curl-7.15.2\lib\ftp.c': No such file or directory
31>c1 : fatal error C1083: Cannot open source file: '..\..\libsndfile-1.0.16\src\float32.c': No such file or directory
32>getenv.c
31>gsm610.c
32>c1 : fatal error C1083: Cannot open source file: '..\..\curl-7.15.2\lib\getenv.c': No such file or directory
31>c1 : fatal error C1083: Cannot open source file: '..\..\libsndfile-1.0.16\src\gsm610.c': No such file or directory
32>getinfo.c
31>htk.c
32>c1 : fatal error C1083: Cannot open source file: '..\..\curl-7.15.2\lib\getinfo.c': No such file or directory
31>c1 : fatal error C1083: Cannot open source file: '..\..\libsndfile-1.0.16\src\htk.c': No such file or directory
32>gtls.c
31>ima_adpcm.c
31>c1 : fatal error C1083: Cannot open source file: '..\..\libsndfile-1.0.16\src\ima_adpcm.c': No such file or directory
32>c1 : fatal error C1083: Cannot open source file: '..\..\curl-7.15.2\lib\gtls.c': No such file or directory
32>hash.c
31>ircam.c
31>c1 : fatal error C1083: Cannot open source file: '..\..\libsndfile-1.0.16\src\ircam.c': No such file or directory
32>c1 : fatal error C1083: Cannot open source file: '..\..\curl-7.15.2\lib\hash.c': No such file or directory
31>mat4.c
32>hostares.c
32>c1 : fatal error C1083: Cannot open source file: '..\..\curl-7.15.2\lib\hostares.c': No such file or directory
31>c1 : fatal error C1083: Cannot open source file: '..\..\libsndfile-1.0.16\src\mat4.c': No such file or directory
32>hostasyn.c
31>Generating Code...
31>Compiling...
32>c1 : fatal error C1083: Cannot open source file: '..\..\curl-7.15.2\lib\hostasyn.c': No such file or directory
31>mat5.c
32>hostip.c
32>c1 : fatal error C1083: Cannot open source file: '..\..\curl-7.15.2\lib\hostip.c': No such file or directory
31>c1 : fatal error C1083: Cannot open source file: '..\..\libsndfile-1.0.16\src\mat5.c': No such file or directory
32>hostip4.c
31>ms_adpcm.c
31>c1 : fatal error C1083: Cannot open source file: '..\..\libsndfile-1.0.16\src\ms_adpcm.c': No such file or directory
32>c1 : fatal error C1083: Cannot open source file: '..\..\curl-7.15.2\lib\hostip4.c': No such file or directory
31>nist.c
32>hostip6.c
32>c1 : fatal error C1083: Cannot open source file: '..\..\curl-7.15.2\lib\hostip6.c': No such file or directory
31>c1 : fatal error C1083: Cannot open source file: '..\..\libsndfile-1.0.16\src\nist.c': No such file or directory
32>hostsyn.c
31>ogg.c
31>c1 : fatal error C1083: Cannot open source file: '..\..\libsndfile-1.0.16\src\ogg.c': No such file or directory
32>c1 : fatal error C1083: Cannot open source file: '..\..\curl-7.15.2\lib\hostsyn.c': No such file or directory
31>paf.c
32>Generating Code...
32>Compiling...
32>hostthre.c
32>c1 : fatal error C1083: Cannot open source file: '..\..\curl-7.15.2\lib\hostthre.c': No such file or directory
32>http.c
32>c1 : fatal error C1083: Cannot open source file: '..\..\curl-7.15.2\lib\http.c': No such file or directory
31>c1 : fatal error C1083: Cannot open source file: '..\..\libsndfile-1.0.16\src\paf.c': No such file or directory
32>http_chunks.c
31>pcm.c
31>c1 : fatal error C1083: Cannot open source file: '..\..\libsndfile-1.0.16\src\pcm.c': No such file or directory
32>c1 : fatal error C1083: Cannot open source file: '..\..\curl-7.15.2\lib\http_chunks.c': No such file or directory
31>pvf.c
32>http_digest.c
32>c1 : fatal error C1083: Cannot open source file: '..\..\curl-7.15.2\lib\http_digest.c': No such file or directory
31>c1 : fatal error C1083: Cannot open source file: '..\..\libsndfile-1.0.16\src\pvf.c': No such file or directory
32>http_negotiate.c
31>raw.c
31>c1 : fatal error C1083: Cannot open source file: '..\..\libsndfile-1.0.16\src\raw.c': No such file or directory
32>c1 : fatal error C1083: Cannot open source file: '..\..\curl-7.15.2\lib\http_negotiate.c': No such file or directory
31>rx2.c
32>http_ntlm.c
31>c1 : fatal error C1083: Cannot open source file: '..\..\libsndfile-1.0.16\src\rx2.c': No such file or directory
32>c1 : fatal error C1083: Cannot open source file: '..\..\curl-7.15.2\lib\http_ntlm.c': No such file or directory
31>sd2.c
32>if2ip.c
32>c1 : fatal error C1083: Cannot open source file: '..\..\curl-7.15.2\lib\if2ip.c': No such file or directory
31>c1 : fatal error C1083: Cannot open source file: '..\..\libsndfile-1.0.16\src\sd2.c': No such file or directory
32>inet_ntop.c
31>sds.c
31>c1 : fatal error C1083: Cannot open source file: '..\..\libsndfile-1.0.16\src\sds.c': No such file or directory
32>c1 : fatal error C1083: Cannot open source file: '..\..\curl-7.15.2\lib\inet_ntop.c': No such file or directory
32>inet_pton.c
31>sndfile.c
31>c1 : fatal error C1083: Cannot open source file: '..\..\libsndfile-1.0.16\src\sndfile.c': No such file or directory
31>strings.c
31>c1 : fatal error C1083: Cannot open source file: '..\..\libsndfile-1.0.16\src\strings.c': No such file or directory
32>c1 : fatal error C1083: Cannot open source file: '..\..\curl-7.15.2\lib\inet_pton.c': No such file or directory
31>svx.c
32>krb4.c
32>c1 : fatal error C1083: Cannot open source file: '..\..\curl-7.15.2\lib\krb4.c': No such file or directory
31>c1 : fatal error C1083: Cannot open source file: '..\..\libsndfile-1.0.16\src\svx.c': No such file or directory
32>ldap.c
31>txw.c
32>c1 : fatal error C1083: Cannot open source file: '..\..\curl-7.15.2\lib\ldap.c': No such file or directory
31>c1 : fatal error C1083: Cannot open source file: '..\..\libsndfile-1.0.16\src\txw.c': No such file or directory
32>llist.c
31>ulaw.c
31>c1 : fatal error C1083: Cannot open source file: '..\..\libsndfile-1.0.16\src\ulaw.c': No such file or directory
32>c1 : fatal error C1083: Cannot open source file: '..\..\curl-7.15.2\lib\llist.c': No such file or directory
31>voc.c
32>md5.c
31>c1 : fatal error C1083: Cannot open source file: '..\..\libsndfile-1.0.16\src\voc.c': No such file or directory
32>c1 : fatal error C1083: Cannot open source file: '..\..\curl-7.15.2\lib\md5.c': No such file or directory
31>vox_adpcm.c
32>memdebug.c
31>c1 : fatal error C1083: Cannot open source file: '..\..\libsndfile-1.0.16\src\vox_adpcm.c': No such file or directory
32>c1 : fatal error C1083: Cannot open source file: '..\..\curl-7.15.2\lib\memdebug.c': No such file or directory
31>w64.c
32>mprintf.c
31>c1 : fatal error C1083: Cannot open source file: '..\..\libsndfile-1.0.16\src\w64.c': No such file or directory
32>c1 : fatal error C1083: Cannot open source file: '..\..\curl-7.15.2\lib\mprintf.c': No such file or directory
31>wav.c
32>multi.c
31>c1 : fatal error C1083: Cannot open source file: '..\..\libsndfile-1.0.16\src\wav.c': No such file or directory
32>c1 : fatal error C1083: Cannot open source file: '..\..\curl-7.15.2\lib\multi.c': No such file or directory
32>netrc.c
31>Generating Code...
31>Compiling...
31>wav_w64.c
31>c1 : fatal error C1083: Cannot open source file: '..\..\libsndfile-1.0.16\src\wav_w64.c': No such file or directory
32>c1 : fatal error C1083: Cannot open source file: '..\..\curl-7.15.2\lib\netrc.c': No such file or directory
32>parsedate.c
31>wve.c
32>c1 : fatal error C1083: Cannot open source file: '..\..\curl-7.15.2\lib\parsedate.c': No such file or directory
31>c1 : fatal error C1083: Cannot open source file: '..\..\libsndfile-1.0.16\src\wve.c': No such file or directory
32>progress.c
31>xi.c
32>c1 : fatal error C1083: Cannot open source file: '..\..\curl-7.15.2\lib\progress.c': No such file or directory
31>c1 : fatal error C1083: Cannot open source file: '..\..\libsndfile-1.0.16\src\xi.c': No such file or directory
32>security.c
31>add.c
31>c1 : fatal error C1083: Cannot open source file: '..\..\libsndfile-1.0.16\src\gsm610\add.c': No such file or directory
32>c1 : fatal error C1083: Cannot open source file: '..\..\curl-7.15.2\lib\security.c': No such file or directory
31>code.c
32>Generating Code...
32>Compiling...
31>c1 : fatal error C1083: Cannot open source file: '..\..\libsndfile-1.0.16\src\gsm610\code.c': No such file or directory
32>select.c
31>decode.c
31>c1 : fatal error C1083: Cannot open source file: '..\..\libsndfile-1.0.16\src\gsm610\decode.c': No such file or directory
32>c1 : fatal error C1083: Cannot open source file: '..\..\curl-7.15.2\lib\select.c': No such file or directory
31>gsm_create.c
32>sendf.c
31>c1 : fatal error C1083: Cannot open source file: '..\..\libsndfile-1.0.16\src\gsm610\gsm_create.c': No such file or directory
32>c1 : fatal error C1083: Cannot open source file: '..\..\curl-7.15.2\lib\sendf.c': No such file or directory
31>gsm_decode.c
32>share.c
31>c1 : fatal error C1083: Cannot open source file: '..\..\libsndfile-1.0.16\src\gsm610\gsm_decode.c': No such file or directory
32>c1 : fatal error C1083: Cannot open source file: '..\..\curl-7.15.2\lib\share.c': No such file or directory
31>gsm_destroy.c
32>speedcheck.c
31>c1 : fatal error C1083: Cannot open source file: '..\..\libsndfile-1.0.16\src\gsm610\gsm_destroy.c': No such file or directory
32>c1 : fatal error C1083: Cannot open source file: '..\..\curl-7.15.2\lib\speedcheck.c': No such file or directory
32>sslgen.c
31>gsm_encode.c
31>c1 : fatal error C1083: Cannot open source file: '..\..\libsndfile-1.0.16\src\gsm610\gsm_encode.c': No such file or directory
32>c1 : fatal error C1083: Cannot open source file: '..\..\curl-7.15.2\lib\sslgen.c': No such file or directory
31>gsm_option.c
32>ssluse.c
31>c1 : fatal error C1083: Cannot open source file: '..\..\libsndfile-1.0.16\src\gsm610\gsm_option.c': No such file or directory
32>c1 : fatal error C1083: Cannot open source file: '..\..\curl-7.15.2\lib\ssluse.c': No such file or directory
31>long_term.c
32>strequal.c
31>c1 : fatal error C1083: Cannot open source file: '..\..\libsndfile-1.0.16\src\gsm610\long_term.c': No such file or directory
32>c1 : fatal error C1083: Cannot open source file: '..\..\curl-7.15.2\lib\strequal.c': No such file or directory
31>lpc.c
32>strerror.c
32>c1 : fatal error C1083: Cannot open source file: '..\..\curl-7.15.2\lib\strerror.c': No such file or directory
31>c1 : fatal error C1083: Cannot open source file: '..\..\libsndfile-1.0.16\src\gsm610\lpc.c': No such file or directory
32>strtok.c
31>preprocess.c
32>c1 : fatal error C1083: Cannot open source file: '..\..\curl-7.15.2\lib\strtok.c': No such file or directory
31>c1 : fatal error C1083: Cannot open source file: '..\..\libsndfile-1.0.16\src\gsm610\preprocess.c': No such file or directory
32>strtoofft.c
31>rpe.c
32>c1 : fatal error C1083: Cannot open source file: '..\..\curl-7.15.2\lib\strtoofft.c': No such file or directory
31>c1 : fatal error C1083: Cannot open source file: '..\..\libsndfile-1.0.16\src\gsm610\rpe.c': No such file or directory
32>telnet.c
31>short_term.c
32>c1 : fatal error C1083: Cannot open source file: '..\..\curl-7.15.2\lib\telnet.c': No such file or directory
31>c1 : fatal error C1083: Cannot open source file: '..\..\libsndfile-1.0.16\src\gsm610\short_term.c': No such file or directory
32>tftp.c
31>table.c
32>c1 : fatal error C1083: Cannot open source file: '..\..\curl-7.15.2\lib\tftp.c': No such file or directory
31>c1 : fatal error C1083: Cannot open source file: '..\..\libsndfile-1.0.16\src\gsm610\table.c': No such file or directory
32>timeval.c
31>g721.c
31>c1 : fatal error C1083: Cannot open source file: '..\..\libsndfile-1.0.16\src\g72x\g721.c': No such file or directory
32>c1 : fatal error C1083: Cannot open source file: '..\..\curl-7.15.2\lib\timeval.c': No such file or directory
31>g723_16.c
32>transfer.c
31>c1 : fatal error C1083: Cannot open source file: '..\..\libsndfile-1.0.16\src\g72x\g723_16.c': No such file or directory
32>c1 : fatal error C1083: Cannot open source file: '..\..\curl-7.15.2\lib\transfer.c': No such file or directory
31>g723_24.c
32>url.c
32>c1 : fatal error C1083: Cannot open source file: '..\..\curl-7.15.2\lib\url.c': No such file or directory
31>c1 : fatal error C1083: Cannot open source file: '..\..\libsndfile-1.0.16\src\g72x\g723_24.c': No such file or directory
32>version.c
31>Generating Code...
31>Compiling...
31>g723_40.c
32>c1 : fatal error C1083: Cannot open source file: '..\..\curl-7.15.2\lib\version.c': No such file or directory
31>c1 : fatal error C1083: Cannot open source file: '..\..\libsndfile-1.0.16\src\g72x\g723_40.c': No such file or directory
32>Generating Code...
31>g72x.c
31>c1 : fatal error C1083: Cannot open source file: '..\..\libsndfile-1.0.16\src\g72x\g72x.c': No such file or directory
32>Creating browse information file...
31>Generating Code...
31>Build log was saved at "file://c:\Documents and Settings\rob\My Documents\FreeSwitch\libs\win32\libsndfile\Debug\BuildLog.htm"
31>libsndfile - 62 error(s), 0 warning(s)
32>Microsoft Browse Information Maintenance Utility Version 8.00.50727
32>Copyright (C) Microsoft Corporation. All rights reserved.
32>BSCMAKE: error BK1506 : cannot open file '.\debug\base64.sbr': No such file or directory
32>Build log was saved at "file://c:\Documents and Settings\rob\My Documents\FreeSwitch\libs\win32\curl\Debug\BuildLog.htm"
32>curllib - 57 error(s), 0 warning(s)
33>------ Build started: Project: libdingaling, Configuration: Debug Win32 ------
33>Compiling...
34>------ Build started: Project: libspeex, Configuration: Debug Win32 ------
34>Compiling...
33>libdingaling.c
33>.\src\libdingaling.c(37) : fatal error C1083: Cannot open include file: 'iksemel.h': No such file or directory
34>vq.c
34>c1 : fatal error C1083: Cannot open source file: '..\..\speex-1.1.11.1\libspeex\vq.c': No such file or directory
33>Build log was saved at "file://c:\Documents and Settings\rob\My Documents\FreeSwitch\libs\libdingaling\Debug\BuildLog.htm"
34>vbr.c
33>libdingaling - 1 error(s), 0 warning(s)
34>c1 : fatal error C1083: Cannot open source file: '..\..\speex-1.1.11.1\libspeex\vbr.c': No such file or directory
34>stereo.c
34>c1 : fatal error C1083: Cannot open source file: '..\..\speex-1.1.11.1\libspeex\stereo.c': No such file or directory
34>speex_header.c
34>c1 : fatal error C1083: Cannot open source file: '..\..\speex-1.1.11.1\libspeex\speex_header.c': No such file or directory
34>speex_callbacks.c
34>c1 : fatal error C1083: Cannot open source file: '..\..\speex-1.1.11.1\libspeex\speex_callbacks.c': No such file or directory
34>speex.c
34>c1 : fatal error C1083: Cannot open source file: '..\..\speex-1.1.11.1\libspeex\speex.c': No such file or directory
34>smallft.c
35>------ Build started: Project: js, Configuration: Debug Win32 ------
34>c1 : fatal error C1083: Cannot open source file: '..\..\speex-1.1.11.1\libspeex\smallft.c': No such file or directory
34>sb_celp.c
35>Compiling...
34>c1 : fatal error C1083: Cannot open source file: '..\..\speex-1.1.11.1\libspeex\sb_celp.c': No such file or directory
35>jsapi.c
34>quant_lsp.c
34>c1 : fatal error C1083: Cannot open source file: '..\..\speex-1.1.11.1\libspeex\quant_lsp.c': No such file or directory
35>c1 : fatal error C1083: Cannot open source file: '..\..\js20051231\src\jsapi.c': No such file or directory
34>preprocess.c
35>jsarena.c
35>c1 : fatal error C1083: Cannot open source file: '..\..\js20051231\src\jsarena.c': No such file or directory
35>jsarray.c
35>c1 : fatal error C1083: Cannot open source file: '..\..\js20051231\src\jsarray.c': No such file or directory
35>jsatom.c
35>c1 : fatal error C1083: Cannot open source file: '..\..\js20051231\src\jsatom.c': No such file or directory
34>c1 : fatal error C1083: Cannot open source file: '..\..\speex-1.1.11.1\libspeex\preprocess.c': No such file or directory
35>jsbool.c
34>nb_celp.c
34>c1 : fatal error C1083: Cannot open source file: '..\..\speex-1.1.11.1\libspeex\nb_celp.c': No such file or directory
35>c1 : fatal error C1083: Cannot open source file: '..\..\js20051231\src\jsbool.c': No such file or directory
34>modes.c
35>jscntxt.c
35>c1 : fatal error C1083: Cannot open source file: '..\..\js20051231\src\jscntxt.c': No such file or directory
34>c1 : fatal error C1083: Cannot open source file: '..\..\speex-1.1.11.1\libspeex\modes.c': No such file or directory
35>jsdate.c
34>misc.c
34>c1 : fatal error C1083: Cannot open source file: '..\..\speex-1.1.11.1\libspeex\misc.c': No such file or directory
35>c1 : fatal error C1083: Cannot open source file: '..\..\js20051231\src\jsdate.c': No such file or directory
34>math_approx.c
35>jsdbgapi.c
34>c1 : fatal error C1083: Cannot open source file: '..\..\speex-1.1.11.1\libspeex\math_approx.c': No such file or directory
35>c1 : fatal error C1083: Cannot open source file: '..\..\js20051231\src\jsdbgapi.c': No such file or directory
34>ltp.c
35>jsdhash.c
35>c1 : fatal error C1083: Cannot open source file: '..\..\js20051231\src\jsdhash.c': No such file or directory
34>c1 : fatal error C1083: Cannot open source file: '..\..\speex-1.1.11.1\libspeex\ltp.c': No such file or directory
35>jsdtoa.c
34>lsp_tables_nb.c
35>c1 : fatal error C1083: Cannot open source file: '..\..\js20051231\src\jsdtoa.c': No such file or directory
34>c1 : fatal error C1083: Cannot open source file: '..\..\speex-1.1.11.1\libspeex\lsp_tables_nb.c': No such file or directory
35>jsemit.c
34>lsp.c
34>c1 : fatal error C1083: Cannot open source file: '..\..\speex-1.1.11.1\libspeex\lsp.c': No such file or directory
35>c1 : fatal error C1083: Cannot open source file: '..\..\js20051231\src\jsemit.c': No such file or directory
34>lpc.c
35>jsexn.c
35>c1 : fatal error C1083: Cannot open source file: '..\..\js20051231\src\jsexn.c': No such file or directory
34>c1 : fatal error C1083: Cannot open source file: '..\..\speex-1.1.11.1\libspeex\lpc.c': No such file or directory
35>jsfun.c
34>high_lsp_tables.c
35>c1 : fatal error C1083: Cannot open source file: '..\..\js20051231\src\jsfun.c': No such file or directory
34>c1 : fatal error C1083: Cannot open source file: '..\..\speex-1.1.11.1\libspeex\high_lsp_tables.c': No such file or directory
35>jsgc.c
34>hexc_table.c
35>c1 : fatal error C1083: Cannot open source file: '..\..\js20051231\src\jsgc.c': No such file or directory
34>c1 : fatal error C1083: Cannot open source file: '..\..\speex-1.1.11.1\libspeex\hexc_table.c': No such file or directory
35>jshash.c
34>Generating Code...
35>c1 : fatal error C1083: Cannot open source file: '..\..\js20051231\src\jshash.c': No such file or directory
34>Compiling...
35>jsinterp.c
35>c1 : fatal error C1083: Cannot open source file: '..\..\js20051231\src\jsinterp.c': No such file or directory
34>hexc_10_32_table.c
35>jslock.c
35>c1 : fatal error C1083: Cannot open source file: '..\..\js20051231\src\jslock.c': No such file or directory
34>c1 : fatal error C1083: Cannot open source file: '..\..\speex-1.1.11.1\libspeex\hexc_10_32_table.c': No such file or directory
35>jslog2.c
34>gain_table_lbr.c
34>c1 : fatal error C1083: Cannot open source file: '..\..\speex-1.1.11.1\libspeex\gain_table_lbr.c': No such file or directory
35>c1 : fatal error C1083: Cannot open source file: '..\..\js20051231\src\jslog2.c': No such file or directory
34>gain_table.c
35>jslong.c
35>c1 : fatal error C1083: Cannot open source file: '..\..\js20051231\src\jslong.c': No such file or directory
34>c1 : fatal error C1083: Cannot open source file: '..\..\speex-1.1.11.1\libspeex\gain_table.c': No such file or directory
35>jsmath.c
34>filters.c
34>c1 : fatal error C1083: Cannot open source file: '..\..\speex-1.1.11.1\libspeex\filters.c': No such file or directory
35>c1 : fatal error C1083: Cannot open source file: '..\..\js20051231\src\jsmath.c': No such file or directory
34>exc_8_128_table.c
35>Generating Code...
35>Compiling...
34>c1 : fatal error C1083: Cannot open source file: '..\..\speex-1.1.11.1\libspeex\exc_8_128_table.c': No such file or directory
35>jsnum.c
35>c1 : fatal error C1083: Cannot open source file: '..\..\js20051231\src\jsnum.c': No such file or directory
34>exc_5_64_table.c
35>jsobj.c
34>c1 : fatal error C1083: Cannot open source file: '..\..\speex-1.1.11.1\libspeex\exc_5_64_table.c': No such file or directory
35>c1 : fatal error C1083: Cannot open source file: '..\..\js20051231\src\jsobj.c': No such file or directory
34>exc_5_256_table.c
35>jsopcode.c
34>c1 : fatal error C1083: Cannot open source file: '..\..\speex-1.1.11.1\libspeex\exc_5_256_table.c': No such file or directory
35>c1 : fatal error C1083: Cannot open source file: '..\..\js20051231\src\jsopcode.c': No such file or directory
34>exc_20_32_table.c
35>jsparse.c
35>c1 : fatal error C1083: Cannot open source file: '..\..\js20051231\src\jsparse.c': No such file or directory
34>c1 : fatal error C1083: Cannot open source file: '..\..\speex-1.1.11.1\libspeex\exc_20_32_table.c': No such file or directory
35>jsprf.c
34>exc_10_32_table.c
34>c1 : fatal error C1083: Cannot open source file: '..\..\speex-1.1.11.1\libspeex\exc_10_32_table.c': No such file or directory
35>c1 : fatal error C1083: Cannot open source file: '..\..\js20051231\src\jsprf.c': No such file or directory
34>exc_10_16_table.c
35>jsregexp.c
35>c1 : fatal error C1083: Cannot open source file: '..\..\js20051231\src\jsregexp.c': No such file or directory
34>c1 : fatal error C1083: Cannot open source file: '..\..\speex-1.1.11.1\libspeex\exc_10_16_table.c': No such file or directory
35>jsscan.c
34>cb_search.c
35>c1 : fatal error C1083: Cannot open source file: '..\..\js20051231\src\jsscan.c': No such file or directory
34>c1 : fatal error C1083: Cannot open source file: '..\..\speex-1.1.11.1\libspeex\cb_search.c': No such file or directory
35>jsscope.c
34>bits.c
34>c1 : fatal error C1083: Cannot open source file: '..\..\speex-1.1.11.1\libspeex\bits.c': No such file or directory
35>c1 : fatal error C1083: Cannot open source file: '..\..\js20051231\src\jsscope.c': No such file or directory
34>Generating Code...
35>jsscript.c
35>c1 : fatal error C1083: Cannot open source file: '..\..\js20051231\src\jsscript.c': No such file or directory
34>Build log was saved at "file://c:\Documents and Settings\rob\My Documents\FreeSwitch\libs\win32\speex\Debug\BuildLog.htm"
35>jsstr.c
34>libspeex - 32 error(s), 0 warning(s)
35>c1 : fatal error C1083: Cannot open source file: '..\..\js20051231\src\jsstr.c': No such file or directory
35>jsutil.c
35>c1 : fatal error C1083: Cannot open source file: '..\..\js20051231\src\jsutil.c': No such file or directory
35>jsxdrapi.c
35>c1 : fatal error C1083: Cannot open source file: '..\..\js20051231\src\jsxdrapi.c': No such file or directory
35>jsxml.c
35>c1 : fatal error C1083: Cannot open source file: '..\..\js20051231\src\jsxml.c': No such file or directory
35>prmjtime.c
35>c1 : fatal error C1083: Cannot open source file: '..\..\js20051231\src\prmjtime.c': No such file or directory
35>Generating Code...
36>------ Build started: Project: Download SOFIA, Configuration: Debug Win32 ------
36>Downloading SOFIA.
35>Build log was saved at "file://c:\Documents and Settings\rob\My Documents\FreeSwitch\libs\win32\js\Debug\BuildLog.htm"
35>js - 34 error(s), 0 warning(s)
36>Downloading: http://svn.freeswitch.org/downloads/libs/sofia-sip.tar.gz
36>Extracting: C:\Documents and Settings\rob\My Documents\FreeSwitch\libs\sofia-sip.tar.gz
36>c:\Documents and Settings\rob\My Documents\FreeSwitch\libs\win32\util.vbs(99, 2) WshShell.Exec: C:\Documents and Settings\rob\My Documents\FreeSwitch\libs\win32\tmp4595.bat is not a valid Win32 application.
37>------ Build started: Project: Abyss, Configuration: Debug Win32 ------
37>Compiling...
36>Build log was saved at "file://c:\Documents and Settings\rob\My Documents\FreeSwitch\libs\win32\Debug\BuildLog Download SOFIA.htm"
36>Download SOFIA - 0 error(s), 0 warning(s)
37>conf.c
37>c1 : fatal error C1083: Cannot open source file: '..\..\xmlrpc-c-1.03.14\lib\abyss\src\conf.c': No such file or directory
37>conn.c
37>c1 : fatal error C1083: Cannot open source file: '..\..\xmlrpc-c-1.03.14\lib\abyss\src\conn.c': No such file or directory
37>data.c
37>c1 : fatal error C1083: Cannot open source file: '..\..\xmlrpc-c-1.03.14\lib\abyss\src\data.c': No such file or directory
37>file.c
37>c1 : fatal error C1083: Cannot open source file: '..\..\xmlrpc-c-1.03.14\lib\abyss\src\file.c': No such file or directory
37>http.c
37>c1 : fatal error C1083: Cannot open source file: '..\..\xmlrpc-c-1.03.14\lib\abyss\src\http.c': No such file or directory
37>server.c
37>c1 : fatal error C1083: Cannot open source file: '..\..\xmlrpc-c-1.03.14\lib\abyss\src\server.c': No such file or directory
37>socket.c
38>------ Build started: Project: pthread, Configuration: Debug Win32 ------
37>c1 : fatal error C1083: Cannot open source file: '..\..\xmlrpc-c-1.03.14\lib\abyss\src\socket.c': No such file or directory
37>thread.c
38>Compiling...
37>c1 : fatal error C1083: Cannot open source file: '..\..\xmlrpc-c-1.03.14\lib\abyss\src\thread.c': No such file or directory
38>pthread.c
37>token.c
37>c1 : fatal error C1083: Cannot open source file: '..\..\xmlrpc-c-1.03.14\lib\abyss\src\token.c': No such file or directory
38>c1 : fatal error C1083: Cannot open source file: '..\..\pthreads-w32-2-7-0-release\pthread.c': No such file or directory
37>Generating Code...
38>Build log was saved at "file://c:\Documents and Settings\rob\My Documents\FreeSwitch\libs\win32\pthread\Debug\BuildLog.htm"
38>pthread - 1 error(s), 0 warning(s)
37>Build log was saved at "file://c:\Documents and Settings\rob\My Documents\FreeSwitch\libs\win32\xmlrpc\Debug\BuildLog.htm"
37>Abyss - 9 error(s), 0 warning(s)
39>------ Build started: Project: FreeSwitchCoreLib, Configuration: Debug Win32 ------
40>------ Build started: Project: xml, Configuration: Debug Win32 ------
39>Generating switch_version.h
40>Creating config.h from winconfig.h
39>c:\Documents and Settings\rob\My Documents\FreeSwitch\libs\win32\util.vbs(224, 2) WshShell.Exec: C:\Documents and Settings\rob\My Documents\FreeSwitch\w32\Library\tmpVersion.Bat is not a valid Win32 application.
40>Creating expat.h from expat.h.in
39>Compiling...
39>switch_buffer.c
39>c:\Documents and Settings\rob\My Documents\FreeSwitch\src\include\switch_apr.h(42) : fatal error C1083: Cannot open include file: 'apr.h': No such file or directory
40>Compiling...
39>switch_buffer.c
39>c:\Documents and Settings\rob\My Documents\FreeSwitch\src\include\switch_apr.h(42) : fatal error C1083: Cannot open include file: 'apr.h': No such file or directory
40>xmltok.c
39>Build log was saved at "file://c:\Documents and Settings\rob\My Documents\FreeSwitch\w32\Library\Debug\BuildLog FreeSwitchCoreLib.htm"
39>FreeSwitchCoreLib - 2 error(s), 0 warning(s)
40>c1 : fatal error C1083: Cannot open source file: '..\..\apr-util-1.2.7\xml\expat\lib\xmltok.c': No such file or directory
40>xmlrole.c
40>c1 : fatal error C1083: Cannot open source file: '..\..\apr-util-1.2.7\xml\expat\lib\xmlrole.c': No such file or directory
40>xmlparse.c
40>c1 : fatal error C1083: Cannot open source file: '..\..\apr-util-1.2.7\xml\expat\lib\xmlparse.c': No such file or directory
40>Generating Code...
41>------ Build started: Project: eXosip, Configuration: Debug Win32 ------
40>Build log was saved at "file://c:\Documents and Settings\rob\My Documents\FreeSwitch\libs\win32\apr-util\Debug\BuildLog.htm"
40>xml - 3 error(s), 0 warning(s)
41>Compiling...
41>udp.c
41>c1 : fatal error C1083: Cannot open source file: '..\..\libexosip2-2.2.2\src\udp.c': No such file or directory
41>sdp_offans.c
41>c1 : fatal error C1083: Cannot open source file: '..\..\libexosip2-2.2.2\src\sdp_offans.c': No such file or directory
41>misc.c
41>c1 : fatal error C1083: Cannot open source file: '..\..\libexosip2-2.2.2\src\misc.c': No such file or directory
41>jsubscribe.c
41>c1 : fatal error C1083: Cannot open source file: '..\..\libexosip2-2.2.2\src\jsubscribe.c': No such file or directory
41>jresponse.c
42>------ Build started: Project: mod_event_test, Configuration: Debug Win32 ------
41>c1 : fatal error C1083: Cannot open source file: '..\..\libexosip2-2.2.2\src\jresponse.c': No such file or directory
41>jrequest.c
42>Compiling...
41>c1 : fatal error C1083: Cannot open source file: '..\..\libexosip2-2.2.2\src\jrequest.c': No such file or directory
42>mod_event_test.c
41>jreg.c
41>c1 : fatal error C1083: Cannot open source file: '..\..\libexosip2-2.2.2\src\jreg.c': No such file or directory
42>c:\Documents and Settings\rob\My Documents\FreeSwitch\src\include\switch_apr.h(42) : fatal error C1083: Cannot open include file: 'apr.h': No such file or directory
41>jpublish.c
42>Build log was saved at "file://c:\Documents and Settings\rob\My Documents\FreeSwitch\src\mod\event_handlers\mod_event_test\Debug\BuildLog.htm"
42>mod_event_test - 1 error(s), 0 warning(s)
41>c1 : fatal error C1083: Cannot open source file: '..\..\libexosip2-2.2.2\src\jpublish.c': No such file or directory
41>jpipe.c
41>c1 : fatal error C1083: Cannot open source file: '..\..\libexosip2-2.2.2\src\jpipe.c': No such file or directory
41>jnotify.c
43>------ Build started: Project: mod_bridgecall, Configuration: Debug Win32 ------
41>c1 : fatal error C1083: Cannot open source file: '..\..\libexosip2-2.2.2\src\jnotify.c': No such file or directory
43>Compiling...
41>jevents.c
41>c1 : fatal error C1083: Cannot open source file: '..\..\libexosip2-2.2.2\src\jevents.c': No such file or directory
43>mod_bridgecall.c
41>jdialog.c
41>c1 : fatal error C1083: Cannot open source file: '..\..\libexosip2-2.2.2\src\jdialog.c': No such file or directory
43>c:\Documents and Settings\rob\My Documents\FreeSwitch\src\include\switch_apr.h(42) : fatal error C1083: Cannot open include file: 'apr.h': No such file or directory
41>jcallback.c
43>Build log was saved at "file://c:\Documents and Settings\rob\My Documents\FreeSwitch\src\mod\applications\mod_bridgecall\Debug\BuildLog.htm"
43>mod_bridgecall - 1 error(s), 0 warning(s)
41>c1 : fatal error C1083: Cannot open source file: '..\..\libexosip2-2.2.2\src\jcallback.c': No such file or directory
41>jcall.c
41>c1 : fatal error C1083: Cannot open source file: '..\..\libexosip2-2.2.2\src\jcall.c': No such file or directory
41>jauth.c
44>------ Build started: Project: mod_sndfile, Configuration: Debug Win32 ------
41>c1 : fatal error C1083: Cannot open source file: '..\..\libexosip2-2.2.2\src\jauth.c': No such file or directory
41>inet_ntop.c
44>Compiling...
41>c1 : fatal error C1083: Cannot open source file: '..\..\libexosip2-2.2.2\src\inet_ntop.c': No such file or directory
44>mod_sndfile.c
41>eXutils.c
41>c1 : fatal error C1083: Cannot open source file: '..\..\libexosip2-2.2.2\src\eXutils.c': No such file or directory
44>c:\Documents and Settings\rob\My Documents\FreeSwitch\src\include\switch_apr.h(42) : fatal error C1083: Cannot open include file: 'apr.h': No such file or directory
41>eXtransport.c
44>Build log was saved at "file://c:\Documents and Settings\rob\My Documents\FreeSwitch\src\mod\formats\mod_sndfile\Debug\BuildLog.htm"
44>mod_sndfile - 1 error(s), 0 warning(s)
41>c1 : fatal error C1083: Cannot open source file: '..\..\libexosip2-2.2.2\src\eXtransport.c': No such file or directory
41>eXsubscription_api.c
41>c1 : fatal error C1083: Cannot open source file: '..\..\libexosip2-2.2.2\src\eXsubscription_api.c': No such file or directory
41>eXregister_api.c
41>c1 : fatal error C1083: Cannot open source file: '..\..\libexosip2-2.2.2\src\eXregister_api.c': No such file or directory
41>Generating Code...
41>Compiling...
41>eXrefer_api.c
41>c1 : fatal error C1083: Cannot open source file: '..\..\libexosip2-2.2.2\src\eXrefer_api.c': No such file or directory
41>eXpublish_api.c
41>c1 : fatal error C1083: Cannot open source file: '..\..\libexosip2-2.2.2\src\eXpublish_api.c': No such file or directory
41>eXosip.c
41>c1 : fatal error C1083: Cannot open source file: '..\..\libexosip2-2.2.2\src\eXosip.c': No such file or directory
45>------ Build started: Project: mod_xmpp_event, Configuration: Debug Win32 ------
41>eXoptions_api.c
41>c1 : fatal error C1083: Cannot open source file: '..\..\libexosip2-2.2.2\src\eXoptions_api.c': No such file or directory
41>eXmessage_api.c
45>Compiling...
41>c1 : fatal error C1083: Cannot open source file: '..\..\libexosip2-2.2.2\src\eXmessage_api.c': No such file or directory
45>mod_xmpp_event.c
41>eXinsubscription_api.c
41>c1 : fatal error C1083: Cannot open source file: '..\..\libexosip2-2.2.2\src\eXinsubscription_api.c': No such file or directory
45>c:\Documents and Settings\rob\My Documents\FreeSwitch\src\include\switch_apr.h(42) : fatal error C1083: Cannot open include file: 'apr.h': No such file or directory
41>eXconf.c
45>Build log was saved at "file://c:\Documents and Settings\rob\My Documents\FreeSwitch\src\mod\event_handlers\mod_xmpp_event\Debug\BuildLog.htm"
45>mod_xmpp_event - 1 error(s), 0 warning(s)
41>c1 : fatal error C1083: Cannot open source file: '..\..\libexosip2-2.2.2\src\eXconf.c': No such file or directory
41>eXcall_api.c
41>c1 : fatal error C1083: Cannot open source file: '..\..\libexosip2-2.2.2\src\eXcall_api.c': No such file or directory
41>Generating Code...
46>------ Build started: Project: libsofia_sip_ua_static, Configuration: Debug Win32 ------
41>Creating browse information file...
41>Microsoft Browse Information Maintenance Utility Version 8.00.50727
41>Copyright (C) Microsoft Corporation. All rights reserved.
46>Performing Pre-Build Event...
41>BSCMAKE: error BK1506 : cannot open file '.\debug\eXcall_api.sbr': No such file or directory
46>c:\Documents and Settings\rob\My Documents\FreeSwitch\libs\win32\util.vbs(188, 2) Microsoft VBScript runtime error: Path not found
41>Build log was saved at "file://c:\Documents and Settings\rob\My Documents\FreeSwitch\libs\win32\exosip\Debug\BuildLog.htm"
46>The system cannot find the path specified.
41>eXosip - 29 error(s), 0 warning(s)
46>The system cannot find the path specified.
46>Project : error PRJ0019: A tool returned an error code from "Performing Pre-Build Event..."
46>Creating browse information file...
46>Microsoft Browse Information Maintenance Utility Version 8.00.50727
46>Copyright (C) Microsoft Corporation. All rights reserved.
46>BSCMAKE: error BK1506 : cannot open file '.\debug\inet_ntop.sbr': No such file or directory
46>Build log was saved at "file://c:\Documents and Settings\rob\My Documents\FreeSwitch\libs\win32\sofia\Debug\BuildLog.htm"
46>libsofia_sip_ua_static - 2 error(s), 0 warning(s)
47>------ Build started: Project: mod_gsm, Configuration: Debug Win32 ------
47>Compiling...
47>mod_gsm.c
47>c:\Documents and Settings\rob\My Documents\FreeSwitch\src\include\switch_apr.h(42) : fatal error C1083: Cannot open include file: 'apr.h': No such file or directory
47>Build log was saved at "file://c:\Documents and Settings\rob\My Documents\FreeSwitch\src\mod\codecs\mod_gsm\Debug\BuildLog.htm"
47>mod_gsm - 1 error(s), 0 warning(s)
48>------ Build started: Project: FreeSwitchConsole, Configuration: Debug Win32 ------
48>Compiling...
48>switch.c
48>c:\Documents and Settings\rob\My Documents\FreeSwitch\src\include\switch_apr.h(42) : fatal error C1083: Cannot open include file: 'apr.h': No such file or directory
48>Build log was saved at "file://c:\Documents and Settings\rob\My Documents\FreeSwitch\w32\Console\Debug\BuildLog FreeSwitchConsole.htm"
48>FreeSwitchConsole - 1 error(s), 0 warning(s)
49>------ Build started: Project: mod_g711, Configuration: Debug Win32 ------
49>Compiling...
49>mod_g711.c
49>c:\Documents and Settings\rob\My Documents\FreeSwitch\src\include\switch_apr.h(42) : fatal error C1083: Cannot open include file: 'apr.h': No such file or directory
49>Build log was saved at "file://c:\Documents and Settings\rob\My Documents\FreeSwitch\src\mod\codecs\mod_g711\Debug\BuildLog.htm"
49>mod_g711 - 1 error(s), 0 warning(s)
50>------ Build started: Project: mod_iax, Configuration: Debug Win32 ------
50>Compiling...
50>mod_iax.c
50>c:\Documents and Settings\rob\My Documents\FreeSwitch\src\include\switch_apr.h(42) : fatal error C1083: Cannot open include file: 'apr.h': No such file or directory
50>Build log was saved at "file://c:\Documents and Settings\rob\My Documents\FreeSwitch\src\mod\endpoints\mod_iax\Debug\BuildLog.htm"
50>mod_iax - 1 error(s), 0 warning(s)
51>------ Build started: Project: mod_playback, Configuration: Debug Win32 ------
51>Compiling...
51>mod_playback.c
51>c:\Documents and Settings\rob\My Documents\FreeSwitch\src\include\switch_apr.h(42) : fatal error C1083: Cannot open include file: 'apr.h': No such file or directory
51>Build log was saved at "file://c:\Documents and Settings\rob\My Documents\FreeSwitch\src\mod\applications\mod_playback\Debug\BuildLog.htm"
51>mod_playback - 1 error(s), 0 warning(s)
52>------ Build started: Project: mod_dptools, Configuration: Debug Win32 ------
52>Compiling...
53>------ Build started: Project: mod_conference, Configuration: Debug Win32 ------
52>mod_dptools.c
53>Compiling...
52>c:\Documents and Settings\rob\My Documents\FreeSwitch\src\include\switch_apr.h(42) : fatal error C1083: Cannot open include file: 'apr.h': No such file or directory
53>mod_conference.c
52>Build log was saved at "file://c:\Documents and Settings\rob\My Documents\FreeSwitch\src\mod\applications\mod_dptools\Debug\BuildLog.htm"
52>mod_dptools - 1 error(s), 0 warning(s)
53>c:\Documents and Settings\rob\My Documents\FreeSwitch\src\include\switch_apr.h(42) : fatal error C1083: Cannot open include file: 'apr.h': No such file or directory
53>Build log was saved at "file://c:\Documents and Settings\rob\My Documents\FreeSwitch\src\mod\applications\mod_conference\Debug\BuildLog.htm"
54>------ Build started: Project: mod_rss, Configuration: Debug Win32 ------
53>mod_conference - 1 error(s), 0 warning(s)
54>Compiling...
54>mod_rss.c
54>c:\Documents and Settings\rob\My Documents\FreeSwitch\src\include\switch_apr.h(42) : fatal error C1083: Cannot open include file: 'apr.h': No such file or directory
54>Build log was saved at "file://c:\Documents and Settings\rob\My Documents\FreeSwitch\src\mod\applications\mod_rss\Debug\BuildLog.htm"
54>mod_rss - 1 error(s), 0 warning(s)
55>------ Build started: Project: mod_xml_rpc, Configuration: Debug Win32 ------
55>Compiling...
55>mod_xml_rpc.c
55>c:\Documents and Settings\rob\My Documents\FreeSwitch\src\include\switch_apr.h(42) : fatal error C1083: Cannot open include file: 'apr.h': No such file or directory
55>Build log was saved at "file://c:\Documents and Settings\rob\My Documents\FreeSwitch\src\mod\xml_int\mod_xml_rpc\Debug\BuildLog.htm"
55>mod_xml_rpc - 1 error(s), 0 warning(s)
56>------ Build started: Project: mod_PortAudio, Configuration: Debug Win32 ------
56>Compiling...
56>mod_portaudio.c
56>c:\Documents and Settings\rob\My Documents\FreeSwitch\src\include\switch_apr.h(42) : fatal error C1083: Cannot open include file: 'apr.h': No such file or directory
56>pablio.c
56>.\pablio.c(48) : fatal error C1083: Cannot open include file: 'portaudio.h': No such file or directory
56>Generating Code...
56>Build log was saved at "file://c:\Documents and Settings\rob\My Documents\FreeSwitch\src\mod\endpoints\mod_portaudio\Debug\BuildLog.htm"
56>mod_PortAudio - 2 error(s), 0 warning(s)
57>------ Build started: Project: mod_console, Configuration: Debug Win32 ------
57>Compiling...
57>mod_console.c
57>c:\Documents and Settings\rob\My Documents\FreeSwitch\src\include\switch_apr.h(42) : fatal error C1083: Cannot open include file: 'apr.h': No such file or directory
57>Build log was saved at "file://c:\Documents and Settings\rob\My Documents\FreeSwitch\src\mod\loggers\mod_console\Debug\BuildLog.htm"
57>mod_console - 1 error(s), 0 warning(s)
58>------ Build started: Project: mod_l16, Configuration: Debug Win32 ------
58>Compiling...
58>mod_l16.c
58>c:\Documents and Settings\rob\My Documents\FreeSwitch\src\include\switch_apr.h(42) : fatal error C1083: Cannot open include file: 'apr.h': No such file or directory
58>Build log was saved at "file://c:\Documents and Settings\rob\My Documents\FreeSwitch\src\mod\codecs\mod_l16\Debug\BuildLog.htm"
58>mod_l16 - 1 error(s), 0 warning(s)
59>------ Build started: Project: mod_commands, Configuration: Debug Win32 ------
59>Compiling...
59>mod_commands.c
60>------ Build started: Project: mod_dingaling, Configuration: Debug Win32 ------
60>Compiling...
59>c:\Documents and Settings\rob\My Documents\FreeSwitch\src\include\switch_apr.h(42) : fatal error C1083: Cannot open include file: 'apr.h': No such file or directory
60>mod_dingaling.c
59>Build log was saved at "file://c:\Documents and Settings\rob\My Documents\FreeSwitch\src\mod\applications\mod_commands\Debug\BuildLog.htm"
59>mod_commands - 1 error(s), 0 warning(s)
60>c:\Documents and Settings\rob\My Documents\FreeSwitch\src\include\switch_apr.h(42) : fatal error C1083: Cannot open include file: 'apr.h': No such file or directory
60>Build log was saved at "file://c:\Documents and Settings\rob\My Documents\FreeSwitch\src\mod\endpoints\mod_dingaling\Debug\BuildLog.htm"
60>mod_dingaling - 1 error(s), 0 warning(s)
61>------ Build started: Project: mod_ilbc, Configuration: Debug Win32 ------
61>Compiling...
61>mod_ilbc.c
61>c:\Documents and Settings\rob\My Documents\FreeSwitch\src\include\switch_apr.h(42) : fatal error C1083: Cannot open include file: 'apr.h': No such file or directory
61>Build log was saved at "file://c:\Documents and Settings\rob\My Documents\FreeSwitch\src\mod\codecs\mod_ilbc\Debug\BuildLog.htm"
61>mod_ilbc - 1 error(s), 0 warning(s)
62>------ Build started: Project: mod_echo, Configuration: Debug Win32 ------
62>Compiling...
62>mod_echo.c
62>c:\Documents and Settings\rob\My Documents\FreeSwitch\src\include\switch_apr.h(42) : fatal error C1083: Cannot open include file: 'apr.h': No such file or directory
62>Build log was saved at "file://c:\Documents and Settings\rob\My Documents\FreeSwitch\src\mod\applications\mod_echo\Debug\BuildLog.htm"
62>mod_echo - 1 error(s), 0 warning(s)
63>------ Build started: Project: mod_softtimer, Configuration: Debug Win32 ------
63>Compiling...
63>mod_softtimer.c
63>c:\Documents and Settings\rob\My Documents\FreeSwitch\src\include\switch_apr.h(42) : fatal error C1083: Cannot open include file: 'apr.h': No such file or directory
63>Build log was saved at "file://c:\Documents and Settings\rob\My Documents\FreeSwitch\src\mod\timers\mod_softtimer\Debug\BuildLog.htm"
63>mod_softtimer - 1 error(s), 0 warning(s)
64>------ Build started: Project: mod_speex, Configuration: Debug Win32 ------
64>Compiling...
64>mod_speex.c
64>c:\Documents and Settings\rob\My Documents\FreeSwitch\src\include\switch_apr.h(42) : fatal error C1083: Cannot open include file: 'apr.h': No such file or directory
64>Build log was saved at "file://c:\Documents and Settings\rob\My Documents\FreeSwitch\src\mod\codecs\mod_speex\Debug\BuildLog.htm"
64>mod_speex - 1 error(s), 0 warning(s)
65>------ Build started: Project: mod_woomera, Configuration: Debug Win32 ------
65>Compiling...
65>mod_woomera.c
65>c:\Documents and Settings\rob\My Documents\FreeSwitch\src\include\switch_apr.h(42) : fatal error C1083: Cannot open include file: 'apr.h': No such file or directory
65>Build log was saved at "file://c:\Documents and Settings\rob\My Documents\FreeSwitch\src\mod\endpoints\mod_woomera\Debug\BuildLog.htm"
65>mod_woomera - 1 error(s), 0 warning(s)
66>------ Build started: Project: mod_dialplan_xml, Configuration: Debug Win32 ------
66>Compiling...
66>mod_dialplan_xml.c
66>c:\Documents and Settings\rob\My Documents\FreeSwitch\src\include\switch_apr.h(42) : fatal error C1083: Cannot open include file: 'apr.h': No such file or directory
66>Build log was saved at "file://c:\Documents and Settings\rob\My Documents\FreeSwitch\src\mod\dialplans\mod_dialplan_xml\Debug\BuildLog.htm"
66>mod_dialplan_xml - 1 error(s), 0 warning(s)
67>------ Build started: Project: mod_spidermonkey, Configuration: Debug Win32 ------
67>Compiling...
68>------ Build started: Project: mod_ldap, Configuration: Debug MS-LDAP Win32 ------
68>Compiling...
67>mod_spidermonkey.c
68>mod_ldap.c
67>c:\Documents and Settings\rob\My Documents\FreeSwitch\src\include\switch_apr.h(42) : fatal error C1083: Cannot open include file: 'apr.h': No such file or directory
68>c:\Documents and Settings\rob\My Documents\FreeSwitch\src\include\switch_apr.h(42) : fatal error C1083: Cannot open include file: 'apr.h': No such file or directory
67>Build log was saved at "file://c:\Documents and Settings\rob\My Documents\FreeSwitch\src\mod\languages\mod_spidermonkey\Debug\BuildLog.htm"
68>Build log was saved at "file://c:\Documents and Settings\rob\My Documents\FreeSwitch\src\mod\directories\mod_ldap\Debug MS-LDAP\BuildLog.htm"
68>mod_ldap - 1 error(s), 0 warning(s)
67>mod_spidermonkey - 1 error(s), 0 warning(s)
69>------ Build started: Project: mod_exosip, Configuration: Debug Win32 ------
70>------ Build started: Project: mod_event_multicast, Configuration: Debug Win32 ------
69>Compiling...
70>Compiling...
69>mod_exosip.c
70>mod_event_multicast.c
69>c:\Documents and Settings\rob\My Documents\FreeSwitch\src\include\switch_apr.h(42) : fatal error C1083: Cannot open include file: 'apr.h': No such file or directory
70>c:\Documents and Settings\rob\My Documents\FreeSwitch\src\include\switch_apr.h(42) : fatal error C1083: Cannot open include file: 'apr.h': No such file or directory
69>Build log was saved at "file://c:\Documents and Settings\rob\My Documents\FreeSwitch\src\mod\endpoints\mod_exosip\Debug\BuildLog.htm"
70>Build log was saved at "file://c:\Documents and Settings\rob\My Documents\FreeSwitch\src\mod\event_handlers\mod_event_multicast\Debug\BuildLog.htm"
70>mod_event_multicast - 1 error(s), 0 warning(s)
69>mod_exosip - 1 error(s), 0 warning(s)
71>------ Build started: Project: mod_dialplan_directory, Configuration: Debug Win32 ------
72>------ Build started: Project: mod_zeroconf, Configuration: Debug Win32 ------
71>Compiling...
72>Compiling...
72>mod_zeroconf.c
71>mod_dialplan_directory.c
72>c:\Documents and Settings\rob\My Documents\FreeSwitch\src\include\switch_apr.h(42) : fatal error C1083: Cannot open include file: 'apr.h': No such file or directory
71>c:\Documents and Settings\rob\My Documents\FreeSwitch\src\include\switch_apr.h(42) : fatal error C1083: Cannot open include file: 'apr.h': No such file or directory
72>Build log was saved at "file://c:\Documents and Settings\rob\My Documents\FreeSwitch\src\mod\event_handlers\mod_zeroconf\Debug\BuildLog.htm"
72>mod_zeroconf - 1 error(s), 0 warning(s)
71>Build log was saved at "file://c:\Documents and Settings\rob\My Documents\FreeSwitch\src\mod\dialplans\mod_dialplan_directory\Debug\BuildLog.htm"
71>mod_dialplan_directory - 1 error(s), 0 warning(s)
73>------ Build started: Project: mod_ivrtest, Configuration: Debug Win32 ------
73>Compiling...
73>mod_ivrtest.c
73>c:\Documents and Settings\rob\My Documents\FreeSwitch\src\include\switch_apr.h(42) : fatal error C1083: Cannot open include file: 'apr.h': No such file or directory
73>Build log was saved at "file://c:\Documents and Settings\rob\My Documents\FreeSwitch\src\mod\applications\mod_ivrtest\Debug\BuildLog.htm"
73>mod_ivrtest - 1 error(s), 0 warning(s)
74>------ Skipped Build: Project: FreeSwitchSetup, Configuration: Debug ------
74>Project not selected to build for this solution configuration
75>------ Skipped Build: Project: docs (Docs\docs), Configuration: Debug Win32 ------
75>Project not selected to build for this solution configuration
76>------ Skipped Build: Project: mod_cepstral, Configuration: Debug Win32 ------
76>Project not selected to build for this solution configuration
77>------ Skipped Build: Project: fs_perl, Configuration: Debug Win32 ------
77>Project not selected to build for this solution configuration
78>------ Skipped Build: Project: mod_perl, Configuration: Debug Win32 ------
78>Project not selected to build for this solution configuration
79>------ Build started: Project: mod_event_socket, Configuration: Debug Win32 ------
80>------ Build started: Project: mod_cdr, Configuration: Debug Win32 ------
80>Compiling...
79>Compiling...
79>mod_event_socket.c
80>basecdr.cpp
79>c:\Documents and Settings\rob\My Documents\FreeSwitch\src\include\switch_apr.h(42) : fatal error C1083: Cannot open include file: 'apr.h': No such file or directory
80>c:\Documents and Settings\rob\My Documents\FreeSwitch\src\include\switch_apr.h(42) : fatal error C1083: Cannot open include file: 'apr.h': No such file or directory
80>baseregistry.cpp
80>c:\Documents and Settings\rob\My Documents\FreeSwitch\src\include\switch_apr.h(42) : fatal error C1083: Cannot open include file: 'apr.h': No such file or directory
80>cdrcontainer.cpp
80>c:\Documents and Settings\rob\My Documents\FreeSwitch\src\include\switch_apr.h(42) : fatal error C1083: Cannot open include file: 'apr.h': No such file or directory
80>csvcdr.cpp
80>c:\Documents and Settings\rob\My Documents\FreeSwitch\src\include\switch_apr.h(42) : fatal error C1083: Cannot open include file: 'apr.h': No such file or directory
80>mod_cdr.cpp
80>c:\Documents and Settings\rob\My Documents\FreeSwitch\src\include\switch_apr.h(42) : fatal error C1083: Cannot open include file: 'apr.h': No such file or directory
79>Build log was saved at "file://c:\Documents and Settings\rob\My Documents\FreeSwitch\src\mod\event_handlers\mod_event_socket\Debug\BuildLog.htm"
80>pddcdr.cpp
79>mod_event_socket - 1 error(s), 0 warning(s)
80>c:\Documents and Settings\rob\My Documents\FreeSwitch\src\include\switch_apr.h(42) : fatal error C1083: Cannot open include file: 'apr.h': No such file or directory
80>Generating Code...
80>Build log was saved at "file://c:\Documents and Settings\rob\My Documents\FreeSwitch\src\mod\event_handlers\mod_cdr\Debug\BuildLog.htm"
80>mod_cdr - 6 error(s), 0 warning(s)
81>------ Build started: Project: mod_sofia, Configuration: Debug Win32 ------
81>Compiling...
81>mod_sofia.c
81>c:\Documents and Settings\rob\My Documents\FreeSwitch\src\include\switch_apr.h(42) : fatal error C1083: Cannot open include file: 'apr.h': No such file or directory
81>Build log was saved at "file://c:\Documents and Settings\rob\My Documents\FreeSwitch\src\mod\endpoints\mod_sofia\Debug\BuildLog.htm"
81>mod_sofia - 1 error(s), 0 warning(s)
82>------ Build started: Project: mod_g726, Configuration: Debug Win32 ------
82>Compiling...
82>mod_g726.c
82>c:\Documents and Settings\rob\My Documents\FreeSwitch\src\include\switch_apr.h(42) : fatal error C1083: Cannot open include file: 'apr.h': No such file or directory
82>Build log was saved at "file://c:\Documents and Settings\rob\My Documents\FreeSwitch\src\mod\codecs\mod_g726\Debug\BuildLog.htm"
82>mod_g726 - 1 error(s), 0 warning(s)
83>------ Build started: Project: mod_g722, Configuration: Debug Win32 ------
83>Compiling...
83>mod_g722.c
83>c:\Documents and Settings\rob\My Documents\FreeSwitch\src\include\switch_apr.h(42) : fatal error C1083: Cannot open include file: 'apr.h': No such file or directory
83>Build log was saved at "file://c:\Documents and Settings\rob\My Documents\FreeSwitch\src\mod\codecs\mod_g722\Debug\BuildLog.htm"
83>mod_g722 - 1 error(s), 0 warning(s)
84>------ Build started: Project: mod_park, Configuration: Debug Win32 ------
84>Compiling...
84>mod_park.c
84>c:\Documents and Settings\rob\My Documents\FreeSwitch\src\include\switch_apr.h(42) : fatal error C1083: Cannot open include file: 'apr.h': No such file or directory
84>Build log was saved at "file://c:\Documents and Settings\rob\My Documents\FreeSwitch\src\mod\applications\mod_park\Debug\BuildLog.htm"
84>mod_park - 1 error(s), 0 warning(s)
85>------ Build started: Project: mod_g723_1, Configuration: Debug Passthrough Win32 ------
85>Compiling...
85>mod_g723_1.c
85>c:\Documents and Settings\rob\My Documents\FreeSwitch\src\include\switch_apr.h(42) : fatal error C1083: Cannot open include file: 'apr.h': No such file or directory
85>Build log was saved at "file://c:\Documents and Settings\rob\My Documents\FreeSwitch\src\mod\codecs\mod_g723_1\Debug Passthrough\BuildLog.htm"
85>mod_g723_1 - 1 error(s), 0 warning(s)
86>------ Build started: Project: mod_g729, Configuration: Debug Passthrough Win32 ------
86>Compiling...
87>------ Build started: Project: mod_native_file, Configuration: Debug Win32 ------
87>Compiling...
86>mod_g729.c
86>c:\Documents and Settings\rob\My Documents\FreeSwitch\src\include\switch_apr.h(42) : fatal error C1083: Cannot open include file: 'apr.h': No such file or directory
87>mod_native_file.c
86>Build log was saved at "file://c:\Documents and Settings\rob\My Documents\FreeSwitch\src\mod\codecs\mod_g729\Debug Passthrough\BuildLog.htm"
86>mod_g729 - 1 error(s), 0 warning(s)
87>c:\Documents and Settings\rob\My Documents\FreeSwitch\src\include\switch_apr.h(42) : fatal error C1083: Cannot open include file: 'apr.h': No such file or directory
87>Build log was saved at "file://c:\Documents and Settings\rob\My Documents\FreeSwitch\src\mod\formats\mod_native_file\Debug\BuildLog.htm"
87>mod_native_file - 1 error(s), 0 warning(s)
88>------ Skipped Build: Project: FreeSwitch.NET, Configuration: Debug Any CPU ------
88>Project not selected to build for this solution configuration
========== Build: 16 succeeded, 66 failed, 8 up-to-date, 6 skipped ==========