rendered paste bodymake -r PARALLELMFLAGS="" CVSOPTS="" -C ../../src/glibc-2.11.1 objdir=`pwd` all
make[1]: Entering directory `/home/tester/gcc_cross_test/src/glibc-2.11.1'
sed '/^[ ]*%/!s/#.*$//;/^[ ]*$/d;s/^[ ]*%/#/' \
csu/Versions iconv/Versions locale/Versions assert/Versions ctype/Versions intl/Versions catgets/Versions math/Versions setjmp/Versions signal/Versions stdlib/Versions stdio-common/Versions libio/Versions dlfcn/Versions malloc/Versions string/Versions wcsmbs/Versions time/Versions dirent/Versions grp/Versions pwd/Versions posix/Versions io/Versions termios/Versions resource/Versions misc/Versions socket/Versions sysvipc/Versions gmon/Versions wctype/Versions shadow/Versions gshadow/Versions argp/Versions crypt/Versions nptl/Versions resolv/Versions nss/Versions rt/Versions debug/Versions libidn/Versions nptl_db/Versions inet/Versions hesiod/Versions sunrpc/Versions nis/Versions streams/Versions login/Versions elf/Versions nptl/sysdeps/unix/sysv/linux/x86_64/Versions sysdeps/unix/sysv/linux/x86_64/Versions sysdeps/unix/sysv/linux/wordsize-64/Versions nptl/sysdeps/unix/sysv/linux/Versions sysdeps/pthread/Versions sysdeps/unix/sysv/linux/Versions sysdeps/unix/sysv/Versions sysdeps/x86_64/Versions sysdeps/wordsize-64/Versions \
| gcc -E -undef -Iinclude -I/home/tester/gcc_cross_test/work/glibc -Isysdeps/x86_64/elf -Inptl/sysdeps/unix/sysv/linux/x86_64 -Isysdeps/unix/sysv/linux/x86_64 -Isysdeps/unix/sysv/linux/wordsize-64 -Inptl/sysdeps/unix/sysv/linux -Inptl/sysdeps/pthread -Isysdeps/pthread -Isysdeps/unix/sysv/linux -Isysdeps/gnu -Isysdeps/unix/common -Isysdeps/unix/mman -Isysdeps/unix/inet -Inptl/sysdeps/unix/sysv -Isysdeps/unix/sysv -Isysdeps/unix/x86_64 -Inptl/sysdeps/unix -Isysdeps/unix -Isysdeps/posix -Isysdeps/x86_64/fpu -Inptl/sysdeps/x86_64 -Isysdeps/x86_64 -Isysdeps/wordsize-64 -Isysdeps/ieee754/ldbl-96 -Isysdeps/ieee754/dbl-64 -Isysdeps/ieee754/flt-32 -Isysdeps/ieee754 -Isysdeps/generic/elf -Isysdeps/generic -Inptl -Ilibio -I. -D_LIBC_REENTRANT -include include/libc-symbols.h -x assembler-with-cpp - \
> /home/tester/gcc_cross_test/work/glibc/Versions.v.iT
In file included from include/tls.h:6,
from <stdin>:1:
nptl/sysdeps/x86_64/tls.h:85:3: error: #error "TLS support is required."
make subdir=csu -C csu ..=../ subdir_lib
make[2]: Entering directory `/home/tester/gcc_cross_test/src/glibc-2.11.1/csu'
sed '/^[ ]*%/!s/#.*$//;/^[ ]*$/d;s/^[ ]*%/#/' \
../csu/Versions ../iconv/Versions ../locale/Versions ../assert/Versions ../ctype/Versions ../intl/Versions ../catgets/Versions ../math/Versions ../setjmp/Versions ../signal/Versions ../stdlib/Versions ../stdio-common/Versions ../libio/Versions ../dlfcn/Versions ../malloc/Versions ../string/Versions ../wcsmbs/Versions ../time/Versions ../dirent/Versions ../grp/Versions ../pwd/Versions ../posix/Versions ../io/Versions ../termios/Versions ../resource/Versions ../misc/Versions ../socket/Versions ../sysvipc/Versions ../gmon/Versions ../wctype/Versions ../shadow/Versions ../gshadow/Versions ../argp/Versions ../crypt/Versions ../nptl/Versions ../resolv/Versions ../nss/Versions ../rt/Versions ../debug/Versions ../libidn/Versions ../nptl_db/Versions ../inet/Versions ../hesiod/Versions ../sunrpc/Versions ../nis/Versions ../streams/Versions ../login/Versions ../elf/Versions ../nptl/sysdeps/unix/sysv/linux/x86_64/Versions ../sysdeps/unix/sysv/linux/x86_64/Versions ../sysdeps/unix/sysv/linux/wordsize-64/Versions ../nptl/sysdeps/unix/sysv/linux/Versions ../sysdeps/pthread/Versions ../sysdeps/unix/sysv/linux/Versions ../sysdeps/unix/sysv/Versions ../sysdeps/x86_64/Versions ../sysdeps/wordsize-64/Versions \
| gcc -E -undef -I../include -I/home/tester/gcc_cross_test/work/glibc/csu -I/home/tester/gcc_cross_test/work/glibc -I../sysdeps/x86_64/elf -I../nptl/sysdeps/unix/sysv/linux/x86_64 -I../sysdeps/unix/sysv/linux/x86_64 -I../sysdeps/unix/sysv/linux/wordsize-64 -I../nptl/sysdeps/unix/sysv/linux -I../nptl/sysdeps/pthread -I../sysdeps/pthread -I../sysdeps/unix/sysv/linux -I../sysdeps/gnu -I../sysdeps/unix/common -I../sysdeps/unix/mman -I../sysdeps/unix/inet -I../nptl/sysdeps/unix/sysv -I../sysdeps/unix/sysv -I../sysdeps/unix/x86_64 -I../nptl/sysdeps/unix -I../sysdeps/unix -I../sysdeps/posix -I../sysdeps/x86_64/fpu -I../nptl/sysdeps/x86_64 -I../sysdeps/x86_64 -I../sysdeps/wordsize-64 -I../sysdeps/ieee754/ldbl-96 -I../sysdeps/ieee754/dbl-64 -I../sysdeps/ieee754/flt-32 -I../sysdeps/ieee754 -I../sysdeps/generic/elf -I../sysdeps/generic -I../nptl -I.. -I../libio -I. -D_LIBC_REENTRANT -include ../include/libc-symbols.h -DHAVE_INITFINI -x assembler-with-cpp - \
> /home/tester/gcc_cross_test/work/glibc/Versions.v.iT
In file included from ../include/tls.h:6,
from <stdin>:1:
../nptl/sysdeps/x86_64/tls.h:85:3: error: #error "TLS support is required."
gawk -f ../scripts/gen-as-const.awk ../sysdeps/unix/sysv/linux/x86_64/ucontext_i.sym \
| gcc -S -o /home/tester/gcc_cross_test/work/glibc/ucontext_i.hT3 -std=gnu99 -fgnu89-inline -O2 -U_FORTIFY_SOURCE -Wall -Winline -Wwrite-strings -fmerge-all-constants -fno-stack-protector -Wstrict-prototypes -I../include -I/home/tester/gcc_cross_test/work/glibc/csu -I/home/tester/gcc_cross_test/work/glibc -I../sysdeps/x86_64/elf -I../nptl/sysdeps/unix/sysv/linux/x86_64 -I../sysdeps/unix/sysv/linux/x86_64 -I../sysdeps/unix/sysv/linux/wordsize-64 -I../nptl/sysdeps/unix/sysv/linux -I../nptl/sysdeps/pthread -I../sysdeps/pthread -I../sysdeps/unix/sysv/linux -I../sysdeps/gnu -I../sysdeps/unix/common -I../sysdeps/unix/mman -I../sysdeps/unix/inet -I../nptl/sysdeps/unix/sysv -I../sysdeps/unix/sysv -I../sysdeps/unix/x86_64 -I../nptl/sysdeps/unix -I../sysdeps/unix -I../sysdeps/posix -I../sysdeps/x86_64/fpu -I../nptl/sysdeps/x86_64 -I../sysdeps/x86_64 -I../sysdeps/wordsize-64 -I../sysdeps/ieee754/ldbl-96 -I../sysdeps/ieee754/dbl-64 -I../sysdeps/ieee754/flt-32 -I../sysdeps/ieee754 -I../sysdeps/generic/elf -I../sysdeps/generic -I../nptl -I.. -I../libio -I. -D_LIBC_REENTRANT -include ../include/libc-symbols.h -DHAVE_INITFINI -x c - \
-MD -MP -MF /home/tester/gcc_cross_test/work/glibc/ucontext_i.h.dT -MT '/home/tester/gcc_cross_test/work/glibc/ucontext_i.h.d /home/tester/gcc_cross_test/work/glibc/ucontext_i.h'
<stdin>: In function dummy:
<stdin>:11: error: REG_RBP undeclared (first use in this function)
<stdin>:11: error: (Each undeclared identifier is reported only once
<stdin>:11: error: for each function it appears in.)
<stdin>:12: error: REG_RSP undeclared (first use in this function)
<stdin>:13: error: REG_RBX undeclared (first use in this function)
<stdin>:14: error: REG_R8 undeclared (first use in this function)
<stdin>:15: error: REG_R9 undeclared (first use in this function)
<stdin>:16: error: REG_R10 undeclared (first use in this function)
<stdin>:17: error: REG_R11 undeclared (first use in this function)
<stdin>:18: error: REG_R12 undeclared (first use in this function)
<stdin>:19: error: REG_R13 undeclared (first use in this function)
<stdin>:20: error: REG_R14 undeclared (first use in this function)
<stdin>:21: error: REG_R15 undeclared (first use in this function)
<stdin>:22: error: REG_RDI undeclared (first use in this function)
<stdin>:23: error: REG_RSI undeclared (first use in this function)
<stdin>:24: error: REG_RDX undeclared (first use in this function)
<stdin>:25: error: REG_RAX undeclared (first use in this function)
<stdin>:26: error: REG_RCX undeclared (first use in this function)
<stdin>:27: error: REG_RIP undeclared (first use in this function)
<stdin>:32: error: struct _libc_fpstate has no member named mxcsr
make[2]: *** [/home/tester/gcc_cross_test/work/glibc/ucontext_i.h] Error 1
make[2]: Leaving directory `/home/tester/gcc_cross_test/src/glibc-2.11.1/csu'
make[1]: *** [csu/subdir_lib] Error 2
make[1]: Leaving directory `/home/tester/gcc_cross_test/src/glibc-2.11.1'
make: *** [all] Error 2