All pastes #1845133 Raw Edit

Untitled

public text v1 · immutable
#1845133 ·published 2010-03-18 23:01 UTC
rendered paste body
This file contains any messages produced by compilers while
running configure, to aid debugging if configure makes a mistake.

It was created by evas configure 0.9.9.063, which was
generated by GNU Autoconf 2.65.  Invocation command line was

  $ ./configure --prefix=/opt/e17 --enable-software-xlib --disable-quartz

## --------- ##
## Platform. ##
## --------- ##

hostname = Leif-Middelschultes-iMac.local
uname -m = i386
uname -r = 10.2.0
uname -s = Darwin
uname -v = Darwin Kernel Version 10.2.0: Tue Nov  3 10:37:10 PST 2009; root:xnu-1486.2.11~1/RELEASE_I386

/usr/bin/uname -p = i386
/bin/uname -X     = unknown

/bin/arch              = unknown
/usr/bin/arch -k       = unknown
/usr/convex/getsysinfo = unknown
/usr/bin/hostinfo      = Mach kernel version:
	 Darwin Kernel Version 10.2.0: Tue Nov  3 10:37:10 PST 2009; root:xnu-1486.2.11~1/RELEASE_I386
Kernel configured for up to 2 processors.
2 processors are physically available.
2 processors are logically available.
Processor type: i486 (Intel 80486)
Processors active: 0 1
Primary memory available: 1.00 gigabytes
Default processor set: 91 tasks, 369 threads, 2 processors
Load average: 3.17, Mach factor: 0.30
/bin/machine           = unknown
/usr/bin/oslevel       = unknown
/bin/universe          = unknown

PATH: /opt/e17/bin
PATH: /opt/local/bin
PATH: /opt/local/sbin
PATH: /usr/bin
PATH: /bin
PATH: /usr/sbin
PATH: /sbin
PATH: /usr/local/bin
PATH: /usr/texbin
PATH: /usr/X11/bin
PATH: /usr/local/git/bin


## ----------- ##
## Core tests. ##
## ----------- ##

configure:3289: checking build system type
configure:3303: result: x86_64-apple-darwin10.2.0
configure:3323: checking host system type
configure:3336: result: x86_64-apple-darwin10.2.0
configure:3404: checking for gcc
configure:3420: found /usr/bin/gcc
configure:3431: result: gcc
configure:3660: checking for C compiler version
configure:3669: gcc --version >&5
i686-apple-darwin10-gcc-4.2.1 (GCC) 4.2.1 (Apple Inc. build 5646) (dot 1)
Copyright (C) 2007 Free Software Foundation, Inc.
This is free software; see the source for copying conditions.  There is NO
warranty; not even for MERCHANTABILITY or FITNESS FOR A PARTICULAR PURPOSE.

configure:3680: $? = 0
configure:3669: gcc -v >&5
Using built-in specs.
Target: i686-apple-darwin10
Configured with: /var/tmp/gcc/gcc-5646.1~2/src/configure --disable-checking --enable-werror --prefix=/usr --mandir=/share/man --enable-languages=c,objc,c++,obj-c++ --program-transform-name=/^[cg][^.-]*$/s/$/-4.2/ --with-slibdir=/usr/lib --build=i686-apple-darwin10 --with-gxx-include-dir=/include/c++/4.2.1 --program-prefix=i686-apple-darwin10- --host=x86_64-apple-darwin10 --target=i686-apple-darwin10
Thread model: posix
gcc version 4.2.1 (Apple Inc. build 5646) (dot 1)
configure:3680: $? = 0
configure:3669: gcc -V >&5
gcc-4.2: argument to `-V' is missing
configure:3680: $? = 1
configure:3669: gcc -qversion >&5
i686-apple-darwin10-gcc-4.2.1: no input files
configure:3680: $? = 1
configure:3700: checking whether the C compiler works
configure:3722: gcc -ggdb -O0   conftest.c  >&5
configure:3726: $? = 0
configure:3775: result: yes
configure:3778: checking for C compiler default output file name
configure:3780: result: a.out
configure:3786: checking for suffix of executables
configure:3793: gcc -o conftest -ggdb -O0   conftest.c  >&5
configure:3797: $? = 0
configure:3819: result: 
configure:3841: checking whether we are cross compiling
configure:3849: gcc -o conftest -ggdb -O0   conftest.c  >&5
configure:3853: $? = 0
configure:3860: ./conftest
configure:3864: $? = 0
configure:3879: result: no
configure:3884: checking for suffix of object files
configure:3906: gcc -c -ggdb -O0  conftest.c >&5
configure:3910: $? = 0
configure:3931: result: o
configure:3935: checking whether we are using the GNU C compiler
configure:3954: gcc -c -ggdb -O0  conftest.c >&5
configure:3954: $? = 0
configure:3963: result: yes
configure:3972: checking whether gcc accepts -g
configure:3992: gcc -c -g  conftest.c >&5
configure:3992: $? = 0
configure:4033: result: yes
configure:4050: checking for gcc option to accept ISO C89
configure:4114: gcc  -c -ggdb -O0  conftest.c >&5
configure:4114: $? = 0
configure:4127: result: none needed
configure:4148: checking for library containing strerror
configure:4179: gcc -o conftest -ggdb -O0   conftest.c  >&5
configure:4179: $? = 0
configure:4196: result: none required
configure:4221: checking for a BSD-compatible install
configure:4289: result: /opt/local/bin/ginstall -c
configure:4300: checking whether build environment is sane
configure:4350: result: yes
configure:4491: checking for a thread-safe mkdir -p
configure:4530: result: /opt/local/bin/gmkdir -p
configure:4543: checking for gawk
configure:4573: result: no
configure:4543: checking for mawk
configure:4573: result: no
configure:4543: checking for nawk
configure:4573: result: no
configure:4543: checking for awk
configure:4559: found /usr/bin/awk
configure:4570: result: awk
configure:4581: checking whether make sets $(MAKE)
configure:4603: result: yes
configure:4633: checking for style of include used by make
configure:4661: result: GNU
configure:4746: checking dependency style of gcc
configure:4856: result: gcc3
configure:5215: checking for a sed that does not truncate output
configure:5279: result: /opt/local/bin/gsed
configure:5297: checking for grep that handles long lines and -e
configure:5355: result: /opt/local/bin/grep
configure:5360: checking for egrep
configure:5422: result: /opt/local/bin/grep -E
configure:5427: checking for fgrep
configure:5489: result: /opt/local/bin/grep -F
configure:5524: checking for ld used by gcc
configure:5591: result: /usr/libexec/gcc/i686-apple-darwin10/4.2.1/ld
configure:5598: checking if the linker (/usr/libexec/gcc/i686-apple-darwin10/4.2.1/ld) is GNU ld
configure:5613: result: no
configure:5625: checking for BSD- or MS-compatible name lister (nm)
configure:5674: result: /usr/bin/nm
configure:5792: checking the name lister (/usr/bin/nm) interface
configure:5799: gcc -c -ggdb -O0  conftest.c >&5
configure:5802: /usr/bin/nm "conftest.o"
configure:5805: output
0000000000000178 D _some_variable
configure:5812: result: BSD nm
configure:5815: checking whether ln -s works
configure:5819: result: yes
configure:5827: checking the maximum length of command line arguments
configure:5947: result: 196608
configure:5964: checking whether the shell understands some XSI constructs
configure:5974: result: yes
configure:5978: checking whether the shell understands "+="
configure:5984: result: yes
configure:6019: checking for /usr/libexec/gcc/i686-apple-darwin10/4.2.1/ld option to reload object files
configure:6026: result: -r
configure:6095: checking for objdump
configure:6122: result: objdump
configure:6151: checking how to recognize dependent libraries
configure:6347: result: pass_all
configure:6407: checking for ar
configure:6423: found /usr/bin/ar
configure:6434: result: ar
configure:6512: checking for strip
configure:6528: found /usr/bin/strip
configure:6539: result: strip
configure:6611: checking for ranlib
configure:6627: found /usr/bin/ranlib
configure:6638: result: ranlib
configure:6728: checking command to parse /usr/bin/nm output from gcc object
configure:6846: gcc -c -ggdb -O0  conftest.c >&5
configure:6849: $? = 0
configure:6853: /usr/bin/nm conftest.o \| sed -n -e 's/^.*[	 ]\([BCDEGRST][BCDEGRST]*\)[	 ][	 ]*\([_A-Za-z][_A-Za-z0-9]*\)$/\1 \2 \2/p' \> conftest.nm
configure:6856: $? = 0
cannot find nm_test_var in conftest.nm
configure:6846: gcc -c -ggdb -O0  conftest.c >&5
configure:6849: $? = 0
configure:6853: /usr/bin/nm conftest.o \| sed -n -e 's/^.*[	 ]\([BCDEGRST][BCDEGRST]*\)[	 ][	 ]*_\([_A-Za-z][_A-Za-z0-9]*\)$/\1 _\2 \2/p' \> conftest.nm
configure:6856: $? = 0
configure:6910: gcc -o conftest -ggdb -O0   conftest.c conftstm.o >&5
configure:6913: $? = 0
configure:6951: result: ok
configure:7215: checking for dsymutil
configure:7231: found /usr/bin/dsymutil
configure:7242: result: dsymutil
configure:7307: checking for nmedit
configure:7323: found /usr/bin/nmedit
configure:7334: result: nmedit
configure:7399: checking for lipo
configure:7415: found /usr/bin/lipo
configure:7426: result: lipo
configure:7491: checking for otool
configure:7507: found /usr/bin/otool
configure:7518: result: otool
configure:7583: checking for otool64
configure:7613: result: no
configure:7658: checking for -single_module linker flag
gcc -ggdb -O0  -o libconftest.dylib -dynamiclib -Wl,-single_module conftest.c
configure:7685: result: yes
configure:7687: checking for -exported_symbols_list linker flag
configure:7707: gcc -o conftest -ggdb -O0   -Wl,-exported_symbols_list,conftest.sym conftest.c  >&5
configure:7707: $? = 0
configure:7717: result: yes
configure:7759: checking how to run the C preprocessor
configure:7790: gcc -E  conftest.c
configure:7790: $? = 0
configure:7804: gcc -E  conftest.c
conftest.c:11:28: error: ac_nonexistent.h: No such file or directory
configure:7804: $? = 1
configure: failed program was:
| /* confdefs.h */
| #define PACKAGE_NAME "evas"
| #define PACKAGE_TARNAME "evas"
| #define PACKAGE_VERSION "0.9.9.063"
| #define PACKAGE_STRING "evas 0.9.9.063"
| #define PACKAGE_BUGREPORT "enlightenment-devel@lists.sourceforge.net"
| #define PACKAGE_URL ""
| #define PACKAGE "evas"
| #define VERSION "0.9.9.063"
| /* end confdefs.h.  */
| #include <ac_nonexistent.h>
configure:7829: result: gcc -E
configure:7849: gcc -E  conftest.c
configure:7849: $? = 0
configure:7863: gcc -E  conftest.c
conftest.c:11:28: error: ac_nonexistent.h: No such file or directory
configure:7863: $? = 1
configure: failed program was:
| /* confdefs.h */
| #define PACKAGE_NAME "evas"
| #define PACKAGE_TARNAME "evas"
| #define PACKAGE_VERSION "0.9.9.063"
| #define PACKAGE_STRING "evas 0.9.9.063"
| #define PACKAGE_BUGREPORT "enlightenment-devel@lists.sourceforge.net"
| #define PACKAGE_URL ""
| #define PACKAGE "evas"
| #define VERSION "0.9.9.063"
| /* end confdefs.h.  */
| #include <ac_nonexistent.h>
configure:7892: checking for ANSI C header files
configure:7912: gcc -c -ggdb -O0  conftest.c >&5
configure:7912: $? = 0
configure:7985: gcc -o conftest -ggdb -O0   conftest.c  >&5
configure:7985: $? = 0
configure:7985: ./conftest
configure:7985: $? = 0
configure:7996: result: yes
configure:8009: checking for sys/types.h
configure:8009: gcc -c -ggdb -O0  conftest.c >&5
configure:8009: $? = 0
configure:8009: result: yes
configure:8009: checking for sys/stat.h
configure:8009: gcc -c -ggdb -O0  conftest.c >&5
configure:8009: $? = 0
configure:8009: result: yes
configure:8009: checking for stdlib.h
configure:8009: gcc -c -ggdb -O0  conftest.c >&5
configure:8009: $? = 0
configure:8009: result: yes
configure:8009: checking for string.h
configure:8009: gcc -c -ggdb -O0  conftest.c >&5
configure:8009: $? = 0
configure:8009: result: yes
configure:8009: checking for memory.h
configure:8009: gcc -c -ggdb -O0  conftest.c >&5
configure:8009: $? = 0
configure:8009: result: yes
configure:8009: checking for strings.h
configure:8009: gcc -c -ggdb -O0  conftest.c >&5
configure:8009: $? = 0
configure:8009: result: yes
configure:8009: checking for inttypes.h
configure:8009: gcc -c -ggdb -O0  conftest.c >&5
configure:8009: $? = 0
configure:8009: result: yes
configure:8009: checking for stdint.h
configure:8009: gcc -c -ggdb -O0  conftest.c >&5
configure:8009: $? = 0
configure:8009: result: yes
configure:8009: checking for unistd.h
configure:8009: gcc -c -ggdb -O0  conftest.c >&5
configure:8009: $? = 0
configure:8009: result: yes
configure:8024: checking for dlfcn.h
configure:8024: gcc -c -ggdb -O0  conftest.c >&5
configure:8024: $? = 0
configure:8024: result: yes
configure:8206: checking for objdir
configure:8221: result: .libs
configure:8517: checking if gcc supports -fno-rtti -fno-exceptions
configure:8535: gcc -c -ggdb -O0  -fno-rtti -fno-exceptions conftest.c >&5
cc1: warning: command line option "-fno-rtti" is valid for C++/ObjC++ but not for C
configure:8539: $? = 0
configure:8552: result: no
configure:8572: checking for gcc option to produce PIC
configure:8844: result: -fno-common -DPIC
configure:8856: checking if gcc PIC flag -fno-common -DPIC works
configure:8874: gcc -c -ggdb -O0  -fno-common -DPIC -DPIC conftest.c >&5
configure:8878: $? = 0
configure:8891: result: yes
configure:8915: checking if gcc static flag -static works
configure:8943: result: no
configure:8958: checking if gcc supports -c -o file.o
configure:8979: gcc -c -ggdb -O0  -o out/conftest2.o conftest.c >&5
configure:8983: $? = 0
configure:9005: result: yes
configure:9013: checking if gcc supports -c -o file.o
configure:9060: result: yes
configure:9093: checking whether the gcc linker (/usr/libexec/gcc/i686-apple-darwin10/4.2.1/ld) supports shared libraries
configure:10079: result: yes
configure:10318: checking dynamic linker characteristics
configure:10969: result: darwin10.2.0 dyld
configure:11071: checking how to hardcode library paths into programs
configure:11096: result: immediate
configure:11616: checking whether stripping libraries is possible
configure:11630: result: yes
configure:11656: checking if libtool supports shared libraries
configure:11658: result: yes
configure:11661: checking whether to build shared libraries
configure:11682: result: yes
configure:11685: checking whether to build static libraries
configure:11689: result: yes
configure:11742: checking for PATH_MAX in limits.h
configure:11759: gcc -c -ggdb -O0  conftest.c >&5
configure:11759: $? = 0
configure:11760: result: yes
configure:11960: checking for gcc
configure:11976: found /usr/bin/gcc
configure:11987: result: gcc
configure:12012: checking for Objective C compiler version
configure:12021: gcc --version >&5
i686-apple-darwin10-gcc-4.2.1 (GCC) 4.2.1 (Apple Inc. build 5646) (dot 1)
Copyright (C) 2007 Free Software Foundation, Inc.
This is free software; see the source for copying conditions.  There is NO
warranty; not even for MERCHANTABILITY or FITNESS FOR A PARTICULAR PURPOSE.

configure:12032: $? = 0
configure:12021: gcc -v >&5
Using built-in specs.
Target: i686-apple-darwin10
Configured with: /var/tmp/gcc/gcc-5646.1~2/src/configure --disable-checking --enable-werror --prefix=/usr --mandir=/share/man --enable-languages=c,objc,c++,obj-c++ --program-transform-name=/^[cg][^.-]*$/s/$/-4.2/ --with-slibdir=/usr/lib --build=i686-apple-darwin10 --with-gxx-include-dir=/include/c++/4.2.1 --program-prefix=i686-apple-darwin10- --host=x86_64-apple-darwin10 --target=i686-apple-darwin10
Thread model: posix
gcc version 4.2.1 (Apple Inc. build 5646) (dot 1)
configure:12032: $? = 0
configure:12021: gcc -V >&5
gcc-4.2: argument to `-V' is missing
configure:12032: $? = 1
configure:12021: gcc -qversion >&5
i686-apple-darwin10-gcc-4.2.1: no input files
configure:12032: $? = 1
configure:12036: checking whether we are using the GNU Objective C compiler
configure:12055: gcc -c   conftest.m >&5
configure:12055: $? = 0
configure:12064: result: yes
configure:12073: checking whether gcc accepts -g
configure:12093: gcc -c -g  conftest.m >&5
configure:12093: $? = 0
configure:12134: result: yes
configure:12159: checking dependency style of gcc
configure:12267: result: gcc3
configure:12285: checking dependency style of gcc
configure:12393: result: gcc3
configure:12411: checking whether the Objective C compiler works
configure:12433: gcc -o conftest -g -O2   conftest.m  >&5
configure:12433: $? = 0
configure:12447: result: yes
configure:12509: checking for g++
configure:12525: found /usr/bin/g++
configure:12536: result: g++
configure:12563: checking for C++ compiler version
configure:12572: g++ --version >&5
i686-apple-darwin10-g++-4.2.1 (GCC) 4.2.1 (Apple Inc. build 5646) (dot 1)
Copyright (C) 2007 Free Software Foundation, Inc.
This is free software; see the source for copying conditions.  There is NO
warranty; not even for MERCHANTABILITY or FITNESS FOR A PARTICULAR PURPOSE.

configure:12583: $? = 0
configure:12572: g++ -v >&5
Using built-in specs.
Target: i686-apple-darwin10
Configured with: /var/tmp/gcc/gcc-5646.1~2/src/configure --disable-checking --enable-werror --prefix=/usr --mandir=/share/man --enable-languages=c,objc,c++,obj-c++ --program-transform-name=/^[cg][^.-]*$/s/$/-4.2/ --with-slibdir=/usr/lib --build=i686-apple-darwin10 --with-gxx-include-dir=/include/c++/4.2.1 --program-prefix=i686-apple-darwin10- --host=x86_64-apple-darwin10 --target=i686-apple-darwin10
Thread model: posix
gcc version 4.2.1 (Apple Inc. build 5646) (dot 1)
configure:12583: $? = 0
configure:12572: g++ -V >&5
g++-4.2: argument to `-V' is missing
configure:12583: $? = 1
configure:12572: g++ -qversion >&5
i686-apple-darwin10-g++-4.2.1: no input files
configure:12583: $? = 1
configure:12587: checking whether we are using the GNU C++ compiler
configure:12606: g++ -c   conftest.cpp >&5
configure:12606: $? = 0
configure:12615: result: yes
configure:12624: checking whether g++ accepts -g
configure:12644: g++ -c -g  conftest.cpp >&5
configure:12644: $? = 0
configure:12685: result: yes
configure:12710: checking dependency style of g++
configure:12820: result: gcc3
configure:12948: checking for C++ compiler version
configure:12957: g++ --version >&5
i686-apple-darwin10-g++-4.2.1 (GCC) 4.2.1 (Apple Inc. build 5646) (dot 1)
Copyright (C) 2007 Free Software Foundation, Inc.
This is free software; see the source for copying conditions.  There is NO
warranty; not even for MERCHANTABILITY or FITNESS FOR A PARTICULAR PURPOSE.

configure:12968: $? = 0
configure:12957: g++ -v >&5
Using built-in specs.
Target: i686-apple-darwin10
Configured with: /var/tmp/gcc/gcc-5646.1~2/src/configure --disable-checking --enable-werror --prefix=/usr --mandir=/share/man --enable-languages=c,objc,c++,obj-c++ --program-transform-name=/^[cg][^.-]*$/s/$/-4.2/ --with-slibdir=/usr/lib --build=i686-apple-darwin10 --with-gxx-include-dir=/include/c++/4.2.1 --program-prefix=i686-apple-darwin10- --host=x86_64-apple-darwin10 --target=i686-apple-darwin10
Thread model: posix
gcc version 4.2.1 (Apple Inc. build 5646) (dot 1)
configure:12968: $? = 0
configure:12957: g++ -V >&5
g++-4.2: argument to `-V' is missing
configure:12968: $? = 1
configure:12957: g++ -qversion >&5
i686-apple-darwin10-g++-4.2.1: no input files
configure:12968: $? = 1
configure:12972: checking whether we are using the GNU C++ compiler
configure:13000: result: yes
configure:13009: checking whether g++ accepts -g
configure:13070: result: yes
configure:13095: checking dependency style of g++
configure:13205: result: gcc3
configure:13228: checking how to run the C++ preprocessor
configure:13255: g++ -E  conftest.cpp
configure:13255: $? = 0
configure:13269: g++ -E  conftest.cpp
conftest.cpp:24:28: error: ac_nonexistent.h: No such file or directory
configure:13269: $? = 1
configure: failed program was:
| /* confdefs.h */
| #define PACKAGE_NAME "evas"
| #define PACKAGE_TARNAME "evas"
| #define PACKAGE_VERSION "0.9.9.063"
| #define PACKAGE_STRING "evas 0.9.9.063"
| #define PACKAGE_BUGREPORT "enlightenment-devel@lists.sourceforge.net"
| #define PACKAGE_URL ""
| #define PACKAGE "evas"
| #define VERSION "0.9.9.063"
| #define STDC_HEADERS 1
| #define HAVE_SYS_TYPES_H 1
| #define HAVE_SYS_STAT_H 1
| #define HAVE_STDLIB_H 1
| #define HAVE_STRING_H 1
| #define HAVE_MEMORY_H 1
| #define HAVE_STRINGS_H 1
| #define HAVE_INTTYPES_H 1
| #define HAVE_STDINT_H 1
| #define HAVE_UNISTD_H 1
| #define HAVE_DLFCN_H 1
| #define LT_OBJDIR ".libs/"
| #define MODULE_ARCH "darwin10.2.0-x86_64-ver-pre-svn-05"
| /* end confdefs.h.  */
| #include <ac_nonexistent.h>
configure:13294: result: g++ -E
configure:13314: g++ -E  conftest.cpp
configure:13314: $? = 0
configure:13328: g++ -E  conftest.cpp
conftest.cpp:24:28: error: ac_nonexistent.h: No such file or directory
configure:13328: $? = 1
configure: failed program was:
| /* confdefs.h */
| #define PACKAGE_NAME "evas"
| #define PACKAGE_TARNAME "evas"
| #define PACKAGE_VERSION "0.9.9.063"
| #define PACKAGE_STRING "evas 0.9.9.063"
| #define PACKAGE_BUGREPORT "enlightenment-devel@lists.sourceforge.net"
| #define PACKAGE_URL ""
| #define PACKAGE "evas"
| #define VERSION "0.9.9.063"
| #define STDC_HEADERS 1
| #define HAVE_SYS_TYPES_H 1
| #define HAVE_SYS_STAT_H 1
| #define HAVE_STDLIB_H 1
| #define HAVE_STRING_H 1
| #define HAVE_MEMORY_H 1
| #define HAVE_STRINGS_H 1
| #define HAVE_INTTYPES_H 1
| #define HAVE_STDINT_H 1
| #define HAVE_UNISTD_H 1
| #define HAVE_DLFCN_H 1
| #define LT_OBJDIR ".libs/"
| #define MODULE_ARCH "darwin10.2.0-x86_64-ver-pre-svn-05"
| /* end confdefs.h.  */
| #include <ac_nonexistent.h>
configure:13496: checking for ld used by g++
configure:13563: result: /usr/libexec/gcc/i686-apple-darwin10/4.2.1/ld
configure:13570: checking if the linker (/usr/libexec/gcc/i686-apple-darwin10/4.2.1/ld) is GNU ld
configure:13585: result: no
configure:13640: checking whether the g++ linker (/usr/libexec/gcc/i686-apple-darwin10/4.2.1/ld) supports shared libraries
configure:14553: result: yes
configure:14581: g++ -c -g -O2  conftest.cpp >&5
configure:14584: $? = 0
configure:14766: checking for g++ option to produce PIC
configure:15083: result: -fno-common -DPIC
configure:15092: checking if g++ PIC flag -fno-common -DPIC works
configure:15110: g++ -c -g -O2  -fno-common -DPIC -DPIC conftest.cpp >&5
configure:15114: $? = 0
configure:15127: result: yes
configure:15148: checking if g++ static flag -static works
configure:15176: result: no
configure:15188: checking if g++ supports -c -o file.o
configure:15209: g++ -c -g -O2  -o out/conftest2.o conftest.cpp >&5
configure:15213: $? = 0
configure:15235: result: yes
configure:15240: checking if g++ supports -c -o file.o
configure:15287: result: yes
configure:15317: checking whether the g++ linker (/usr/libexec/gcc/i686-apple-darwin10/4.2.1/ld) supports shared libraries
configure:15343: result: yes
configure:15480: checking dynamic linker characteristics
configure:16079: result: darwin10.2.0 dyld
configure:16130: checking how to hardcode library paths into programs
configure:16155: result: immediate
configure:16242: checking for gcc
configure:16269: result: gcc
configure:16498: checking for C compiler version
configure:16507: gcc --version >&5
i686-apple-darwin10-gcc-4.2.1 (GCC) 4.2.1 (Apple Inc. build 5646) (dot 1)
Copyright (C) 2007 Free Software Foundation, Inc.
This is free software; see the source for copying conditions.  There is NO
warranty; not even for MERCHANTABILITY or FITNESS FOR A PARTICULAR PURPOSE.

configure:16518: $? = 0
configure:16507: gcc -v >&5
Using built-in specs.
Target: i686-apple-darwin10
Configured with: /var/tmp/gcc/gcc-5646.1~2/src/configure --disable-checking --enable-werror --prefix=/usr --mandir=/share/man --enable-languages=c,objc,c++,obj-c++ --program-transform-name=/^[cg][^.-]*$/s/$/-4.2/ --with-slibdir=/usr/lib --build=i686-apple-darwin10 --with-gxx-include-dir=/include/c++/4.2.1 --program-prefix=i686-apple-darwin10- --host=x86_64-apple-darwin10 --target=i686-apple-darwin10
Thread model: posix
gcc version 4.2.1 (Apple Inc. build 5646) (dot 1)
configure:16518: $? = 0
configure:16507: gcc -V >&5
gcc-4.2: argument to `-V' is missing
configure:16518: $? = 1
configure:16507: gcc -qversion >&5
i686-apple-darwin10-gcc-4.2.1: no input files
configure:16518: $? = 1
configure:16522: checking whether we are using the GNU C compiler
configure:16550: result: yes
configure:16559: checking whether gcc accepts -g
configure:16620: result: yes
configure:16637: checking for gcc option to accept ISO C89
configure:16714: result: none needed
configure:16785: checking for pkg-config
configure:16803: found /opt/local/bin/pkg-config
configure:16815: result: /opt/local/bin/pkg-config
configure:16840: checking pkg-config is at least version 0.9.0
configure:16843: result: yes
configure:16878: checking whether to build documentation
configure:16880: result: yes
configure:16944: checking for doxygen
configure:16960: found /opt/local/bin/doxygen
configure:16972: result: yes
configure:17125: checking for EINA
configure:17132: $PKG_CONFIG --exists --print-errors "eina-0"
configure:17135: $? = 0
configure:17148: $PKG_CONFIG --exists --print-errors "eina-0"
configure:17151: $? = 0
configure:17205: result: yes
configure:17213: checking for FREETYPE
configure:17220: $PKG_CONFIG --exists --print-errors "freetype2 >= 9.3.0"
configure:17223: $? = 0
configure:17236: $PKG_CONFIG --exists --print-errors "freetype2 >= 9.3.0"
configure:17239: $? = 0
configure:17293: result: yes
configure:17320: checking for FONTCONFIG
configure:17327: $PKG_CONFIG --exists --print-errors "fontconfig"
configure:17330: $? = 0
configure:17343: $PKG_CONFIG --exists --print-errors "fontconfig"
configure:17346: $? = 0
configure:17389: result: yes
configure:17418: checking for FRIBIDI
configure:17425: $PKG_CONFIG --exists --print-errors "fribidi"
Package fribidi was not found in the pkg-config search path.
Perhaps you should add the directory containing `fribidi.pc'
to the PKG_CONFIG_PATH environment variable
No package 'fribidi' found
configure:17428: $? = 1
configure:17441: $PKG_CONFIG --exists --print-errors "fribidi"
Package fribidi was not found in the pkg-config search path.
Perhaps you should add the directory containing `fribidi.pc'
to the PKG_CONFIG_PATH environment variable
No package 'fribidi' found
configure:17444: $? = 1
No package 'fribidi' found
configure:17471: result: no
configure:17504: checking for ANSI C header files
configure:17608: result: yes
configure:17625: checking for an ANSI C-conforming const
configure:17690: gcc -c -ggdb -O0 -D_GNU_SOURCE  conftest.c >&5
configure:17690: $? = 0
configure:17697: result: yes
configure:17705: checking whether byte ordering is bigendian
configure:17720: gcc -c -ggdb -O0 -D_GNU_SOURCE  conftest.c >&5
configure:17720: $? = 0
configure:17765: gcc -c -ggdb -O0 -D_GNU_SOURCE  conftest.c >&5
configure:17765: $? = 0
configure:17783: gcc -c -ggdb -O0 -D_GNU_SOURCE  conftest.c >&5
conftest.c: In function 'main':
conftest.c:33: error: 'not' undeclared (first use in this function)
conftest.c:33: error: (Each undeclared identifier is reported only once
conftest.c:33: error: for each function it appears in.)
conftest.c:33: error: expected ';' before 'big'
configure:17783: $? = 1
configure: failed program was:
| /* confdefs.h */
| #define PACKAGE_NAME "evas"
| #define PACKAGE_TARNAME "evas"
| #define PACKAGE_VERSION "0.9.9.063"
| #define PACKAGE_STRING "evas 0.9.9.063"
| #define PACKAGE_BUGREPORT "enlightenment-devel@lists.sourceforge.net"
| #define PACKAGE_URL ""
| #define PACKAGE "evas"
| #define VERSION "0.9.9.063"
| #define STDC_HEADERS 1
| #define HAVE_SYS_TYPES_H 1
| #define HAVE_SYS_STAT_H 1
| #define HAVE_STDLIB_H 1
| #define HAVE_STRING_H 1
| #define HAVE_MEMORY_H 1
| #define HAVE_STRINGS_H 1
| #define HAVE_INTTYPES_H 1
| #define HAVE_STDINT_H 1
| #define HAVE_UNISTD_H 1
| #define HAVE_DLFCN_H 1
| #define LT_OBJDIR ".libs/"
| #define MODULE_ARCH "darwin10.2.0-x86_64-ver-pre-svn-05"
| #define HAVE_FONTCONFIG 1
| #define STDC_HEADERS 1
| /* end confdefs.h.  */
| #include <sys/types.h>
| 		#include <sys/param.h>
| 
| int
| main ()
| {
| #if BYTE_ORDER != BIG_ENDIAN
| 		 not big endian
| 		#endif
| 
|   ;
|   return 0;
| }
configure:17911: result: no
configure:17931: checking for __attribute__
configure:17956: gcc -c -ggdb -O0 -D_GNU_SOURCE  conftest.c >&5
configure:17956: $? = 0
configure:17966: result: yes
configure:18031: checking for gcc
configure:18058: result: gcc
configure:18287: checking for C compiler version
configure:18296: gcc --version >&5
i686-apple-darwin10-gcc-4.2.1 (GCC) 4.2.1 (Apple Inc. build 5646) (dot 1)
Copyright (C) 2007 Free Software Foundation, Inc.
This is free software; see the source for copying conditions.  There is NO
warranty; not even for MERCHANTABILITY or FITNESS FOR A PARTICULAR PURPOSE.

configure:18307: $? = 0
configure:18296: gcc -v >&5
Using built-in specs.
Target: i686-apple-darwin10
Configured with: /var/tmp/gcc/gcc-5646.1~2/src/configure --disable-checking --enable-werror --prefix=/usr --mandir=/share/man --enable-languages=c,objc,c++,obj-c++ --program-transform-name=/^[cg][^.-]*$/s/$/-4.2/ --with-slibdir=/usr/lib --build=i686-apple-darwin10 --with-gxx-include-dir=/include/c++/4.2.1 --program-prefix=i686-apple-darwin10- --host=x86_64-apple-darwin10 --target=i686-apple-darwin10
Thread model: posix
gcc version 4.2.1 (Apple Inc. build 5646) (dot 1)
configure:18307: $? = 0
configure:18296: gcc -V >&5
gcc-4.2: argument to `-V' is missing
configure:18307: $? = 1
configure:18296: gcc -qversion >&5
i686-apple-darwin10-gcc-4.2.1: no input files
configure:18307: $? = 1
configure:18311: checking whether we are using the GNU C compiler
configure:18339: result: yes
configure:18348: checking whether gcc accepts -g
configure:18409: result: yes
configure:18426: checking for gcc option to accept ISO C89
configure:18503: result: none needed
configure:18565: checking for working alloca.h
configure:18582: gcc -o conftest -ggdb -O0 -D_GNU_SOURCE   conftest.c  >&5
configure:18582: $? = 0
configure:18590: result: yes
configure:18598: checking for alloca
configure:18635: gcc -o conftest -ggdb -O0 -D_GNU_SOURCE   conftest.c  >&5
configure:18635: $? = 0
configure:18643: result: yes
configure:18757: checking fnmatch.h usability
configure:18757: gcc -c -ggdb -O0 -D_GNU_SOURCE  conftest.c >&5
configure:18757: $? = 0
configure:18757: result: yes
configure:18757: checking fnmatch.h presence
configure:18757: gcc -E  conftest.c
configure:18757: $? = 0
configure:18757: result: yes
configure:18757: checking for fnmatch.h
configure:18757: result: yes
configure:18767: checking for library containing fnmatch
configure:18798: gcc -o conftest -ggdb -O0 -D_GNU_SOURCE   conftest.c  >&5
configure:18798: $? = 0
configure:18815: result: none required
configure:18857: checking for dlopen
configure:18857: gcc -o conftest -ggdb -O0 -D_GNU_SOURCE   conftest.c  >&5
configure:18857: $? = 0
configure:18857: result: yes
configure:18871: checking for dladdr
configure:18871: gcc -o conftest -ggdb -O0 -D_GNU_SOURCE   conftest.c  >&5
configure:18871: $? = 0
configure:18871: result: yes
configure:18986: checking whether to build shared cache server and support
configure:18988: result: yes
configure:18992: checking whether shm_open() is present
configure:19015: gcc -o conftest -ggdb -O0 -D_GNU_SOURCE   conftest.c  -lrt >&5
ld: library not found for -lrt
collect2: ld returned 1 exit status
configure:19015: $? = 1
configure: failed program was:
| /* confdefs.h */
| #define PACKAGE_NAME "evas"
| #define PACKAGE_TARNAME "evas"
| #define PACKAGE_VERSION "0.9.9.063"
| #define PACKAGE_STRING "evas 0.9.9.063"
| #define PACKAGE_BUGREPORT "enlightenment-devel@lists.sourceforge.net"
| #define PACKAGE_URL ""
| #define PACKAGE "evas"
| #define VERSION "0.9.9.063"
| #define STDC_HEADERS 1
| #define HAVE_SYS_TYPES_H 1
| #define HAVE_SYS_STAT_H 1
| #define HAVE_STDLIB_H 1
| #define HAVE_STRING_H 1
| #define HAVE_MEMORY_H 1
| #define HAVE_STRINGS_H 1
| #define HAVE_INTTYPES_H 1
| #define HAVE_STDINT_H 1
| #define HAVE_UNISTD_H 1
| #define HAVE_DLFCN_H 1
| #define LT_OBJDIR ".libs/"
| #define MODULE_ARCH "darwin10.2.0-x86_64-ver-pre-svn-05"
| #define HAVE_FONTCONFIG 1
| #define STDC_HEADERS 1
| #define HAVE___ATTRIBUTE__ 1
| #define __UNUSED__ __attribute__((unused))
| #define HAVE_ALLOCA_H 1
| #define HAVE_ALLOCA 1
| #define HAVE_DLOPEN 1
| #define HAVE_DLADDR 1
| #define HAVE_DLADDR 1
| /* end confdefs.h.  */
| 
| #include <sys/types.h>
| #include <sys/mman.h>
| #include <fcntl.h>
| 
| int
| main ()
| {
| 
| int fd;
| fd = shm_open("/", O_RDWR | O_CREAT, S_IRUSR | S_IWUSR);
| shm_unlink("/");
| 
|   ;
|   return 0;
| }
configure:19023: result: no
configure:19047: checking whether to build GLES flavor of GL
configure:19064: result: no
configure:19075: checking whether to build GLES variety for SGX
configure:19095: result: no
configure:19106: checking whether to build GLES variety for s3c6410
configure:19126: result: no
configure:19161: checking whether to enable Buffer rendering backend
configure:19163: result: yes
configure:19189: checking whether Buffer rendering backend will be built
configure:19191: result: yes
configure:19263: checking whether to enable Software Xlib rendering backend
configure:19265: result: yes
configure:19275: checking for X
configure:19383: gcc -E  conftest.c
configure:19383: $? = 0
configure:19414: gcc -o conftest -ggdb -O0 -D_GNU_SOURCE   conftest.c -lX11  >&5
ld: library not found for -lX11
collect2: ld returned 1 exit status
configure:19414: $? = 1
configure: failed program was:
| /* confdefs.h */
| #define PACKAGE_NAME "evas"
| #define PACKAGE_TARNAME "evas"
| #define PACKAGE_VERSION "0.9.9.063"
| #define PACKAGE_STRING "evas 0.9.9.063"
| #define PACKAGE_BUGREPORT "enlightenment-devel@lists.sourceforge.net"
| #define PACKAGE_URL ""
| #define PACKAGE "evas"
| #define VERSION "0.9.9.063"
| #define STDC_HEADERS 1
| #define HAVE_SYS_TYPES_H 1
| #define HAVE_SYS_STAT_H 1
| #define HAVE_STDLIB_H 1
| #define HAVE_STRING_H 1
| #define HAVE_MEMORY_H 1
| #define HAVE_STRINGS_H 1
| #define HAVE_INTTYPES_H 1
| #define HAVE_STDINT_H 1
| #define HAVE_UNISTD_H 1
| #define HAVE_DLFCN_H 1
| #define LT_OBJDIR ".libs/"
| #define MODULE_ARCH "darwin10.2.0-x86_64-ver-pre-svn-05"
| #define HAVE_FONTCONFIG 1
| #define STDC_HEADERS 1
| #define HAVE___ATTRIBUTE__ 1
| #define __UNUSED__ __attribute__((unused))
| #define HAVE_ALLOCA_H 1
| #define HAVE_ALLOCA 1
| #define HAVE_DLOPEN 1
| #define HAVE_DLADDR 1
| #define HAVE_DLADDR 1
| #define BUILD_ENGINE_BUFFER 1
| /* end confdefs.h.  */
| #include <X11/Xlib.h>
| int
| main ()
| {
| XrmInitialize ()
|   ;
|   return 0;
| }
configure:19464: result: libraries /usr/X11/lib, headers 
configure:19484: checking whether -R must be followed by a space
configure:19500: gcc -o conftest -ggdb -O0 -D_GNU_SOURCE   conftest.c  -R/usr/X11/lib >&5
configure:19500: $? = 0
configure:19501: result: no
configure:19563: gcc -o conftest -ggdb -O0 -D_GNU_SOURCE   conftest.c   -L/usr/X11/lib -R/usr/X11/lib -lX11 >&5
configure:19563: $? = 0
configure:19661: checking for gethostbyname
configure:19661: gcc -o conftest -ggdb -O0 -D_GNU_SOURCE   conftest.c  >&5
configure:19661: $? = 0
configure:19661: result: yes
configure:19758: checking for connect
configure:19758: gcc -o conftest -ggdb -O0 -D_GNU_SOURCE   conftest.c  >&5
configure:19758: $? = 0
configure:19758: result: yes
configure:19807: checking for remove
configure:19807: gcc -o conftest -ggdb -O0 -D_GNU_SOURCE   conftest.c  >&5
configure:19807: $? = 0
configure:19807: result: yes
configure:19856: checking for shmat
configure:19856: gcc -o conftest -ggdb -O0 -D_GNU_SOURCE   conftest.c  >&5
configure:19856: $? = 0
configure:19856: result: yes
configure:19914: checking for IceConnectionNumber in -lICE
configure:19939: gcc -o conftest -ggdb -O0 -D_GNU_SOURCE   -L/usr/X11/lib conftest.c -lICE   >&5
configure:19939: $? = 0
configure:19948: result: yes
configure:19959: checking X11/X.h usability
configure:19959: gcc -c -ggdb -O0 -D_GNU_SOURCE  conftest.c >&5
configure:19959: $? = 0
configure:19959: result: yes
configure:19959: checking X11/X.h presence
configure:19959: gcc -E  conftest.c
configure:19959: $? = 0
configure:19959: result: yes
configure:19959: checking for X11/X.h
configure:19959: result: yes
configure:19967: checking for XCreateImage in -lX11
configure:19992: gcc -o conftest -ggdb -O0 -D_GNU_SOURCE   conftest.c -lX11   >&5
ld: library not found for -lX11
collect2: ld returned 1 exit status
configure:19992: $? = 1
configure: failed program was:
| /* confdefs.h */
| #define PACKAGE_NAME "evas"
| #define PACKAGE_TARNAME "evas"
| #define PACKAGE_VERSION "0.9.9.063"
| #define PACKAGE_STRING "evas 0.9.9.063"
| #define PACKAGE_BUGREPORT "enlightenment-devel@lists.sourceforge.net"
| #define PACKAGE_URL ""
| #define PACKAGE "evas"
| #define VERSION "0.9.9.063"
| #define STDC_HEADERS 1
| #define HAVE_SYS_TYPES_H 1
| #define HAVE_SYS_STAT_H 1
| #define HAVE_STDLIB_H 1
| #define HAVE_STRING_H 1
| #define HAVE_MEMORY_H 1
| #define HAVE_STRINGS_H 1
| #define HAVE_INTTYPES_H 1
| #define HAVE_STDINT_H 1
| #define HAVE_UNISTD_H 1
| #define HAVE_DLFCN_H 1
| #define LT_OBJDIR ".libs/"
| #define MODULE_ARCH "darwin10.2.0-x86_64-ver-pre-svn-05"
| #define HAVE_FONTCONFIG 1
| #define STDC_HEADERS 1
| #define HAVE___ATTRIBUTE__ 1
| #define __UNUSED__ __attribute__((unused))
| #define HAVE_ALLOCA_H 1
| #define HAVE_ALLOCA 1
| #define HAVE_DLOPEN 1
| #define HAVE_DLADDR 1
| #define HAVE_DLADDR 1
| #define BUILD_ENGINE_BUFFER 1
| /* end confdefs.h.  */
| 
| /* Override any GCC internal prototype to avoid an error.
|    Use char because int might match the return type of a GCC
|    builtin and then its argument prototype would still apply.  */
| #ifdef __cplusplus
| extern "C"
| #endif
| char XCreateImage ();
| int
| main ()
| {
| return XCreateImage ();
|   ;
|   return 0;
| }
configure:20001: result: no
configure:20084: checking whether Software Xlib rendering backend will be built
configure:20086: result: no
configure:20158: checking whether to enable XRender X11 rendering backend
configure:20160: result: no
configure:21033: checking whether XRender X11 rendering backend will be built
configure:21035: result: no
configure:21107: checking whether to enable OpenGL X11 rendering backend
configure:21109: result: no
configure:22013: checking whether OpenGL X11 rendering backend will be built
configure:22015: result: no
configure:22090: checking whether to enable Software XCB rendering backend
configure:22092: result: no
configure:22216: checking whether Software XCB rendering backend will be built
configure:22218: result: no
configure:22290: checking whether to enable XRender XCB rendering backend
configure:22292: result: no
configure:22416: checking whether XRender XCB rendering backend will be built
configure:22418: result: no
configure:22490: checking whether to enable Software GDI rendering backend
configure:22492: result: no
configure:22529: checking whether Software GDI rendering backend will be built
configure:22531: result: no
configure:22603: checking whether to enable Software DirectDraw rendering backend
configure:22605: result: no
configure:22642: checking whether Software DirectDraw rendering backend will be built
configure:22644: result: no
configure:22716: checking whether to enable Direct3D rendering backend
configure:22718: result: no
configure:22764: checking whether Direct3D rendering backend will be built
configure:22766: result: no
configure:22820: checking how to run the Objective C preprocessor
configure:22847: gcc -E  conftest.m
configure:22847: $? = 0
configure:22861: gcc -E  conftest.m
conftest.m:34:28: error: ac_nonexistent.h: No such file or directory
configure:22861: $? = 1
configure: failed program was:
| /* confdefs.h */
| #define PACKAGE_NAME "evas"
| #define PACKAGE_TARNAME "evas"
| #define PACKAGE_VERSION "0.9.9.063"
| #define PACKAGE_STRING "evas 0.9.9.063"
| #define PACKAGE_BUGREPORT "enlightenment-devel@lists.sourceforge.net"
| #define PACKAGE_URL ""
| #define PACKAGE "evas"
| #define VERSION "0.9.9.063"
| #define STDC_HEADERS 1
| #define HAVE_SYS_TYPES_H 1
| #define HAVE_SYS_STAT_H 1
| #define HAVE_STDLIB_H 1
| #define HAVE_STRING_H 1
| #define HAVE_MEMORY_H 1
| #define HAVE_STRINGS_H 1
| #define HAVE_INTTYPES_H 1
| #define HAVE_STDINT_H 1
| #define HAVE_UNISTD_H 1
| #define HAVE_DLFCN_H 1
| #define LT_OBJDIR ".libs/"
| #define MODULE_ARCH "darwin10.2.0-x86_64-ver-pre-svn-05"
| #define HAVE_FONTCONFIG 1
| #define STDC_HEADERS 1
| #define HAVE___ATTRIBUTE__ 1
| #define __UNUSED__ __attribute__((unused))
| #define HAVE_ALLOCA_H 1
| #define HAVE_ALLOCA 1
| #define HAVE_DLOPEN 1
| #define HAVE_DLADDR 1
| #define HAVE_DLADDR 1
| #define BUILD_ENGINE_BUFFER 1
| /* end confdefs.h.  */
| #include <ac_nonexistent.h>
configure:22886: result: gcc -E
configure:22906: gcc -E  conftest.m
configure:22906: $? = 0
configure:22920: gcc -E  conftest.m
conftest.m:34:28: error: ac_nonexistent.h: No such file or directory
configure:22920: $? = 1
configure: failed program was:
| /* confdefs.h */
| #define PACKAGE_NAME "evas"
| #define PACKAGE_TARNAME "evas"
| #define PACKAGE_VERSION "0.9.9.063"
| #define PACKAGE_STRING "evas 0.9.9.063"
| #define PACKAGE_BUGREPORT "enlightenment-devel@lists.sourceforge.net"
| #define PACKAGE_URL ""
| #define PACKAGE "evas"
| #define VERSION "0.9.9.063"
| #define STDC_HEADERS 1
| #define HAVE_SYS_TYPES_H 1
| #define HAVE_SYS_STAT_H 1
| #define HAVE_STDLIB_H 1
| #define HAVE_STRING_H 1
| #define HAVE_MEMORY_H 1
| #define HAVE_STRINGS_H 1
| #define HAVE_INTTYPES_H 1
| #define HAVE_STDINT_H 1
| #define HAVE_UNISTD_H 1
| #define HAVE_DLFCN_H 1
| #define LT_OBJDIR ".libs/"
| #define MODULE_ARCH "darwin10.2.0-x86_64-ver-pre-svn-05"
| #define HAVE_FONTCONFIG 1
| #define STDC_HEADERS 1
| #define HAVE___ATTRIBUTE__ 1
| #define __UNUSED__ __attribute__((unused))
| #define HAVE_ALLOCA_H 1
| #define HAVE_ALLOCA 1
| #define HAVE_DLOPEN 1
| #define HAVE_DLADDR 1
| #define HAVE_DLADDR 1
| #define BUILD_ENGINE_BUFFER 1
| /* end confdefs.h.  */
| #include <ac_nonexistent.h>
configure:22975: checking whether to enable Quartz rendering backend
configure:22977: result: no
configure:23040: checking whether Quartz rendering backend will be built
configure:23042: result: no
configure:23114: checking whether to enable OpenGL Glew rendering backend
configure:23116: result: no
configure:23162: checking whether OpenGL Glew rendering backend will be built
configure:23164: result: no
configure:23236: checking whether to enable Software SDL rendering backend
configure:23238: result: no
configure:23362: checking whether Software SDL rendering backend will be built
configure:23364: result: no
configure:23436: checking whether to enable OpenGL SDL rendering backend
configure:23438: result: no
configure:23650: checking whether OpenGL SDL rendering backend will be built
configure:23652: result: no
configure:23724: checking whether to enable Framebuffer rendering backend
configure:23726: result: no
configure:23759: checking whether Framebuffer rendering backend will be built
configure:23761: result: no
configure:23833: checking whether to enable DirectFB rendering backend
configure:23835: result: no
configure:23959: checking whether DirectFB rendering backend will be built
configure:23961: result: no
configure:24036: checking whether to enable Software X11 16 bits rendering backend
configure:24038: result: no
configure:24857: checking whether Software X11 16 bits rendering backend will be built
configure:24859: result: no
configure:24931: checking whether to enable Software DirectDraw 16 bits rendering backend
configure:24933: result: no
configure:24970: checking whether Software DirectDraw 16 bits rendering backend will be built
configure:24972: result: no
configure:25044: checking whether to enable Software Windows CE 16 bits rendering backend
configure:25046: result: no
configure:25072: checking whether Software Windows CE 16 bits rendering backend will be built
configure:25074: result: no
configure:25191: checking whether to use SDL primitive when possible
configure:25193: result: no
configure:25210: checking Whether to build software generic engine as part of libevas
configure:25212: result: no
configure:25311: checking Whether to build software 16 engine as part of libevas
configure:25313: result: no
configure:25360: checking whether to enable Edb image loader
configure:25362: result: yes
configure:25375: checking for EDB
configure:25382: $PKG_CONFIG --exists --print-errors "edb"
Package edb was not found in the pkg-config search path.
Perhaps you should add the directory containing `edb.pc'
to the PKG_CONFIG_PATH environment variable
No package 'edb' found
configure:25385: $? = 1
configure:25398: $PKG_CONFIG --exists --print-errors "edb"
Package edb was not found in the pkg-config search path.
Perhaps you should add the directory containing `edb.pc'
to the PKG_CONFIG_PATH environment variable
No package 'edb' found
configure:25401: $? = 1
No package 'edb' found
configure:25428: result: no
configure:25463: checking whether Edb image loader will be built
configure:25465: result: no
configure:25540: checking whether to enable Eet image loader
configure:25542: result: yes
configure:25555: checking for EET
configure:25562: $PKG_CONFIG --exists --print-errors "eet >= 1.0.1"
configure:25565: $? = 0
configure:25578: $PKG_CONFIG --exists --print-errors "eet >= 1.0.1"
configure:25581: $? = 0
configure:25616: result: yes
configure:25643: checking whether Eet image loader will be built
configure:25645: result: yes
configure:25705: checking whether to enable Eet font loader
configure:25707: result: yes
configure:25713: checking for EET
configure:25774: result: yes
configure:25823: checking whether to enable Gif image loader
configure:25825: result: yes
configure:25835: checking gif_lib.h usability
configure:25835: gcc -c -ggdb -O0 -D_GNU_SOURCE  conftest.c >&5
conftest.c:69:21: error: gif_lib.h: No such file or directory
configure:25835: $? = 1
configure: failed program was:
| /* confdefs.h */
| #define PACKAGE_NAME "evas"
| #define PACKAGE_TARNAME "evas"
| #define PACKAGE_VERSION "0.9.9.063"
| #define PACKAGE_STRING "evas 0.9.9.063"
| #define PACKAGE_BUGREPORT "enlightenment-devel@lists.sourceforge.net"
| #define PACKAGE_URL ""
| #define PACKAGE "evas"
| #define VERSION "0.9.9.063"
| #define STDC_HEADERS 1
| #define HAVE_SYS_TYPES_H 1
| #define HAVE_SYS_STAT_H 1
| #define HAVE_STDLIB_H 1
| #define HAVE_STRING_H 1
| #define HAVE_MEMORY_H 1
| #define HAVE_STRINGS_H 1
| #define HAVE_INTTYPES_H 1
| #define HAVE_STDINT_H 1
| #define HAVE_UNISTD_H 1
| #define HAVE_DLFCN_H 1
| #define LT_OBJDIR ".libs/"
| #define MODULE_ARCH "darwin10.2.0-x86_64-ver-pre-svn-05"
| #define HAVE_FONTCONFIG 1
| #define STDC_HEADERS 1
| #define HAVE___ATTRIBUTE__ 1
| #define __UNUSED__ __attribute__((unused))
| #define HAVE_ALLOCA_H 1
| #define HAVE_ALLOCA 1
| #define HAVE_DLOPEN 1
| #define HAVE_DLADDR 1
| #define HAVE_DLADDR 1
| #define BUILD_ENGINE_BUFFER 1
| #define BUILD_LOADER_EET 1
| #define BUILD_FONT_LOADER_EET 1
| /* end confdefs.h.  */
| #include <stdio.h>
| #ifdef HAVE_SYS_TYPES_H
| # include <sys/types.h>
| #endif
| #ifdef HAVE_SYS_STAT_H
| # include <sys/stat.h>
| #endif
| #ifdef STDC_HEADERS
| # include <stdlib.h>
| # include <stddef.h>
| #else
| # ifdef HAVE_STDLIB_H
| #  include <stdlib.h>
| # endif
| #endif
| #ifdef HAVE_STRING_H
| # if !defined STDC_HEADERS && defined HAVE_MEMORY_H
| #  include <memory.h>
| # endif
| # include <string.h>
| #endif
| #ifdef HAVE_STRINGS_H
| # include <strings.h>
| #endif
| #ifdef HAVE_INTTYPES_H
| # include <inttypes.h>
| #endif
| #ifdef HAVE_STDINT_H
| # include <stdint.h>
| #endif
| #ifdef HAVE_UNISTD_H
| # include <unistd.h>
| #endif
| #include <gif_lib.h>
configure:25835: result: no
configure:25835: checking gif_lib.h presence
configure:25835: gcc -E  conftest.c
conftest.c:36:21: error: gif_lib.h: No such file or directory
configure:25835: $? = 1
configure: failed program was:
| /* confdefs.h */
| #define PACKAGE_NAME "evas"
| #define PACKAGE_TARNAME "evas"
| #define PACKAGE_VERSION "0.9.9.063"
| #define PACKAGE_STRING "evas 0.9.9.063"
| #define PACKAGE_BUGREPORT "enlightenment-devel@lists.sourceforge.net"
| #define PACKAGE_URL ""
| #define PACKAGE "evas"
| #define VERSION "0.9.9.063"
| #define STDC_HEADERS 1
| #define HAVE_SYS_TYPES_H 1
| #define HAVE_SYS_STAT_H 1
| #define HAVE_STDLIB_H 1
| #define HAVE_STRING_H 1
| #define HAVE_MEMORY_H 1
| #define HAVE_STRINGS_H 1
| #define HAVE_INTTYPES_H 1
| #define HAVE_STDINT_H 1
| #define HAVE_UNISTD_H 1
| #define HAVE_DLFCN_H 1
| #define LT_OBJDIR ".libs/"
| #define MODULE_ARCH "darwin10.2.0-x86_64-ver-pre-svn-05"
| #define HAVE_FONTCONFIG 1
| #define STDC_HEADERS 1
| #define HAVE___ATTRIBUTE__ 1
| #define __UNUSED__ __attribute__((unused))
| #define HAVE_ALLOCA_H 1
| #define HAVE_ALLOCA 1
| #define HAVE_DLOPEN 1
| #define HAVE_DLADDR 1
| #define HAVE_DLADDR 1
| #define BUILD_ENGINE_BUFFER 1
| #define BUILD_LOADER_EET 1
| #define BUILD_FONT_LOADER_EET 1
| /* end confdefs.h.  */
| #include <gif_lib.h>
configure:25835: result: no
configure:25835: checking for gif_lib.h
configure:25835: result: no
configure:25953: checking whether Gif image loader will be built
configure:25955: result: no
configure:26031: checking whether to enable Jpeg image loader
configure:26033: result: yes
configure:26043: checking jpeglib.h usability
configure:26043: gcc -c -ggdb -O0 -D_GNU_SOURCE  conftest.c >&5
conftest.c:69:21: error: jpeglib.h: No such file or directory
configure:26043: $? = 1
configure: failed program was:
| /* confdefs.h */
| #define PACKAGE_NAME "evas"
| #define PACKAGE_TARNAME "evas"
| #define PACKAGE_VERSION "0.9.9.063"
| #define PACKAGE_STRING "evas 0.9.9.063"
| #define PACKAGE_BUGREPORT "enlightenment-devel@lists.sourceforge.net"
| #define PACKAGE_URL ""
| #define PACKAGE "evas"
| #define VERSION "0.9.9.063"
| #define STDC_HEADERS 1
| #define HAVE_SYS_TYPES_H 1
| #define HAVE_SYS_STAT_H 1
| #define HAVE_STDLIB_H 1
| #define HAVE_STRING_H 1
| #define HAVE_MEMORY_H 1
| #define HAVE_STRINGS_H 1
| #define HAVE_INTTYPES_H 1
| #define HAVE_STDINT_H 1
| #define HAVE_UNISTD_H 1
| #define HAVE_DLFCN_H 1
| #define LT_OBJDIR ".libs/"
| #define MODULE_ARCH "darwin10.2.0-x86_64-ver-pre-svn-05"
| #define HAVE_FONTCONFIG 1
| #define STDC_HEADERS 1
| #define HAVE___ATTRIBUTE__ 1
| #define __UNUSED__ __attribute__((unused))
| #define HAVE_ALLOCA_H 1
| #define HAVE_ALLOCA 1
| #define HAVE_DLOPEN 1
| #define HAVE_DLADDR 1
| #define HAVE_DLADDR 1
| #define BUILD_ENGINE_BUFFER 1
| #define BUILD_LOADER_EET 1
| #define BUILD_FONT_LOADER_EET 1
| /* end confdefs.h.  */
| #include <stdio.h>
| #ifdef HAVE_SYS_TYPES_H
| # include <sys/types.h>
| #endif
| #ifdef HAVE_SYS_STAT_H
| # include <sys/stat.h>
| #endif
| #ifdef STDC_HEADERS
| # include <stdlib.h>
| # include <stddef.h>
| #else
| # ifdef HAVE_STDLIB_H
| #  include <stdlib.h>
| # endif
| #endif
| #ifdef HAVE_STRING_H
| # if !defined STDC_HEADERS && defined HAVE_MEMORY_H
| #  include <memory.h>
| # endif
| # include <string.h>
| #endif
| #ifdef HAVE_STRINGS_H
| # include <strings.h>
| #endif
| #ifdef HAVE_INTTYPES_H
| # include <inttypes.h>
| #endif
| #ifdef HAVE_STDINT_H
| # include <stdint.h>
| #endif
| #ifdef HAVE_UNISTD_H
| # include <unistd.h>
| #endif
| #include <jpeglib.h>
configure:26043: result: no
configure:26043: checking jpeglib.h presence
configure:26043: gcc -E  conftest.c
conftest.c:36:21: error: jpeglib.h: No such file or directory
configure:26043: $? = 1
configure: failed program was:
| /* confdefs.h */
| #define PACKAGE_NAME "evas"
| #define PACKAGE_TARNAME "evas"
| #define PACKAGE_VERSION "0.9.9.063"
| #define PACKAGE_STRING "evas 0.9.9.063"
| #define PACKAGE_BUGREPORT "enlightenment-devel@lists.sourceforge.net"
| #define PACKAGE_URL ""
| #define PACKAGE "evas"
| #define VERSION "0.9.9.063"
| #define STDC_HEADERS 1
| #define HAVE_SYS_TYPES_H 1
| #define HAVE_SYS_STAT_H 1
| #define HAVE_STDLIB_H 1
| #define HAVE_STRING_H 1
| #define HAVE_MEMORY_H 1
| #define HAVE_STRINGS_H 1
| #define HAVE_INTTYPES_H 1
| #define HAVE_STDINT_H 1
| #define HAVE_UNISTD_H 1
| #define HAVE_DLFCN_H 1
| #define LT_OBJDIR ".libs/"
| #define MODULE_ARCH "darwin10.2.0-x86_64-ver-pre-svn-05"
| #define HAVE_FONTCONFIG 1
| #define STDC_HEADERS 1
| #define HAVE___ATTRIBUTE__ 1
| #define __UNUSED__ __attribute__((unused))
| #define HAVE_ALLOCA_H 1
| #define HAVE_ALLOCA 1
| #define HAVE_DLOPEN 1
| #define HAVE_DLADDR 1
| #define HAVE_DLADDR 1
| #define BUILD_ENGINE_BUFFER 1
| #define BUILD_LOADER_EET 1
| #define BUILD_FONT_LOADER_EET 1
| /* end confdefs.h.  */
| #include <jpeglib.h>
configure:26043: result: no
configure:26043: checking for jpeglib.h
configure:26043: result: no
configure:26137: checking whether Jpeg image loader will be built
configure:26139: result: no
configure:26232: checking whether to enable PMAPS image loader
configure:26234: result: yes
configure:26260: checking whether PMAPS image loader will be built
configure:26262: result: yes
configure:26337: checking whether to enable PNG image loader
configure:26339: result: yes
configure:26351: $PKG_CONFIG --exists --print-errors "libpng12"
configure:26354: $? = 0
configure:26358: checking for PNG
configure:26365: $PKG_CONFIG --exists --print-errors "libpng12"
configure:26368: $? = 0
configure:26381: $PKG_CONFIG --exists --print-errors "libpng12"
configure:26384: $? = 0
configure:26419: result: yes
configure:26592: checking whether PNG image loader will be built
configure:26594: result: yes
configure:26669: checking whether to enable SVG image loader
configure:26671: result: yes
configure:26684: checking for SVG
configure:26691: $PKG_CONFIG --exists --print-errors "librsvg-2.0 >= 2.14.0"
Package librsvg-2.0 was not found in the pkg-config search path.
Perhaps you should add the directory containing `librsvg-2.0.pc'
to the PKG_CONFIG_PATH environment variable
No package 'librsvg-2.0' found
configure:26694: $? = 1
configure:26707: $PKG_CONFIG --exists --print-errors "librsvg-2.0 >= 2.14.0"
Package librsvg-2.0 was not found in the pkg-config search path.
Perhaps you should add the directory containing `librsvg-2.0.pc'
to the PKG_CONFIG_PATH environment variable
No package 'librsvg-2.0' found
configure:26710: $? = 1
No package 'librsvg-2.0' found
configure:26737: result: no
configure:26777: checking whether SVG image loader will be built
configure:26779: result: no
configure:26854: checking whether to enable Tiff image loader
configure:26856: result: yes
configure:26866: checking tiffio.h usability
configure:26866: gcc -c -ggdb -O0 -D_GNU_SOURCE  conftest.c >&5
conftest.c:71:20: error: tiffio.h: No such file or directory
configure:26866: $? = 1
configure: failed program was:
| /* confdefs.h */
| #define PACKAGE_NAME "evas"
| #define PACKAGE_TARNAME "evas"
| #define PACKAGE_VERSION "0.9.9.063"
| #define PACKAGE_STRING "evas 0.9.9.063"
| #define PACKAGE_BUGREPORT "enlightenment-devel@lists.sourceforge.net"
| #define PACKAGE_URL ""
| #define PACKAGE "evas"
| #define VERSION "0.9.9.063"
| #define STDC_HEADERS 1
| #define HAVE_SYS_TYPES_H 1
| #define HAVE_SYS_STAT_H 1
| #define HAVE_STDLIB_H 1
| #define HAVE_STRING_H 1
| #define HAVE_MEMORY_H 1
| #define HAVE_STRINGS_H 1
| #define HAVE_INTTYPES_H 1
| #define HAVE_STDINT_H 1
| #define HAVE_UNISTD_H 1
| #define HAVE_DLFCN_H 1
| #define LT_OBJDIR ".libs/"
| #define MODULE_ARCH "darwin10.2.0-x86_64-ver-pre-svn-05"
| #define HAVE_FONTCONFIG 1
| #define STDC_HEADERS 1
| #define HAVE___ATTRIBUTE__ 1
| #define __UNUSED__ __attribute__((unused))
| #define HAVE_ALLOCA_H 1
| #define HAVE_ALLOCA 1
| #define HAVE_DLOPEN 1
| #define HAVE_DLADDR 1
| #define HAVE_DLADDR 1
| #define BUILD_ENGINE_BUFFER 1
| #define BUILD_LOADER_EET 1
| #define BUILD_FONT_LOADER_EET 1
| #define BUILD_LOADER_PMAPS 1
| #define BUILD_LOADER_PNG 1
| /* end confdefs.h.  */
| #include <stdio.h>
| #ifdef HAVE_SYS_TYPES_H
| # include <sys/types.h>
| #endif
| #ifdef HAVE_SYS_STAT_H
| # include <sys/stat.h>
| #endif
| #ifdef STDC_HEADERS
| # include <stdlib.h>
| # include <stddef.h>
| #else
| # ifdef HAVE_STDLIB_H
| #  include <stdlib.h>
| # endif
| #endif
| #ifdef HAVE_STRING_H
| # if !defined STDC_HEADERS && defined HAVE_MEMORY_H
| #  include <memory.h>
| # endif
| # include <string.h>
| #endif
| #ifdef HAVE_STRINGS_H
| # include <strings.h>
| #endif
| #ifdef HAVE_INTTYPES_H
| # include <inttypes.h>
| #endif
| #ifdef HAVE_STDINT_H
| # include <stdint.h>
| #endif
| #ifdef HAVE_UNISTD_H
| # include <unistd.h>
| #endif
| #include <tiffio.h>
configure:26866: result: no
configure:26866: checking tiffio.h presence
configure:26866: gcc -E  conftest.c
conftest.c:38:20: error: tiffio.h: No such file or directory
configure:26866: $? = 1
configure: failed program was:
| /* confdefs.h */
| #define PACKAGE_NAME "evas"
| #define PACKAGE_TARNAME "evas"
| #define PACKAGE_VERSION "0.9.9.063"
| #define PACKAGE_STRING "evas 0.9.9.063"
| #define PACKAGE_BUGREPORT "enlightenment-devel@lists.sourceforge.net"
| #define PACKAGE_URL ""
| #define PACKAGE "evas"
| #define VERSION "0.9.9.063"
| #define STDC_HEADERS 1
| #define HAVE_SYS_TYPES_H 1
| #define HAVE_SYS_STAT_H 1
| #define HAVE_STDLIB_H 1
| #define HAVE_STRING_H 1
| #define HAVE_MEMORY_H 1
| #define HAVE_STRINGS_H 1
| #define HAVE_INTTYPES_H 1
| #define HAVE_STDINT_H 1
| #define HAVE_UNISTD_H 1
| #define HAVE_DLFCN_H 1
| #define LT_OBJDIR ".libs/"
| #define MODULE_ARCH "darwin10.2.0-x86_64-ver-pre-svn-05"
| #define HAVE_FONTCONFIG 1
| #define STDC_HEADERS 1
| #define HAVE___ATTRIBUTE__ 1
| #define __UNUSED__ __attribute__((unused))
| #define HAVE_ALLOCA_H 1
| #define HAVE_ALLOCA 1
| #define HAVE_DLOPEN 1
| #define HAVE_DLADDR 1
| #define HAVE_DLADDR 1
| #define BUILD_ENGINE_BUFFER 1
| #define BUILD_LOADER_EET 1
| #define BUILD_FONT_LOADER_EET 1
| #define BUILD_LOADER_PMAPS 1
| #define BUILD_LOADER_PNG 1
| /* end confdefs.h.  */
| #include <tiffio.h>
configure:26866: result: no
configure:26866: checking for tiffio.h
configure:26866: result: no
configure:27031: checking whether Tiff image loader will be built
configure:27033: result: no
configure:27108: checking whether to enable XPM image loader
configure:27110: result: yes
configure:27136: checking whether XPM image loader will be built
configure:27138: result: yes
configure:27198: checking pthread.h usability
configure:27198: gcc -c -ggdb -O0 -D_GNU_SOURCE  conftest.c >&5
configure:27198: $? = 0
configure:27198: result: yes
configure:27198: checking pthread.h presence
configure:27198: gcc -E  conftest.c
configure:27198: $? = 0
configure:27198: result: yes
configure:27198: checking for pthread.h
configure:27198: result: yes
configure:27216: checking for pthread.h
configure:27216: result: yes
configure:27223: checking for pthread_attr_setaffinity_np in -lpthread
configure:27248: gcc -o conftest -ggdb -O0 -D_GNU_SOURCE   conftest.c -lpthread   >&5
Undefined symbols:
  "_pthread_attr_setaffinity_np", referenced from:
      _main in cc9JBea8.o
ld: symbol(s) not found
collect2: ld returned 1 exit status
configure:27248: $? = 1
configure: failed program was:
| /* confdefs.h */
| #define PACKAGE_NAME "evas"
| #define PACKAGE_TARNAME "evas"
| #define PACKAGE_VERSION "0.9.9.063"
| #define PACKAGE_STRING "evas 0.9.9.063"
| #define PACKAGE_BUGREPORT "enlightenment-devel@lists.sourceforge.net"
| #define PACKAGE_URL ""
| #define PACKAGE "evas"
| #define VERSION "0.9.9.063"
| #define STDC_HEADERS 1
| #define HAVE_SYS_TYPES_H 1
| #define HAVE_SYS_STAT_H 1
| #define HAVE_STDLIB_H 1
| #define HAVE_STRING_H 1
| #define HAVE_MEMORY_H 1
| #define HAVE_STRINGS_H 1
| #define HAVE_INTTYPES_H 1
| #define HAVE_STDINT_H 1
| #define HAVE_UNISTD_H 1
| #define HAVE_DLFCN_H 1
| #define LT_OBJDIR ".libs/"
| #define MODULE_ARCH "darwin10.2.0-x86_64-ver-pre-svn-05"
| #define HAVE_FONTCONFIG 1
| #define STDC_HEADERS 1
| #define HAVE___ATTRIBUTE__ 1
| #define __UNUSED__ __attribute__((unused))
| #define HAVE_ALLOCA_H 1
| #define HAVE_ALLOCA 1
| #define HAVE_DLOPEN 1
| #define HAVE_DLADDR 1
| #define HAVE_DLADDR 1
| #define BUILD_ENGINE_BUFFER 1
| #define BUILD_LOADER_EET 1
| #define BUILD_FONT_LOADER_EET 1
| #define BUILD_LOADER_PMAPS 1
| #define BUILD_LOADER_PNG 1
| #define BUILD_LOADER_XPM 1
| #define HAVE_PTHREAD_H 1
| /* end confdefs.h.  */
| 
| /* Override any GCC internal prototype to avoid an error.
|    Use char because int might match the return type of a GCC
|    builtin and then its argument prototype would still apply.  */
| #ifdef __cplusplus
| extern "C"
| #endif
| char pthread_attr_setaffinity_np ();
| int
| main ()
| {
| return pthread_attr_setaffinity_np ();
|   ;
|   return 0;
| }
configure:27257: result: no
configure:27216: checking sched.h usability
configure:27216: gcc -c -ggdb -O0 -D_GNU_SOURCE  conftest.c >&5
configure:27216: $? = 0
configure:27216: result: yes
configure:27216: checking sched.h presence
configure:27216: gcc -E  conftest.c
configure:27216: $? = 0
configure:27216: result: yes
configure:27216: checking for sched.h
configure:27216: result: yes
configure:27223: checking for pthread_attr_setaffinity_np in -lpthread
configure:27257: result: no
configure:27321: checking whether to build pthread code
configure:27351: result: no
configure:27367: checking whether to build Threaded Pipe Rendering support
configure:27375: result: no
configure:27378: checking whether we can build Threaded Pipe Rendering support
configure:27389: result: no
configure:27397: checking whether to build Async Events support
configure:27405: result: auto
configure:27408: checking whether we can build Async Events support
configure:27411: result: yes
configure:27426: checking whether to build Async Image Preload support
configure:27434: result: auto
configure:27437: checking whether we can build Async Image Preload support
configure:27440: result: yes
configure:27455: checking whether we should link with pthread
configure:27458: result: yes
configure:27478: checking whether to build mmx code
configure:27498: result: yes
configure:27521: checking whether to build sse code
configure:27541: result: yes
configure:27562: checking whether to build altivec code
configure:27576: result: no
configure:27658: checking whether to build neon code
configure:27678: result: no
configure:27693: checking whether to build c code
configure:27713: result: yes
configure:27728: checking whether to check magic for evas object
configure:27736: result: yes
configure:27774: checking whether to build sampling scaler
configure:27776: result: yes
configure:27811: checking whether to build smooth scaler
configure:27813: result: yes
configure:27836: checking whether to build yuv converter code
configure:27856: result: yes
configure:27889: checking whether to build small dither mask
configure:27891: result: no
configure:27926: checking whether to build line dither mask
configure:27928: result: no
configure:27963: checking whether to build conversion to 16bpp without dither mask
configure:27965: result: no
configure:28001: checking whether to build 8bpp RGB 332 converter code
configure:28003: result: yes
configure:28032: checking whether to build 8bpp RGB 666 converter code
configure:28034: result: yes
configure:28063: checking whether to build 8bpp RGB 232 converter code
configure:28065: result: yes
configure:28094: checking whether to build 8bpp RGB 222 converter code
configure:28096: result: yes
configure:28125: checking whether to build 8bpp RGB 221 converter code
configure:28127: result: yes
configure:28156: checking whether to build 8bpp RGB 121 converter code
configure:28158: result: yes
configure:28187: checking whether to build 8bpp RGB 111 converter code
configure:28189: result: yes
configure:28218: checking whether to build 16bpp RGB 565 converter code
configure:28220: result: yes
configure:28249: checking whether to build 16bpp BGR 565 converter code
configure:28251: result: yes
configure:28280: checking whether to build 16bpp RGB 555 converter code
configure:28282: result: yes
configure:28311: checking whether to build 16bpp RGB 444 converter code
configure:28313: result: yes
configure:28330: checking whether to build 16bpp 565 (444 ipaq) converter code
configure:28355: result: yes
configure:28375: checking whether to build 16bpp RGB rotation 0 converter code
configure:28377: result: yes
configure:28406: checking whether to build 16bpp RGB rotation 180 converter code
configure:28408: result: yes
configure:28437: checking whether to build 16bpp RGB rotation 270 converter code
configure:28439: result: yes
configure:28468: checking whether to build 16bpp RGB rotation 90 converter code
configure:28470: result: yes
configure:28501: checking whether to build 24bpp RGB 888 converter code
configure:28503: result: yes
configure:28532: checking whether to build 24bpp BGR 888 converter code
configure:28534: result: yes
configure:28563: checking whether to build 32bpp RGB 8888 converter code
configure:28565: result: yes
configure:28594: checking whether to build 32bpp RGBX 8888 converter code
configure:28596: result: yes
configure:28625: checking whether to build 32bpp BGR 8888 converter code
configure:28627: result: yes
configure:28656: checking whether to build 32bpp BGRX 8888 converter code
configure:28658: result: yes
configure:28675: checking whether to build 24bpp 666 (666 ezx) converter code
configure:28700: result: yes
configure:28706: checking whether to build 32bpp 666 (666 ezx) converter code
configure:28731: result: yes
configure:28751: checking whether to build 32bpp RGB rotation 0 converter code
configure:28753: result: yes
configure:28782: checking whether to build 32bpp RGB rotation 180 converter code
configure:28784: result: yes
configure:28813: checking whether to build 32bpp RGB rotation 270 converter code
configure:28815: result: yes
configure:28844: checking whether to build 32bpp RGB rotation 90 converter code
configure:28846: result: yes
configure:28877: checking whether to build 8bpp GRY 1 converter code
configure:28879: result: yes
configure:28908: checking whether to build 8bpp GRY 16 converter code
configure:28910: result: yes
configure:28927: checking whether to build 8bpp grayscale 64-palette converter code
configure:28952: result: yes
configure:28959: checking whether to enable build with valgrind
configure:28967: result: no
configure:29461: creating ./config.status

## ---------------------- ##
## Running config.status. ##
## ---------------------- ##

This file was extended by evas config.status 0.9.9.063, which was
generated by GNU Autoconf 2.65.  Invocation command line was

  CONFIG_FILES    = 
  CONFIG_HEADERS  = 
  CONFIG_LINKS    = 
  CONFIG_COMMANDS = 
  $ ./config.status 

on Leif-Middelschultes-iMac.local

config.status:1505: creating Makefile
config.status:1505: creating evas-directfb.pc
config.status:1505: creating evas-fb.pc
config.status:1505: creating evas-opengl-glew.pc
config.status:1505: creating evas-opengl-x11.pc
config.status:1505: creating evas-opengl-sdl.pc
config.status:1505: creating evas-quartz.pc
config.status:1505: creating evas-software-buffer.pc
config.status:1505: creating evas-software-x11.pc
config.status:1505: creating evas-software-16-x11.pc
config.status:1505: creating evas-xrender-x11.pc
config.status:1505: creating evas-xrender-xcb.pc
config.status:1505: creating evas-software-gdi.pc
config.status:1505: creating evas-software-ddraw.pc
config.status:1505: creating evas-software-16-ddraw.pc
config.status:1505: creating evas-direct3d.pc
config.status:1505: creating evas-software-16-wince.pc
config.status:1505: creating evas-software-sdl.pc
config.status:1505: creating evas.pc
config.status:1505: creating doc/evas.dox
config.status:1505: creating doc/Makefile
config.status:1505: creating src/Makefile
config.status:1505: creating src/bin/Makefile
config.status:1505: creating src/lib/Makefile
config.status:1505: creating src/lib/canvas/Makefile
config.status:1505: creating src/lib/file/Makefile
config.status:1505: creating src/lib/imaging/Makefile
config.status:1505: creating src/lib/cache/Makefile
config.status:1505: creating src/lib/cserve/Makefile
config.status:1505: creating src/lib/engines/Makefile
config.status:1505: creating src/lib/engines/common/Makefile
config.status:1505: creating src/lib/engines/common/evas_op_add/Makefile
config.status:1505: creating src/lib/engines/common/evas_op_blend/Makefile
config.status:1505: creating src/lib/engines/common/evas_op_copy/Makefile
config.status:1505: creating src/lib/engines/common/evas_op_mask/Makefile
config.status:1505: creating src/lib/engines/common/evas_op_mul/Makefile
config.status:1505: creating src/lib/engines/common/evas_op_sub/Makefile
config.status:1505: creating src/lib/engines/common_16/Makefile
config.status:1505: creating src/modules/Makefile
config.status:1505: creating src/modules/engines/Makefile
config.status:1505: creating src/modules/engines/software_generic/Makefile
config.status:1505: creating src/modules/engines/software_gdi/Makefile
config.status:1505: creating src/modules/engines/software_ddraw/Makefile
config.status:1505: creating src/modules/engines/direct3d/Makefile
config.status:1505: creating src/modules/engines/software_16_wince/Makefile
config.status:1505: creating src/modules/engines/software_x11/Makefile
config.status:1505: creating src/modules/engines/fb/Makefile
config.status:1505: creating src/modules/engines/buffer/Makefile
config.status:1505: creating src/modules/engines/directfb/Makefile
config.status:1505: creating src/modules/engines/gl_common/Makefile
config.status:1505: creating src/modules/engines/gl_glew/Makefile
config.status:1505: creating src/modules/engines/gl_x11/Makefile
config.status:1505: creating src/modules/engines/gl_sdl/Makefile
config.status:1505: creating src/modules/engines/quartz/Makefile
config.status:1505: creating src/modules/engines/xrender_x11/Makefile
config.status:1505: creating src/modules/engines/software_sdl/Makefile
config.status:1505: creating src/modules/engines/software_16/Makefile
config.status:1505: creating src/modules/engines/software_16_x11/Makefile
config.status:1505: creating src/modules/engines/software_16_ddraw/Makefile
config.status:1505: creating src/modules/engines/software_16_sdl/Makefile
config.status:1505: creating src/modules/loaders/Makefile
config.status:1505: creating src/modules/loaders/edb/Makefile
config.status:1505: creating src/modules/loaders/eet/Makefile
config.status:1505: creating src/modules/loaders/gif/Makefile
config.status:1505: creating src/modules/loaders/jpeg/Makefile
config.status:1505: creating src/modules/loaders/png/Makefile
config.status:1505: creating src/modules/loaders/tiff/Makefile
config.status:1505: creating src/modules/loaders/xpm/Makefile
config.status:1505: creating src/modules/loaders/svg/Makefile
config.status:1505: creating src/modules/loaders/pmaps/Makefile
config.status:1505: creating src/modules/savers/Makefile
config.status:1505: creating src/modules/savers/edb/Makefile
config.status:1505: creating src/modules/savers/eet/Makefile
config.status:1505: creating src/modules/savers/jpeg/Makefile
config.status:1505: creating src/modules/savers/png/Makefile
config.status:1505: creating src/modules/savers/tiff/Makefile
config.status:1505: creating src/lib/include/Makefile
config.status:1505: creating README
config.status:1505: creating evas.spec
config.status:1505: creating config.h
config.status:1677: config.h is unchanged
config.status:1725: executing depfiles commands
config.status:1725: executing libtool commands

## ---------------- ##
## Cache variables. ##
## ---------------- ##

ac_cv___attribute__=yes
ac_cv_build=x86_64-apple-darwin10.2.0
ac_cv_c_bigendian=no
ac_cv_c_compiler_gnu=yes
ac_cv_c_const=yes
ac_cv_cxx_compiler_gnu=yes
ac_cv_env_CCC_set=
ac_cv_env_CCC_value=
ac_cv_env_CC_set=
ac_cv_env_CC_value=
ac_cv_env_CFLAGS_set=set
ac_cv_env_CFLAGS_value='-ggdb -O0'
ac_cv_env_CPPFLAGS_set=
ac_cv_env_CPPFLAGS_value=
ac_cv_env_CPP_set=
ac_cv_env_CPP_value=
ac_cv_env_CXXCPP_set=
ac_cv_env_CXXCPP_value=
ac_cv_env_CXXFLAGS_set=
ac_cv_env_CXXFLAGS_value=
ac_cv_env_CXX_set=
ac_cv_env_CXX_value=
ac_cv_env_DIRECTFB_CFLAGS_set=
ac_cv_env_DIRECTFB_CFLAGS_value=
ac_cv_env_DIRECTFB_LIBS_set=
ac_cv_env_DIRECTFB_LIBS_value=
ac_cv_env_EDB_CFLAGS_set=
ac_cv_env_EDB_CFLAGS_value=
ac_cv_env_EDB_LIBS_set=
ac_cv_env_EDB_LIBS_value=
ac_cv_env_EET_CFLAGS_set=
ac_cv_env_EET_CFLAGS_value=
ac_cv_env_EET_LIBS_set=
ac_cv_env_EET_LIBS_value=
ac_cv_env_EINA_CFLAGS_set=
ac_cv_env_EINA_CFLAGS_value=
ac_cv_env_EINA_LIBS_set=
ac_cv_env_EINA_LIBS_value=
ac_cv_env_EVIL_CFLAGS_set=
ac_cv_env_EVIL_CFLAGS_value=
ac_cv_env_EVIL_LIBS_set=
ac_cv_env_EVIL_LIBS_value=
ac_cv_env_FONTCONFIG_CFLAGS_set=
ac_cv_env_FONTCONFIG_CFLAGS_value=
ac_cv_env_FONTCONFIG_LIBS_set=
ac_cv_env_FONTCONFIG_LIBS_value=
ac_cv_env_FREETYPE_CFLAGS_set=
ac_cv_env_FREETYPE_CFLAGS_value=
ac_cv_env_FREETYPE_LIBS_set=
ac_cv_env_FREETYPE_LIBS_value=
ac_cv_env_FRIBIDI_CFLAGS_set=
ac_cv_env_FRIBIDI_CFLAGS_value=
ac_cv_env_FRIBIDI_LIBS_set=
ac_cv_env_FRIBIDI_LIBS_value=
ac_cv_env_LDFLAGS_set=
ac_cv_env_LDFLAGS_value=
ac_cv_env_LIBS_set=
ac_cv_env_LIBS_value=
ac_cv_env_OBJCFLAGS_set=
ac_cv_env_OBJCFLAGS_value=
ac_cv_env_OBJCPP_set=
ac_cv_env_OBJCPP_value=
ac_cv_env_OBJC_set=
ac_cv_env_OBJC_value=
ac_cv_env_PKG_CONFIG_set=
ac_cv_env_PKG_CONFIG_value=
ac_cv_env_PNG_CFLAGS_set=
ac_cv_env_PNG_CFLAGS_value=
ac_cv_env_PNG_LIBS_set=
ac_cv_env_PNG_LIBS_value=
ac_cv_env_SDL_CFLAGS_set=
ac_cv_env_SDL_CFLAGS_value=
ac_cv_env_SDL_LIBS_set=
ac_cv_env_SDL_LIBS_value=
ac_cv_env_SVG_CFLAGS_set=
ac_cv_env_SVG_CFLAGS_value=
ac_cv_env_SVG_LIBS_set=
ac_cv_env_SVG_LIBS_value=
ac_cv_env_VALGRIND_CFLAGS_set=
ac_cv_env_VALGRIND_CFLAGS_value=
ac_cv_env_VALGRIND_LIBS_set=
ac_cv_env_VALGRIND_LIBS_value=
ac_cv_env_XCBRENDER_CFLAGS_set=
ac_cv_env_XCBRENDER_CFLAGS_value=
ac_cv_env_XCBRENDER_LIBS_set=
ac_cv_env_XCBRENDER_LIBS_value=
ac_cv_env_XCB_CFLAGS_set=
ac_cv_env_XCB_CFLAGS_value=
ac_cv_env_XCB_LIBS_set=
ac_cv_env_XCB_LIBS_value=
ac_cv_env_XMKMF_set=
ac_cv_env_XMKMF_value=
ac_cv_env_build_alias_set=
ac_cv_env_build_alias_value=
ac_cv_env_host_alias_set=
ac_cv_env_host_alias_value=
ac_cv_env_target_alias_set=
ac_cv_env_target_alias_value=
ac_cv_func_alloca_works=yes
ac_cv_func_connect=yes
ac_cv_func_dladdr=yes
ac_cv_func_dlopen=yes
ac_cv_func_gethostbyname=yes
ac_cv_func_remove=yes
ac_cv_func_shmat=yes
ac_cv_have_x='have_x=yes	ac_x_includes='\'''\''	ac_x_libraries='\''/usr/X11/lib'\'''
ac_cv_header_X11_X_h=yes
ac_cv_header_dlfcn_h=yes
ac_cv_header_fnmatch_h=yes
ac_cv_header_gif_lib_h=no
ac_cv_header_inttypes_h=yes
ac_cv_header_jpeglib_h=no
ac_cv_header_memory_h=yes
ac_cv_header_pthread_h=yes
ac_cv_header_sched_h=yes
ac_cv_header_stdc=yes
ac_cv_header_stdint_h=yes
ac_cv_header_stdlib_h=yes
ac_cv_header_string_h=yes
ac_cv_header_strings_h=yes
ac_cv_header_sys_stat_h=yes
ac_cv_header_sys_types_h=yes
ac_cv_header_tiffio_h=no
ac_cv_header_unistd_h=yes
ac_cv_host=x86_64-apple-darwin10.2.0
ac_cv_lib_ICE_IceConnectionNumber=yes
ac_cv_lib_X11_XCreateImage=no
ac_cv_lib_pthread_pthread_attr_setaffinity_np=no
ac_cv_objc_compiler_gnu=yes
ac_cv_objext=o
ac_cv_path_EGREP='/opt/local/bin/grep -E'
ac_cv_path_FGREP='/opt/local/bin/grep -F'
ac_cv_path_GREP=/opt/local/bin/grep
ac_cv_path_SED=/opt/local/bin/gsed
ac_cv_path_ac_pt_PKG_CONFIG=/opt/local/bin/pkg-config
ac_cv_path_install='/opt/local/bin/ginstall -c'
ac_cv_path_mkdir=/opt/local/bin/gmkdir
ac_cv_prog_AWK=awk
ac_cv_prog_CPP='gcc -E'
ac_cv_prog_CXXCPP='g++ -E'
ac_cv_prog_OBJCPP='gcc -E'
ac_cv_prog_ac_ct_AR=ar
ac_cv_prog_ac_ct_CC=gcc
ac_cv_prog_ac_ct_CXX=g++
ac_cv_prog_ac_ct_DSYMUTIL=dsymutil
ac_cv_prog_ac_ct_LIPO=lipo
ac_cv_prog_ac_ct_NMEDIT=nmedit
ac_cv_prog_ac_ct_OBJC=gcc
ac_cv_prog_ac_ct_OBJDUMP=objdump
ac_cv_prog_ac_ct_OTOOL=otool
ac_cv_prog_ac_ct_RANLIB=ranlib
ac_cv_prog_ac_ct_STRIP=strip
ac_cv_prog_cc_c89=
ac_cv_prog_cc_g=yes
ac_cv_prog_cxx_g=yes
ac_cv_prog_efl_have_doxygen=yes
ac_cv_prog_make_make_set=yes
ac_cv_prog_objc_g=yes
ac_cv_search_fnmatch='none required'
ac_cv_search_strerror='none required'
ac_cv_working_alloca_h=yes
am_cv_CC_dependencies_compiler_type=gcc3
am_cv_CXX_dependencies_compiler_type=gcc3
am_cv_OBJC_dependencies_compiler_type=gcc3
am_cv_prog_cc_stdc=
lt_cv_apple_cc_single_mod=yes
lt_cv_deplibs_check_method=pass_all
lt_cv_file_magic_cmd='$MAGIC_CMD'
lt_cv_file_magic_test_file=
lt_cv_ld_exported_symbols_list=yes
lt_cv_ld_reload_flag=-r
lt_cv_nm_interface='BSD nm'
lt_cv_objdir=.libs
lt_cv_path_LD=/usr/libexec/gcc/i686-apple-darwin10/4.2.1/ld
lt_cv_path_LDCXX=/usr/libexec/gcc/i686-apple-darwin10/4.2.1/ld
lt_cv_path_NM=/usr/bin/nm
lt_cv_prog_compiler_c_o=yes
lt_cv_prog_compiler_c_o_CXX=yes
lt_cv_prog_compiler_pic_works=yes
lt_cv_prog_compiler_pic_works_CXX=yes
lt_cv_prog_compiler_rtti_exceptions=no
lt_cv_prog_compiler_static_works=no
lt_cv_prog_compiler_static_works_CXX=no
lt_cv_prog_gnu_ld=no
lt_cv_prog_gnu_ldcxx=no
lt_cv_sys_global_symbol_pipe='sed -n -e '\''s/^.*[	 ]\([BCDEGRST][BCDEGRST]*\)[	 ][	 ]*_\([_A-Za-z][_A-Za-z0-9]*\)$/\1 _\2 \2/p'\'''
lt_cv_sys_global_symbol_to_c_name_address='sed -n -e '\''s/^: \([^ ]*\) $/  {\"\1\", (void *) 0},/p'\'' -e '\''s/^[BCDEGRST]* \([^ ]*\) \([^ ]*\)$/  {"\2", (void *) \&\2},/p'\'''
lt_cv_sys_global_symbol_to_c_name_address_lib_prefix='sed -n -e '\''s/^: \([^ ]*\) $/  {\"\1\", (void *) 0},/p'\'' -e '\''s/^[BCDEGRST]* \([^ ]*\) \(lib[^ ]*\)$/  {"\2", (void *) \&\2},/p'\'' -e '\''s/^[BCDEGRST]* \([^ ]*\) \([^ ]*\)$/  {"lib\2", (void *) \&\2},/p'\'''
lt_cv_sys_global_symbol_to_cdecl='sed -n -e '\''s/^T .* \(.*\)$/extern int \1();/p'\'' -e '\''s/^[BCDEGRST]* .* \(.*\)$/extern char \1;/p'\'''
lt_cv_sys_max_cmd_len=196608
pkg_cv_EET_CFLAGS='-I/opt/e17/include -I/opt/e17/include/eina-0 -I/opt/e17/include/eina-0/eina -I/opt/local/include  '
pkg_cv_EET_LIBS='-R/opt/local/lib -L/opt/e17/lib -L/opt/local/lib -leet -lgcrypt -lgpg-error -ljpeg -lz -lm -lgnutls -ltasn1 -leina -ldl  '
pkg_cv_EINA_CFLAGS='-I/opt/e17/include/eina-0 -I/opt/e17/include/eina-0/eina  '
pkg_cv_EINA_LIBS='-L/opt/e17/lib -leina -ldl  '
pkg_cv_FONTCONFIG_CFLAGS='-I/opt/local/include  '
pkg_cv_FONTCONFIG_LIBS='-L/opt/local/lib -lfontconfig -lexpat -lfreetype -lz -liconv  '
pkg_cv_FREETYPE_CFLAGS='-I/opt/local/include/freetype2 -I/opt/local/include  '
pkg_cv_FREETYPE_LIBS='-L/opt/local/lib -lfreetype -lz  '
pkg_cv_PNG_CFLAGS='-I/opt/local/include/libpng12  '
pkg_cv_PNG_LIBS='-L/opt/local/lib -lpng12 -lz  '
rw_cv_prog_objc_works=yes

## ----------------- ##
## Output variables. ##
## ----------------- ##

ACLOCAL='${SHELL} /Users/leif/e17_src/evas/missing --run aclocal-1.11'
ALLOCA=''
AMDEPBACKSLASH='\'
AMDEP_FALSE='#'
AMDEP_TRUE=''
AMTAR='${SHELL} /Users/leif/e17_src/evas/missing --run tar'
AM_BACKSLASH='\'
AM_DEFAULT_VERBOSITY='0'
AR='ar'
AS='as'
AUTOCONF='${SHELL} /Users/leif/e17_src/evas/missing --run autoconf'
AUTOHEADER='${SHELL} /Users/leif/e17_src/evas/missing --run autoheader'
AUTOMAKE='${SHELL} /Users/leif/e17_src/evas/missing --run automake-1.11'
AWK='awk'
BUILD_ENGINE_BUFFER_FALSE='#'
BUILD_ENGINE_BUFFER_TRUE=''
BUILD_ENGINE_DIRECT3D_FALSE=''
BUILD_ENGINE_DIRECT3D_TRUE='#'
BUILD_ENGINE_DIRECTFB_FALSE=''
BUILD_ENGINE_DIRECTFB_TRUE='#'
BUILD_ENGINE_FB_FALSE=''
BUILD_ENGINE_FB_TRUE='#'
BUILD_ENGINE_GL_COMMON_FALSE=''
BUILD_ENGINE_GL_COMMON_TRUE='#'
BUILD_ENGINE_GL_GLEW_FALSE=''
BUILD_ENGINE_GL_GLEW_TRUE='#'
BUILD_ENGINE_GL_SDL_FALSE=''
BUILD_ENGINE_GL_SDL_TRUE='#'
BUILD_ENGINE_GL_X11_FALSE=''
BUILD_ENGINE_GL_X11_TRUE='#'
BUILD_ENGINE_QUARTZ_FALSE=''
BUILD_ENGINE_QUARTZ_TRUE='#'
BUILD_ENGINE_SOFTWARE_16_DDRAW_FALSE=''
BUILD_ENGINE_SOFTWARE_16_DDRAW_TRUE='#'
BUILD_ENGINE_SOFTWARE_16_FALSE=''
BUILD_ENGINE_SOFTWARE_16_TRUE='#'
BUILD_ENGINE_SOFTWARE_16_WINCE_FALSE=''
BUILD_ENGINE_SOFTWARE_16_WINCE_TRUE='#'
BUILD_ENGINE_SOFTWARE_16_X11_FALSE=''
BUILD_ENGINE_SOFTWARE_16_X11_TRUE='#'
BUILD_ENGINE_SOFTWARE_DDRAW_FALSE=''
BUILD_ENGINE_SOFTWARE_DDRAW_TRUE='#'
BUILD_ENGINE_SOFTWARE_GDI_FALSE=''
BUILD_ENGINE_SOFTWARE_GDI_TRUE='#'
BUILD_ENGINE_SOFTWARE_SDL_FALSE=''
BUILD_ENGINE_SOFTWARE_SDL_TRUE='#'
BUILD_ENGINE_SOFTWARE_X11_FALSE=''
BUILD_ENGINE_SOFTWARE_X11_TRUE='#'
BUILD_ENGINE_SOFTWARE_XCB_FALSE=''
BUILD_ENGINE_SOFTWARE_XCB_TRUE='#'
BUILD_ENGINE_SOFTWARE_XLIB_FALSE=''
BUILD_ENGINE_SOFTWARE_XLIB_TRUE='#'
BUILD_ENGINE_XRENDER_X11_FALSE=''
BUILD_ENGINE_XRENDER_X11_TRUE='#'
BUILD_ENGINE_XRENDER_XCB_FALSE=''
BUILD_ENGINE_XRENDER_XCB_TRUE='#'
BUILD_LOADER_EDB_FALSE=''
BUILD_LOADER_EDB_TRUE='#'
BUILD_LOADER_EET_FALSE='#'
BUILD_LOADER_EET_TRUE=''
BUILD_LOADER_GIF_FALSE=''
BUILD_LOADER_GIF_TRUE='#'
BUILD_LOADER_JPEG_FALSE=''
BUILD_LOADER_JPEG_TRUE='#'
BUILD_LOADER_PMAPS_FALSE='#'
BUILD_LOADER_PMAPS_TRUE=''
BUILD_LOADER_PNG_FALSE='#'
BUILD_LOADER_PNG_TRUE=''
BUILD_LOADER_SVG_FALSE=''
BUILD_LOADER_SVG_TRUE='#'
BUILD_LOADER_TIFF_FALSE=''
BUILD_LOADER_TIFF_TRUE='#'
BUILD_LOADER_XPM_FALSE='#'
BUILD_LOADER_XPM_TRUE=''
BUILD_SAVER_JPEG_FALSE=''
BUILD_SAVER_JPEG_TRUE='#'
CC='gcc'
CCDEPMODE='depmode=gcc3'
CFLAGS='-ggdb -O0 -D_GNU_SOURCE'
CPP='gcc -E'
CPPFLAGS=''
CXX='g++'
CXXCPP='g++ -E'
CXXDEPMODE='depmode=gcc3'
CXXFLAGS='-g -O2'
CYGPATH_W='echo'
DEFS='-DHAVE_CONFIG_H'
DEPDIR='.deps'
DIRECTFB_CFLAGS=''
DIRECTFB_LIBS=''
DLLTOOL='dlltool'
DSYMUTIL='dsymutil'
DUMPBIN=''
ECHO_C='\c'
ECHO_N=''
ECHO_T=''
EDB_CFLAGS=''
EDB_LIBS=''
EET_CFLAGS='-I/opt/e17/include -I/opt/e17/include/eina-0 -I/opt/e17/include/eina-0/eina -I/opt/local/include  '
EET_LIBS='-R/opt/local/lib -L/opt/e17/lib -L/opt/local/lib -leet -lgcrypt -lgpg-error -ljpeg -lz -lm -lgnutls -ltasn1 -leina -ldl  '
EFL_BUILD_DOC_FALSE='#'
EFL_BUILD_DOC_TRUE=''
EFL_FNMATCH_LIBS=''
EGREP='/opt/local/bin/grep -E'
EINA_CFLAGS='-I/opt/e17/include/eina-0 -I/opt/e17/include/eina-0/eina  '
EINA_LIBS='-L/opt/e17/lib -leina -ldl  '
EVAS_CSERVE_FALSE=''
EVAS_CSERVE_TRUE='#'
EVAS_MAGIC_DEBUG_FALSE='#'
EVAS_MAGIC_DEBUG_TRUE=''
EVAS_STATIC_BUILD_BUFFER_FALSE=''
EVAS_STATIC_BUILD_BUFFER_TRUE='#'
EVAS_STATIC_BUILD_DIRECT3D_FALSE=''
EVAS_STATIC_BUILD_DIRECT3D_TRUE='#'
EVAS_STATIC_BUILD_DIRECTFB_FALSE=''
EVAS_STATIC_BUILD_DIRECTFB_TRUE='#'
EVAS_STATIC_BUILD_EDB_FALSE=''
EVAS_STATIC_BUILD_EDB_TRUE='#'
EVAS_STATIC_BUILD_EET_FALSE=''
EVAS_STATIC_BUILD_EET_TRUE='#'
EVAS_STATIC_BUILD_FB_FALSE=''
EVAS_STATIC_BUILD_FB_TRUE='#'
EVAS_STATIC_BUILD_GIF_FALSE=''
EVAS_STATIC_BUILD_GIF_TRUE='#'
EVAS_STATIC_BUILD_GL_GLEW_FALSE=''
EVAS_STATIC_BUILD_GL_GLEW_TRUE='#'
EVAS_STATIC_BUILD_GL_SDL_FALSE=''
EVAS_STATIC_BUILD_GL_SDL_TRUE='#'
EVAS_STATIC_BUILD_GL_X11_FALSE=''
EVAS_STATIC_BUILD_GL_X11_TRUE='#'
EVAS_STATIC_BUILD_JPEG_FALSE=''
EVAS_STATIC_BUILD_JPEG_TRUE='#'
EVAS_STATIC_BUILD_PMAPS_FALSE=''
EVAS_STATIC_BUILD_PMAPS_TRUE='#'
EVAS_STATIC_BUILD_PNG_FALSE=''
EVAS_STATIC_BUILD_PNG_TRUE='#'
EVAS_STATIC_BUILD_QUARTZ_FALSE=''
EVAS_STATIC_BUILD_QUARTZ_TRUE='#'
EVAS_STATIC_BUILD_SOFTWARE_16_DDRAW_FALSE=''
EVAS_STATIC_BUILD_SOFTWARE_16_DDRAW_TRUE='#'
EVAS_STATIC_BUILD_SOFTWARE_16_FALSE=''
EVAS_STATIC_BUILD_SOFTWARE_16_TRUE='#'
EVAS_STATIC_BUILD_SOFTWARE_16_WINCE_FALSE=''
EVAS_STATIC_BUILD_SOFTWARE_16_WINCE_TRUE='#'
EVAS_STATIC_BUILD_SOFTWARE_16_X11_FALSE=''
EVAS_STATIC_BUILD_SOFTWARE_16_X11_TRUE='#'
EVAS_STATIC_BUILD_SOFTWARE_DDRAW_FALSE=''
EVAS_STATIC_BUILD_SOFTWARE_DDRAW_TRUE='#'
EVAS_STATIC_BUILD_SOFTWARE_GDI_FALSE=''
EVAS_STATIC_BUILD_SOFTWARE_GDI_TRUE='#'
EVAS_STATIC_BUILD_SOFTWARE_GENERIC_FALSE=''
EVAS_STATIC_BUILD_SOFTWARE_GENERIC_TRUE='#'
EVAS_STATIC_BUILD_SOFTWARE_SDL_FALSE=''
EVAS_STATIC_BUILD_SOFTWARE_SDL_TRUE='#'
EVAS_STATIC_BUILD_SOFTWARE_X11_FALSE=''
EVAS_STATIC_BUILD_SOFTWARE_X11_TRUE='#'
EVAS_STATIC_BUILD_SOFTWARE_XCB_FALSE=''
EVAS_STATIC_BUILD_SOFTWARE_XCB_TRUE='#'
EVAS_STATIC_BUILD_SOFTWARE_XLIB_FALSE=''
EVAS_STATIC_BUILD_SOFTWARE_XLIB_TRUE='#'
EVAS_STATIC_BUILD_SVG_FALSE=''
EVAS_STATIC_BUILD_SVG_TRUE='#'
EVAS_STATIC_BUILD_TIFF_FALSE=''
EVAS_STATIC_BUILD_TIFF_TRUE='#'
EVAS_STATIC_BUILD_XPM_FALSE=''
EVAS_STATIC_BUILD_XPM_TRUE='#'
EVAS_STATIC_BUILD_XRENDER_X11_FALSE=''
EVAS_STATIC_BUILD_XRENDER_X11_TRUE='#'
EVAS_STATIC_BUILD_XRENDER_XCB_FALSE=''
EVAS_STATIC_BUILD_XRENDER_XCB_TRUE='#'
EVIL_CFLAGS=''
EVIL_LIBS=''
EXEEXT=''
FGREP='/opt/local/bin/grep -F'
FONTCONFIG_CFLAGS='-I/opt/local/include  '
FONTCONFIG_LIBS='-L/opt/local/lib -lfontconfig -lexpat -lfreetype -lz -liconv  '
FREETYPE_CFLAGS='-I/opt/local/include/freetype2 -I/opt/local/include  '
FREETYPE_LIBS='-L/opt/local/lib -lfreetype -lz  '
FRIBIDI_CFLAGS=''
FRIBIDI_LIBS=''
GREP='/opt/local/bin/grep'
INSTALL_DATA='${INSTALL} -m 644'
INSTALL_PROGRAM='${INSTALL}'
INSTALL_SCRIPT='${INSTALL}'
INSTALL_STRIP_PROGRAM='$(install_sh) -c -s'
LD='/usr/libexec/gcc/i686-apple-darwin10/4.2.1/ld'
LDFLAGS=''
LIBOBJS=''
LIBS=''
LIBTOOL='$(SHELL) $(top_builddir)/libtool'
LIPO='lipo'
LN_S='ln -s'
LTLIBOBJS=''
MAKEINFO='${SHELL} /Users/leif/e17_src/evas/missing --run makeinfo'
MKDIR_P='/opt/local/bin/gmkdir -p'
MODULE_ARCH='darwin10.2.0-x86_64-ver-pre-svn-05'
NM='/usr/bin/nm'
NMEDIT='nmedit'
OBJC='gcc'
OBJCDEPMODE='depmode=gcc3'
OBJCFLAGS='-g -O2'
OBJCPP='gcc -E'
OBJDUMP='objdump'
OBJEXT='o'
OTOOL64=':'
OTOOL='otool'
PACKAGE='evas'
PACKAGE_BUGREPORT='enlightenment-devel@lists.sourceforge.net'
PACKAGE_NAME='evas'
PACKAGE_STRING='evas 0.9.9.063'
PACKAGE_TARNAME='evas'
PACKAGE_URL=''
PACKAGE_VERSION='0.9.9.063'
PATH_SEPARATOR=':'
PKG_CONFIG='/opt/local/bin/pkg-config'
PNG_CFLAGS='-I/opt/local/include/libpng12  '
PNG_LIBS='-L/opt/local/lib -lpng12 -lz  '
RANLIB='ranlib'
SDL_CFLAGS=''
SDL_LIBS=''
SED='/opt/local/bin/gsed'
SET_MAKE=''
SHELL='/bin/sh'
STRIP='strip'
SVG_CFLAGS=''
SVG_LIBS=''
VALGRIND_CFLAGS=''
VALGRIND_LIBS=''
VERSION='0.9.9.063'
WIN32_CFLAGS=''
WIN32_CPPFLAGS=''
XCBRENDER_CFLAGS=''
XCBRENDER_LIBS=''
XCB_CFLAGS=''
XCB_LIBS=''
XMKMF=''
X_CFLAGS=''
X_EXTRA_LIBS=''
X_LIBS=' -L/usr/X11/lib -R/usr/X11/lib'
X_PRE_LIBS=' -lSM -lICE'
ac_ct_CC='gcc'
ac_ct_CXX='g++'
ac_ct_DUMPBIN=''
ac_ct_OBJC='gcc'
altivec_cflags=''
am__EXEEXT_FALSE=''
am__EXEEXT_TRUE='#'
am__fastdepCC_FALSE='#'
am__fastdepCC_TRUE=''
am__fastdepCXX_FALSE='#'
am__fastdepCXX_TRUE=''
am__fastdepOBJC_FALSE='#'
am__fastdepOBJC_TRUE=''
am__include='include'
am__isrc=''
am__leading_dot='.'
am__quote=''
am__tar='${AMTAR} chof - "$$tardir"'
am__untar='${AMTAR} xf -'
bindir='${exec_prefix}/bin'
build='x86_64-apple-darwin10.2.0'
build_alias=''
build_cpu='x86_64'
build_os='darwin10.2.0'
build_vendor='apple'
datadir='${datarootdir}'
datarootdir='${prefix}/share'
dlopen_libs=''
docdir='${datarootdir}/doc/${PACKAGE_TARNAME}'
dvidir='${docdir}'
efl_doxygen='doxygen'
efl_have_doxygen='yes'
evas_engine_buffer_cflags=''
evas_engine_buffer_libs=''
evas_engine_direct3d_cflags=''
evas_engine_direct3d_libs=''
evas_engine_directfb_cflags=''
evas_engine_directfb_libs=''
evas_engine_fb_cflags=''
evas_engine_fb_libs=''
evas_engine_gl_common_libs=''
evas_engine_gl_glew_cflags=''
evas_engine_gl_glew_libs=''
evas_engine_gl_sdl_cflags=''
evas_engine_gl_sdl_libs=''
evas_engine_gl_x11_cflags=''
evas_engine_gl_x11_libs=''
evas_engine_quartz_cflags=''
evas_engine_quartz_libs=''
evas_engine_software_16_ddraw_cflags=''
evas_engine_software_16_ddraw_libs=''
evas_engine_software_16_wince_cflags=''
evas_engine_software_16_wince_libs=''
evas_engine_software_16_x11_cflags=''
evas_engine_software_16_x11_libs=''
evas_engine_software_ddraw_cflags=''
evas_engine_software_ddraw_libs=''
evas_engine_software_gdi_cflags=''
evas_engine_software_gdi_libs=''
evas_engine_software_sdl_cflags=''
evas_engine_software_sdl_libs=''
evas_engine_software_xcb_cflags=''
evas_engine_software_xcb_libs=''
evas_engine_software_xlib_cflags=''
evas_engine_software_xlib_libs=''
evas_engine_xrender_x11_cflags=''
evas_engine_xrender_x11_libs=''
evas_engine_xrender_xcb_cflags=''
evas_engine_xrender_xcb_libs=''
evas_image_loader_edb_cflags=''
evas_image_loader_edb_libs=''
evas_image_loader_eet_cflags='-I/opt/e17/include -I/opt/e17/include/eina-0 -I/opt/e17/include/eina-0/eina -I/opt/local/include  '
evas_image_loader_eet_libs='-R/opt/local/lib -L/opt/e17/lib -L/opt/local/lib -leet -lgcrypt -lgpg-error -ljpeg -lz -lm -lgnutls -ltasn1 -leina -ldl  '
evas_image_loader_gif_cflags=''
evas_image_loader_gif_libs=''
evas_image_loader_jpeg_cflags=''
evas_image_loader_jpeg_libs=''
evas_image_loader_pmaps_cflags=''
evas_image_loader_pmaps_libs=''
evas_image_loader_png_cflags='-I/opt/local/include/libpng12  '
evas_image_loader_png_libs='-L/opt/local/lib -lpng12 -lz  '
evas_image_loader_svg_cflags=''
evas_image_loader_svg_libs=''
evas_image_loader_tiff_cflags=''
evas_image_loader_tiff_libs=''
evas_image_loader_xpm_cflags=''
evas_image_loader_xpm_libs=''
exec_prefix='${prefix}'
have_evas_engine_software_xcb='no'
have_evas_engine_software_xlib='no'
host='x86_64-apple-darwin10.2.0'
host_alias=''
host_cpu='x86_64'
host_os='darwin10.2.0'
host_vendor='apple'
htmldir='${docdir}'
includedir='${prefix}/include'
infodir='${datarootdir}/info'
install_sh='${SHELL} /Users/leif/e17_src/evas/install-sh'
libdir='${exec_prefix}/lib'
libexecdir='${exec_prefix}/libexec'
localedir='${datarootdir}/locale'
localstatedir='${prefix}/var'
lt_ECHO='/bin/echo'
lt_enable_auto_import=''
mandir='${datarootdir}/man'
mkdir_p='/opt/local/bin/gmkdir -p'
oldincludedir='/usr/include'
pdfdir='${docdir}'
pkgconfig_requires_private='Requires.private'
prefix='/opt/e17'
program_transform_name='s,x,x,'
psdir='${docdir}'
pthread_cflags=''
pthread_libs='-lpthread'
release_info='-release ver-pre-svn-05'
requirement_evas='eet fontconfig freetype2 eina-0 '
sbindir='${exec_prefix}/sbin'
sharedstatedir='${prefix}/com'
sysconfdir='${prefix}/etc'
target_alias=''
version_info='9:9:9'

## ----------- ##
## confdefs.h. ##
## ----------- ##

/* confdefs.h */
#define PACKAGE_NAME "evas"
#define PACKAGE_TARNAME "evas"
#define PACKAGE_VERSION "0.9.9.063"
#define PACKAGE_STRING "evas 0.9.9.063"
#define PACKAGE_BUGREPORT "enlightenment-devel@lists.sourceforge.net"
#define PACKAGE_URL ""
#define PACKAGE "evas"
#define VERSION "0.9.9.063"
#define STDC_HEADERS 1
#define HAVE_SYS_TYPES_H 1
#define HAVE_SYS_STAT_H 1
#define HAVE_STDLIB_H 1
#define HAVE_STRING_H 1
#define HAVE_MEMORY_H 1
#define HAVE_STRINGS_H 1
#define HAVE_INTTYPES_H 1
#define HAVE_STDINT_H 1
#define HAVE_UNISTD_H 1
#define HAVE_DLFCN_H 1
#define LT_OBJDIR ".libs/"
#define MODULE_ARCH "darwin10.2.0-x86_64-ver-pre-svn-05"
#define HAVE_FONTCONFIG 1
#define STDC_HEADERS 1
#define HAVE___ATTRIBUTE__ 1
#define __UNUSED__ __attribute__((unused))
#define HAVE_ALLOCA_H 1
#define HAVE_ALLOCA 1
#define HAVE_DLOPEN 1
#define HAVE_DLADDR 1
#define HAVE_DLADDR 1
#define BUILD_ENGINE_BUFFER 1
#define BUILD_LOADER_EET 1
#define BUILD_FONT_LOADER_EET 1
#define BUILD_LOADER_PMAPS 1
#define BUILD_LOADER_PNG 1
#define BUILD_LOADER_XPM 1
#define HAVE_PTHREAD_H 1
#define HAVE_SCHED_H 1
#define BUILD_ASYNC_EVENTS 1
#define BUILD_ASYNC_PRELOAD 1
#define BUILD_MMX 1
#define BUILD_SSE 1
#define BUILD_C 1
#define EVAS_MAGIC_DEBUG 1
#define BUILD_SCALE_SAMPLE 1
#define BUILD_SCALE_SMOOTH 1
#define BUILD_CONVERT_YUV 1
#define BUILD_CONVERT_8_RGB_332 1
#define BUILD_CONVERT_8_RGB_666 1
#define BUILD_CONVERT_8_RGB_232 1
#define BUILD_CONVERT_8_RGB_222 1
#define BUILD_CONVERT_8_RGB_221 1
#define BUILD_CONVERT_8_RGB_121 1
#define BUILD_CONVERT_8_RGB_111 1
#define BUILD_CONVERT_16_RGB_565 1
#define BUILD_CONVERT_16_BGR_565 1
#define BUILD_CONVERT_16_RGB_555 1
#define BUILD_CONVERT_16_RGB_444 1
#define BUILD_CONVERT_16_RGB_454645 1
#define BUILD_CONVERT_16_RGB_ROT0 1
#define BUILD_CONVERT_16_RGB_ROT180 1
#define BUILD_CONVERT_16_RGB_ROT270 1
#define BUILD_CONVERT_16_RGB_ROT90 1
#define BUILD_CONVERT_24_RGB_888 1
#define BUILD_CONVERT_24_BGR_888 1
#define BUILD_CONVERT_32_RGB_8888 1
#define BUILD_CONVERT_32_RGBX_8888 1
#define BUILD_CONVERT_32_BGR_8888 1
#define BUILD_CONVERT_32_BGRX_8888 1
#define BUILD_CONVERT_24_RGB_666 1
#define BUILD_CONVERT_32_RGB_666 1
#define BUILD_CONVERT_32_RGB_ROT0 1
#define BUILD_CONVERT_32_RGB_ROT180 1
#define BUILD_CONVERT_32_RGB_ROT270 1
#define BUILD_CONVERT_32_RGB_ROT90 1
#define BUILD_CONVERT_8_GRY_1 1
#define BUILD_CONVERT_8_GRY_16 1
#define BUILD_CONVERT_8_GRAYSCALE_64 1

configure: exit 0