All pastes #1843552 Raw Edit

clueless

public text v1 · immutable
#1843552 ·published 2010-03-17 13:58 UTC
rendered paste body
ailed 2/25 test programs. 3/167 subtests failed.make[1]: *** [test_dynamic] Error 255make[1]: Leaving directory `/usr/local/thruk/.cpanplus/5.10.0/build/Test-WWW-Mechanize-1.24'[ERROR] Unable to create a new distribution object for 'Test::WWW::Mechanize' -- cannot continue[ERROR] Failed to install 'Test::WWW::Mechanize' as prerequisite for 'Test::WWW::Mechanize::Catalyst'[ERROR] Unable to satisfy prerequisites for 'Test::WWW::Mechanize::Catalyst' -- aborting install[ERROR] Unable to create a new distribution object for 'Test::WWW::Mechanize::Catalyst' -- cannot continue[ERROR] Failed to install 'Test::WWW::Mechanize::Catalyst' as prerequisite for 'Catalyst::Plugin::Unicode'[ERROR] Unable to satisfy prerequisites for 'Catalyst::Plugin::Unicode' -- aborting install[ERROR] Unable to create a new distribution object for 'Catalyst::Plugin::Unicode' -- cannot continueKey 'ok' () is of invalid type for 'CPANPLUS::Backend::RV::new' provided by CPANPLUS::Backend::__ANON__ at /usr/lib/perl5/5.10.0/CPANPLUS/Backend.pm line 395*** Catalyst::Plugin::Unicode installation cancelled.*** Module::AutoInstall installation finished.