screens/nc_about.c:712:29: missing terminating ' character
screens/nc_about.c:712:29: warning: multi-character character constant
screens/nc_about.c:712: warning: excess elements in struct initializer
screens/nc_about.c:712: warning: (near initialization for `A[0]')
screens/nc_about.c:712: error: syntax error before '\x605f5f7c'
screens/nc_about.c:717: error: stray '`' in program
screens/nc_about.c:717:12: missing terminating ' character
screens/nc_about.c:717:12: warning: character constant too long for its type
screens/nc_about.c:718:30: missing terminating ' character
screens/nc_about.c:718:30: warning: multi-character character constant
screens/nc_about.c:719:7: warning: character constant too long for its type
screens/nc_about.c:719: warning: excess elements in struct initializer
screens/nc_about.c:719: warning: (near initialization for `A[0]')
screens/nc_about.c:720: error: stray '`' in program
screens/nc_about.c:720:29: missing terminating ' character
screens/nc_about.c:720:29: warning: multi-character character constant
screens/nc_about.c:724: error: stray '`' in program
screens/nc_about.c:724:12: missing terminating ' character
screens/nc_about.c:724:12: warning: character constant too long for its type
screens/nc_about.c:726:7: warning: character constant too long for its type
screens/nc_about.c:726: error: stray '`' in program
screens/nc_about.c:727:20: missing terminating ' character
screens/nc_about.c:727:20: warning: character constant too long for its type
screens/nc_about.c:728: error: invalid lvalue in decrement
screens/nc_about.c:728: error: stray '`' in program
screens/nc_about.c:728:29: missing terminating ' character
screens/nc_about.c:728:29: warning: multi-character character constant
screens/nc_about.c:728: warning: excess elements in struct initializer
screens/nc_about.c:728: warning: (near initialization for `A[0]')
screens/nc_about.c:728: error: syntax error before '\x605f5f7c'
screens/nc_about.c:732: error: stray '`' in program
screens/nc_about.c:732:12: missing terminating ' character
screens/nc_about.c:732:12: warning: character constant too long for its type
screens/nc_about.c:733:29: missing terminating ' character
screens/nc_about.c:733:29: warning: multi-character character constant
screens/nc_about.c:734:7: warning: character constant too long for its type
screens/nc_about.c:734: warning: excess elements in struct initializer
screens/nc_about.c:734: warning: (near initialization for `A[0]')
screens/nc_about.c:735: error: stray '`' in program
screens/nc_about.c:735:28: missing terminating ' character
screens/nc_about.c:735:28: warning: multi-character character constant
screens/nc_about.c:739: error: stray '`' in program
screens/nc_about.c:739:12: missing terminating ' character
screens/nc_about.c:739:12: warning: character constant too long for its type
screens/nc_about.c:740:27: missing terminating ' character
screens/nc_about.c:740:27: warning: multi-character character constant
screens/nc_about.c:741:7: warning: character constant too long for its type
screens/nc_about.c:741: warning: excess elements in struct initializer
screens/nc_about.c:741: warning: (near initialization for `A[0]')
screens/nc_about.c:742: error: stray '`' in program
screens/nc_about.c:742:26: missing terminating ' character
screens/nc_about.c:742:26: warning: multi-character character constant
screens/nc_about.c:747: error: stray '`' in program
screens/nc_about.c:747:12: warning: character constant too long for its type
screens/nc_about.c:747: error: stray '`' in program
screens/nc_about.c:748:14: missing terminating ' character
screens/nc_about.c:748:14: warning: character constant too long for its type
screens/nc_about.c:749:7: warning: character constant too long for its type
screens/nc_about.c:749: warning: excess elements in struct initializer
screens/nc_about.c:749: warning: (near initialization for `A[0]')
screens/nc_about.c:749: error: stray '`' in program
screens/nc_about.c:755: error: stray '`' in program
screens/nc_about.c:755:12: warning: character constant too long for its type
screens/nc_about.c:755: error: stray '`' in program
screens/nc_about.c:756:12: missing terminating ' character
screens/nc_about.c:756:12: warning: character constant too long for its type
screens/nc_about.c:757:7: warning: character constant too long for its type
screens/nc_about.c:757: warning: excess elements in struct initializer
screens/nc_about.c:757: warning: (near initialization for `A[0]')
screens/nc_about.c:757: error: stray '`' in program
screens/nc_about.c:761: error: stray '`' in program
screens/nc_about.c:762:10: missing terminating ' character
screens/nc_about.c:762:10: warning: character constant too long for its type
screens/nc_about.c:763:21: missing terminating ' character
screens/nc_about.c:763:21: warning: multi-character character constant
screens/nc_about.c:764:5: warning: character constant too long for its type
screens/nc_about.c:764: warning: excess elements in struct initializer
screens/nc_about.c:764: warning: (near initialization for `A[0]')
screens/nc_about.c:765: error: stray '`' in program
screens/nc_about.c:765:20: missing terminating ' character
screens/nc_about.c:765:20: warning: multi-character character constant
screens/nc_about.c:771:3: warning: character constant too long for its type
screens/nc_about.c:771: error: stray '`' in program
screens/nc_about.c:772:10: missing terminating ' character
screens/nc_about.c:772:10: warning: character constant too long for its type
screens/nc_about.c:773: error: stray '`' in program
screens/nc_about.c:773: error: request for member `________' in something not a structure or union
screens/nc_about.c:773:19: missing terminating ' character
screens/nc_about.c:773:19: warning: multi-character character constant
screens/nc_about.c:773: warning: excess elements in struct initializer
screens/nc_about.c:773: warning: (near initialization for `A[0]')
screens/nc_about.c:773: error: syntax error before '\x605f5f7c'
screens/nc_about.c:778:1: warning: character constant too long for its type
screens/nc_about.c:778:1: warning: character constant too long for its type
screens/nc_about.c:777: error: stray '`' in program
screens/nc_about.c:779:10: missing terminating ' character
screens/nc_about.c:779:10: warning: character constant too long for its type
screens/nc_about.c:780: error: stray '`' in program
screens/nc_about.c:780: error: request for member `________' in something not a structure or union
screens/nc_about.c:780:19: missing terminating ' character
screens/nc_about.c:780:19: warning: multi-character character constant
screens/nc_about.c:780: warning: excess elements in struct initializer
screens/nc_about.c:780: warning: (near initialization for `A[0]')
screens/nc_about.c:780: error: syntax error before '\x605f5f7c'
screens/nc_about.c:786:10: missing terminating ' character
screens/nc_about.c:786:10: warning: character constant too long for its type
screens/nc_about.c:787: error: stray '`' in program
screens/nc_about.c:787: error: request for member `________' in something not a structure or union
screens/nc_about.c:787:19: missing terminating ' character
screens/nc_about.c:787:19: warning: multi-character character constant
screens/nc_about.c:787: warning: excess elements in struct initializer
screens/nc_about.c:787: warning: (near initialization for `A[0]')
screens/nc_about.c:787: error: syntax error before '\x605f5f7c'
screens/nc_about.c:793: error: stray '`' in program
screens/nc_about.c:794:19: missing terminating ' character
screens/nc_about.c:794:19: warning: multi-character character constant
screens/nc_about.c:938:1: missing terminating " character
screens/nc_about.c:939: error: initializer element is not constant
screens/nc_about.c:939: error: (near initialization for `A[0]')
screens/nc_about.c:944: error: `f_win' undeclared here (not in a function)
screens/nc_about.c:944: error: initializer element is not constant
screens/nc_about.c:944: error: (near initialization for `A[1]')
screens/nc_about.c:944: error: `a_win' undeclared here (not in a function)
screens/nc_about.c:944: error: initializer element is not constant
screens/nc_about.c:944: error: (near initialization for `A[2]')
screens/nc_about.c:944: error: syntax error before ';' token
screens/nc_about.c:946: error: `finished' undeclared here (not in a function)
screens/nc_about.c:946: error: initializer element is not constant
screens/nc_about.c:946: error: (near initialization for `A[3]')
screens/nc_about.c:946: error: syntax error before ';' token
screens/nc_about.c:947: error: `cha' undeclared here (not in a function)
screens/nc_about.c:947: error: initializer element is not constant
screens/nc_about.c:947: error: (near initialization for `A[4]')
screens/nc_about.c:953: warning: missing braces around initializer
screens/nc_about.c:953: warning: (near initialization for `A[5]')
screens/nc_about.c:953: warning: initialization makes pointer from integer without a cast
screens/nc_about.c:953: error: initializer element is not constant
screens/nc_about.c:953: error: (near initialization for `A[5].framelen')
screens/nc_about.c:953: error: initializer element is not constant
screens/nc_about.c:953: error: (near initialization for `A[5]')
screens/nc_about.c:953: error: initializer element is not constant
screens/nc_about.c:953: error: (near initialization for `A[6].frame')
screens/nc_about.c:953: error: syntax error before ')' token
screens/nc_about.c:955: error: initializer element is not constant
screens/nc_about.c:955: error: (near initialization for `A[6]')
screens/nc_about.c:955: error: initializer element is not constant
screens/nc_about.c:955: error: (near initialization for `A[7]')
screens/nc_about.c:955: error: initializer element is not constant
screens/nc_about.c:955: error: (near initialization for `A[8]')
screens/nc_about.c:955: error: initializer element is not constant
screens/nc_about.c:955: error: (near initialization for `A[9]')
screens/nc_about.c:955: error: syntax error before ')' token
screens/nc_about.c:958: error: initializer element is not constant
screens/nc_about.c:958: error: (near initialization for `A[10]')
screens/nc_about.c:958: warning: initialization makes pointer from integer without a cast
screens/nc_about.c:958: error: initializer element is not constant
screens/nc_about.c:958: error: (near initialization for `A[11]')
screens/nc_about.c:958: warning: initialization makes pointer from integer without a cast
screens/nc_about.c:958: error: syntax error before ')' token
screens/nc_about.c:964: error: initializer element is not constant
screens/nc_about.c:964: error: (near initialization for `A[12]')
screens/nc_about.c:964: error: syntax error before ')' token
screens/nc_about.c:965: error: initializer element is not constant
screens/nc_about.c:965: error: (near initialization for `A[13]')
screens/nc_about.c:968: warning: type defaults to `int' in declaration of `wbkgd'
screens/nc_about.c:968: warning: parameter names (without types) in function declaration
screens/nc_about.c:968: warning: data definition has no type or storage class
screens/nc_about.c:970: warning: type defaults to `int' in declaration of `a_win'
screens/nc_about.c:970: error: `f_win' undeclared here (not in a function)
screens/nc_about.c:970: warning: initialization makes integer from pointer without a cast
screens/nc_about.c:970: error: initializer element is not constant
screens/nc_about.c:970: warning: data definition has no type or storage class
screens/nc_about.c:971: error: syntax error before '->' token
screens/nc_about.c:972: warning: type defaults to `int' in declaration of `cha'
screens/nc_about.c:972: warning: data definition has no type or storage class
screens/nc_about.c:973: error: syntax error before "if"
screens/nc_about.c:981: error: syntax error before '<' token
screens/nc_about.c:985: error: syntax error before '(' token
screens/nc_about.c:985: warning: type defaults to `int' in declaration of `wtouchln'
screens/nc_about.c:985: warning: type defaults to `int' in declaration of `wnoutrefresh'
screens/nc_about.c:985: warning: parameter names (without types) in function declaration
screens/nc_about.c:985: warning: data definition has no type or storage class
screens/nc_about.c:987: warning: type defaults to `int' in declaration of `werase'
screens/nc_about.c:987: warning: parameter names (without types) in function declaration
screens/nc_about.c:987: warning: data definition has no type or storage class
screens/nc_about.c:988: warning: type defaults to `int' in declaration of `wbkgd'
screens/nc_about.c:988: warning: parameter names (without types) in function declaration
screens/nc_about.c:988: warning: data definition has no type or storage class
screens/nc_about.c:989: error: syntax error before numeric constant
screens/nc_about.c:990: warning: type defaults to `int' in declaration of `wnoutrefresh'
screens/nc_about.c:990: warning: parameter names (without types) in function declaration
screens/nc_about.c:990: warning: data definition has no type or storage class
screens/nc_about.c:992: error: syntax error before numeric constant
screens/nc_about.c:993: error: syntax error before numeric constant
screens/nc_about.c:994: error: syntax error before numeric constant
screens/nc_about.c:995: warning: type defaults to `int' in declaration of `wnoutrefresh'
screens/nc_about.c:995: warning: parameter names (without types) in function declaration
screens/nc_about.c:995: warning: data definition has no type or storage class
screens/nc_about.c:997: warning: type defaults to `int' in declaration of `doupdate'
screens/nc_about.c:997: warning: data definition has no type or storage class
screens/nc_about.c:999: error: syntax error before '[' token
screens/nc_about.c:999: warning: type defaults to `int' in declaration of `wtimeout'
screens/nc_about.c:999: error: conflicting types for `wtimeout'
/usr/include/curses.h:775: error: previous declaration of `wtimeout'
screens/nc_about.c:999: warning: data definition has no type or storage class
screens/nc_about.c:1005: error: syntax error before '&' token
screens/nc_about.c:1005: warning: type defaults to `int' in declaration of `sigemptyset'
screens/nc_about.c:1005: warning: data definition has no type or storage class
screens/nc_about.c:1005: error: syntax error before '&' token
screens/nc_about.c:1005: warning: type defaults to `int' in declaration of `sigemptyset'
screens/nc_about.c:1005: warning: data definition has no type or storage class
screens/nc_about.c:1005: error: syntax error before '&' token
screens/nc_about.c:1005: warning: type defaults to `int' in declaration of `sigaddset'
screens/nc_about.c:1005: warning: data definition has no type or storage class
screens/nc_about.c:1005: error: syntax error before numeric constant
screens/nc_about.c:1005: warning: type defaults to `int' in declaration of `sigprocmask'
screens/nc_about.c:1005: warning: data definition has no type or storage class
screens/nc_about.c:1005: warning: type defaults to `int' in declaration of `handle_snarfed_tty'
screens/nc_about.c:1005: error: conflicting types for `handle_snarfed_tty'
exec.h:42: error: previous declaration of `handle_snarfed_tty'
screens/nc_about.c:1005: warning: data definition has no type or storage class
screens/nc_abou005: error: syntax error before numeric constant
screens/nc_about.c:1009: warning: type defaults to `int' in declaration of `finished'
screens/nc_about.c:1009: warning: data definition has no type or storage class
screens/nc_about.c:1010: error: syntax error before '}' token
screens/nc_about.c:1012: warning: type defaults to `int' in declaration of `delwin'
screens/nc_about.c:1012: warning: parameter names (without types) in function declaration
screens/nc_about.c:1012: warning: data definition has no type or storage class
screens/nc_about.c:1013: warning: type defaults to `int' in declaration of `delwin'
screens/nc_about.c:1013: warning: parameter names (without types) in function declaration
screens/nc_about.c:1013: warning: data definition has no type or storage class
screens/nc_about.c:1014: warning: type defaults to `int' in declaration of `delwin'
screens/nc_about.c:1014: warning: parameter names (without types) in function declaration
screens/nc_about.c:1014: warning: data definition has no type or storage class
screens/nc_about.c:1015: error: syntax error before '}' token
screens/nc_about.c: In function `nc_do_help':
screens/nc_about.c:1139: warning: implicit declaration of function `memcpy'
make: *** [screens/nc_about.o] Error 1