rendered paste body -z "/usr/share/services" || mkdir -p -- "/var/tmp/portage/kdevelop-3.3.4/image//usr/share/services"
/bin/install -c -p -m 644 'kdevpartexplorer.desktop' '/var/tmp/portage/kdevelop-3.3.4/image//usr/share/services/kdevpartexplorer.desktop'
libtool: install: warning: remember to run `libtool --finish /usr/lib64/kde3'
make[3]: Leaving directory `/var/tmp/portage/kdevelop-3.3.4/work/kdevelop-3.3.4/parts/partexplorer'
make[2]: Leaving directory `/var/tmp/portage/kdevelop-3.3.4/work/kdevelop-3.3.4/parts/partexplorer'
Making install in quickopen
make[2]: Entering directory `/var/tmp/portage/kdevelop-3.3.4/work/kdevelop-3.3.4/parts/quickopen'
make[3]: Entering directory `/var/tmp/portage/kdevelop-3.3.4/work/kdevelop-3.3.4/parts/quickopen'
test -z "/usr/lib64/kde3" || mkdir -p -- "/var/tmp/portage/kdevelop-3.3.4/image//usr/lib64/kde3"
test -z "/usr/share/apps/kdevquickopen" || mkdir -p -- "/var/tmp/portage/kdevelop-3.3.4/image//usr/share/apps/kdevquickopen"
/bin/sh ../../libtool --silent --mode=install /bin/install -c -p 'libkdevquickopen.la' '/var/tmp/portage/kdevelop-3.3.4/image//usr/lib64/kde3/libkdevquickopen.la'
/bin/install -c -p -m 644 'kdevpart_quickopen.rc' '/var/tmp/portage/kdevelop-3.3.4/image//usr/share/apps/kdevquickopen/kdevpart_quickopen.rc'
test -z "/usr/share/services" || mkdir -p -- "/var/tmp/portage/kdevelop-3.3.4/image//usr/share/services"
/bin/install -c -p -m 644 'kdevquickopen.desktop' '/var/tmp/portage/kdevelop-3.3.4/image//usr/share/services/kdevquickopen.desktop'
libtool: install: warning: remember to run `libtool --finish /usr/lib64/kde3'
make[3]: Leaving directory `/var/tmp/portage/kdevelop-3.3.4/work/kdevelop-3.3.4/parts/quickopen'
make[2]: Leaving directory `/var/tmp/portage/kdevelop-3.3.4/work/kdevelop-3.3.4/parts/quickopen'
Making install in snippet
make[2]: Entering directory `/var/tmp/portage/kdevelop-3.3.4/work/kdevelop-3.3.4/parts/snippet'
make[3]: Entering directory `/var/tmp/portage/kdevelop-3.3.4/work/kdevelop-3.3.4/parts/snippet'
test -z "/usr/lib64/kde3" || mkdir -p -- "/var/tmp/portage/kdevelop-3.3.4/image//usr/lib64/kde3"
test -z "/usr/share/services" || mkdir -p -- "/var/tmp/portage/kdevelop-3.3.4/image//usr/share/services"
/bin/sh ../../libtool --silent --mode=install /bin/install -c -p 'libkdevsnippet.la' '/var/tmp/portage/kdevelop-3.3.4/image//usr/lib64/kde3/libkdevsnippet.la'
/bin/install -c -p -m 644 'kdevsnippet.desktop' '/var/tmp/portage/kdevelop-3.3.4/image//usr/share/services/kdevsnippet.desktop'
libtool: install: warning: remember to run `libtool --finish /usr/lib64/kde3'
make[3]: Leaving directory `/var/tmp/portage/kdevelop-3.3.4/work/kdevelop-3.3.4/parts/snippet'
make[2]: Leaving directory `/var/tmp/portage/kdevelop-3.3.4/work/kdevelop-3.3.4/parts/snippet'
Making install in filelist
make[2]: Entering directory `/var/tmp/portage/kdevelop-3.3.4/work/kdevelop-3.3.4/parts/filelist'
make[3]: Entering directory `/var/tmp/portage/kdevelop-3.3.4/work/kdevelop-3.3.4/parts/filelist'
test -z "/usr/lib64/kde3" || mkdir -p -- "/var/tmp/portage/kdevelop-3.3.4/image//usr/lib64/kde3"
test -z "/usr/share/apps/kdevfilelist" || mkdir -p -- "/var/tmp/portage/kdevelop-3.3.4/image//usr/share/apps/kdevfilelist"
/bin/sh ../../libtool --silent --mode=install /bin/install -c -p 'libkdevfilelist.la' '/var/tmp/portage/kdevelop-3.3.4/image//usr/lib64/kde3/libkdevfilelist.la'
/bin/install -c -p -m 644 'kdevfilelist.rc' '/var/tmp/portage/kdevelop-3.3.4/image//usr/share/apps/kdevfilelist/kdevfilelist.rc'
test -z "/usr/share/services" || mkdir -p -- "/var/tmp/portage/kdevelop-3.3.4/image//usr/share/services"
/bin/install -c -p -m 644 'kdevfilelist.desktop' '/var/tmp/portage/kdevelop-3.3.4/image//usr/share/services/kdevfilelist.desktop'
libtool: install: warning: remember to run `libtool --finish /usr/lib64/kde3'
make[3]: Leaving directory `/var/tmp/portage/kdevelop-3.3.4/work/kdevelop-3.3.4/parts/filelist'
make[2]: Leaving directory `/var/tmp/portage/kdevelop-3.3.4/work/kdevelop-3.3.4/parts/filelist'
Making install in ctags2
make[2]: Entering directory `/var/tmp/portage/kdevelop-3.3.4/work/kdevelop-3.3.4/parts/ctags2'
make[3]: Entering directory `/var/tmp/portage/kdevelop-3.3.4/work/kdevelop-3.3.4/parts/ctags2'
test -z "/usr/lib64/kde3" || mkdir -p -- "/var/tmp/portage/kdevelop-3.3.4/image//usr/lib64/kde3"
test -z "/usr/share/apps/kdevctags2" || mkdir -p -- "/var/tmp/portage/kdevelop-3.3.4/image//usr/share/apps/kdevctags2"
/bin/sh ../../libtool --silent --mode=install /bin/install -c -p 'libkdevctags2.la' '/var/tmp/portage/kdevelop-3.3.4/image//usr/lib64/kde3/libkdevctags2.la'
/bin/install -c -p -m 644 'kdevpart_ctags2.rc' '/var/tmp/portage/kdevelop-3.3.4/image//usr/share/apps/kdevctags2/kdevpart_ctags2.rc'
test -z "/usr/share/services" || mkdir -p -- "/var/tmp/portage/kdevelop-3.3.4/image//usr/share/services"
/bin/install -c -p -m 644 'kdevctags2.desktop' '/var/tmp/portage/kdevelop-3.3.4/image//usr/share/services/kdevctags2.desktop'
../../libtool: line 5916: 16058 Killed /bin/install -c -p .libs/libkdevctags2.so /var/tmp/portage/kdevelop-3.3.4/image//usr/lib64/kde3/libkdevctags2.so
make[3]: *** [install-kde_moduleLTLIBRARIES] Error 137
make[3]: Leaving directory `/var/tmp/portage/kdevelop-3.3.4/work/kdevelop-3.3.4/parts/ctags2'
make[2]: *** [install-am] Error 2
make[2]: Leaving directory `/var/tmp/portage/kdevelop-3.3.4/work/kdevelop-3.3.4/parts/ctags2'
make[1]: *** [install-recursive] Error 1
make[1]: Leaving directory `/var/tmp/portage/kdevelop-3.3.4/work/kdevelop-3.3.4/parts'
make: *** [install-recursive] Error 1
!!! ERROR: dev-util/kdevelop-3.3.4 failed.
Call stack:
ebuild.sh, line 1546: Called dyn_install
ebuild.sh, line 1020: Called src_install
ebuild.sh, line 1255: Called kde_src_install
kde.eclass, line 343: Called kde_src_install 'all'
kde.eclass, line 363: Called kde_src_install 'make' 'dodoc'
kde.eclass, line 353: Called die
!!! died running make install, kde_src_install:make
!!! If you need support, post the topmost build error, and the call stack if relevant.