* Preparing acx module
make: Entering directory `/usr/src/linux-2.6.18'
make: Warning: File `.vmlinux.cmd' has modification time 2.5e+04 s in the future
make[1]: Warning: File `scripts/Makefile.lib' has modification time 2.3e+04 s in the future
CC [M] /var/tmp/portage/acx-0.3.35_p20060521/work/wlan.o
CC [M] /var/tmp/portage/acx-0.3.35_p20060521/work/conv.o
CC [M] /var/tmp/portage/acx-0.3.35_p20060521/work/ioctl.o
CC [M] /var/tmp/portage/acx-0.3.35_p20060521/work/common.o
CC [M] /var/tmp/portage/acx-0.3.35_p20060521/work/pci.o
/var/tmp/portage/acx-0.3.35_p20060521/work/common.c: In function 'acx_s_proc_diag_output':
/var/tmp/portage/acx-0.3.35_p20060521/work/common.c:1245: warning: format '%u' expects type 'unsigned int', but argument 4 has type 'long unsigned int'
/var/tmp/portage/acx-0.3.35_p20060521/work/common.c:1245: warning: format '%u' expects type 'unsigned int', but argument 4 has type 'long unsigned int'
/var/tmp/portage/acx-0.3.35_p20060521/work/common.c:1523: warning: cast from poi
/var/tmp/portage/acx-0.3.35_p20060521/work/common.c:1523: warning: cast from poi
/var/tmp/portage/acx-0.3.35_p20060521/work/common.c:1528: warning: cast from poi
/var/tmp/portage/acx-0.3.35_p20060521/work/common.c:1528: warning: cast from poi
/var/tmp/portage/acx-0.3.35_p20060521/work/pci.c: In function 'acxpci_e_probe':
/var/tmp/portage/acx-0.3.35_p20060521/work/pci.c:1653: error: 'UTS_RELEASE' unde
/var/tmp/portage/acx-0.3.35_p20060521/work/pci.c:1653: error: (Each undeclared i
/var/tmp/portage/acx-0.3.35_p20060521/work/pci.c:1653: error: for each function
make[1]: *** [/var/tmp/portage/acx-0.3.35_p20060521/work/pci.o] Error 1
make[1]: *** Waiting for unfinished jobs....
make: *** [_module_/var/tmp/portage/acx-0.3.35_p20060521/work] Error 2
make: Leaving directory `/usr/src/linux-2.6.18'
!!! ERROR: net-wireless/acx-0.3.35_p20060521 failed.
Call stack:
ebuild.sh, line 1546: Called dyn_compile
ebuild.sh, line 937: Called src_compile
ebuild.sh, line 1255: Called linux-mod_src_compile
linux-mod.eclass, line 469: Called die
!!! Unable to make -C /usr/src/linux SUBDIRS=/var/tmp/portage/acx-0.3.35_p20060
!!! If you need support, post the topmost build error, and the call stack if rel