rendered paste body/usr/include/features.h:154:1: warning: this is the location of the previous definition
rm -f .libs/PythonInterface.lo
i686-pc-linux-gnu-g++ -DPACKAGE_NAME=\"\" -DPACKAGE_TARNAME=\"\" -DPACKAGE_VERSION=\"\" -DPACKAGE_STRING=\"\" -DPACKAGE_BUGREPORT=\"\" -DPACKAGE=\"fluxspace\" -DVERSION=\"0.0.3\" -DSTDC_HEADERS=1 -DHAVE_SYS_TYPES_H=1 -DHAVE_SYS_STAT_H=1 -DHAVE_STDLIB_H=1 -DHAVE_STRING_H=1 -DHAVE_MEMORY_H=1 -DHAVE_STRINGS_H=1 -DHAVE_INTTYPES_H=1 -DHAVE_STDINT_H=1 -DHAVE_UNISTD_H=1 -DHAVE_DLFCN_H=1 -DSTDC_HEADERS=1 -DHAVE_CTYPE_H=1 -DHAVE_FCNTL_H=1 -DHAVE_LIBGEN_H=1 -DHAVE_LOCALE_H=1 -DHAVE_SIGNAL_H=1 -DHAVE_STDIO_H=1 -DHAVE_TIME_H=1 -DHAVE_UNISTD_H=1 -DHAVE_SYS_PARAM_H=1 -DHAVE_SYS_SELECT_H=1 -DHAVE_SYS_STAT_H=1 -DHAVE_SYS_TIME_H=1 -DHAVE_SYS_TYPES_H=1 -DHAVE_SYS_WAIT_H=1 -DTIME_WITH_SYS_TIME=1 -DHAVE_SETLOCALE=1 -DHAVE_SIGACTION=1 -DHAVE_STRFTIME=1 -DHAVE_LIBIMLIB2=1 -DPIXMAP_SUPPORT=1 -DBACKING_STORE=1 -DSTDC_HEADERS=1 -DHAVE_MALLOC_H=1 -DTIME_WITH_SYS_TIME=1 -DHAVE_SELECT=1 -DHAVE_STRSTR=1 -I. -I. -I/usr/include/python2.4 -march=pentium4 -O2 -mfpmath=sse -fforce-addr -mmmx -msse -msse2 -fomit-frame-pointer -pipe -MT PythonInterface.lo -MD -MP -MF .deps/PythonInterface.Tpo -c PythonInterface.cc -fPIC -DPIC -o .libs/PythonInterface.lo
In file included from /usr/include/python2.4/Python.h:13,
from MyPy.hh:28,
from PythonInterface.hh:25,
from PythonInterface.cc:23:
/usr/include/python2.4/pyconfig.h:838:1: warning: "_POSIX_C_SOURCE" redefined
In file included from /usr/lib/gcc/i686-pc-linux-gnu/4.1.1/include/g++-v4/i686-pc-linux-gnu/bits/os_defines.h:39,
from /usr/lib/gcc/i686-pc-linux-gnu/4.1.1/include/g++-v4/i686-pc-linux-gnu/bits/c++config.h:35,
from /usr/lib/gcc/i686-pc-linux-gnu/4.1.1/include/g++-v4/string:45,
from PythonInterface.cc:22:
/usr/include/features.h:154:1: warning: this is the location of the previous definition
PythonInterface.cc:259: error: extra qualification 'PythonInterfaceModule::' on member 'PythonInterfaceModule'
PythonInterface.cc:269: error: extra qualification 'PythonInterfaceModule::' on member 'PythonInterfaceModule'
make[1]: *** [PythonInterface.lo] Error 1
make[1]: *** Waiting for unfinished jobs....
i686-pc-linux-gnu-g++ -DPACKAGE_NAME=\"\" -DPACKAGE_TARNAME=\"\" -DPACKAGE_VERSION=\"\" -DPACKAGE_STRING=\"\" -DPACKAGE_BUGREPORT=\"\" -DPACKAGE=\"fluxspace\" -DVERSION=\"0.0.3\" -DSTDC_HEADERS=1 -DHAVE_SYS_TYPES_H=1 -DHAVE_SYS_STAT_H=1 -DHAVE_STDLIB_H=1 -DHAVE_STRING_H=1 -DHAVE_MEMORY_H=1 -DHAVE_STRINGS_H=1 -DHAVE_INTTYPES_H=1 -DHAVE_STDINT_H=1 -DHAVE_UNISTD_H=1 -DHAVE_DLFCN_H=1 -DSTDC_HEADERS=1 -DHAVE_CTYPE_H=1 -DHAVE_FCNTL_H=1 -DHAVE_LIBGEN_H=1 -DHAVE_LOCALE_H=1 -DHAVE_SIGNAL_H=1 -DHAVE_STDIO_H=1 -DHAVE_TIME_H=1 -DHAVE_UNISTD_H=1 -DHAVE_SYS_PARAM_H=1 -DHAVE_SYS_SELECT_H=1 -DHAVE_SYS_STAT_H=1 -DHAVE_SYS_TIME_H=1 -DHAVE_SYS_TYPES_H=1 -DHAVE_SYS_WAIT_H=1 -DTIME_WITH_SYS_TIME=1 -DHAVE_SETLOCALE=1 -DHAVE_SIGACTION=1 -DHAVE_STRFTIME=1 -DHAVE_LIBIMLIB2=1 -DPIXMAP_SUPPORT=1 -DBACKING_STORE=1 -DSTDC_HEADERS=1 -DHAVE_MALLOC_H=1 -DTIME_WITH_SYS_TIME=1 -DHAVE_SELECT=1 -DHAVE_STRSTR=1 -I. -I. -I/usr/include/python2.4 -march=pentium4 -O2 -mfpmath=sse -fforce-addr -mmmx -msse -msse2 -fomit-frame-pointer -pipe -MT MyPy.lo -MD -MP -MF .deps/MyPy.Tpo -c MyPy.cc -o MyPy.o >/dev/null 2>&1
mv -f .libs/MyPy.lo MyPy.lo
make[1]: Leaving directory `/var/tmp/portage/fluxspace-0.0.3-r1/work/fluxspace-0.0.3/src'
make: *** [all-recursive] Error 1
!!! ERROR: x11-misc/fluxspace-0.0.3-r1 failed.
Call stack:
ebuild.sh, line 1546: Called dyn_compile
ebuild.sh, line 937: Called src_compile
fluxspace-0.0.3-r1.ebuild, line 24: Called die
!!! Compile failed
!!! If you need support, post the topmost build error, and the call stack if relevant.