All pastes #179590 Raw Edit

Haffy

public text v1 · immutable
#179590 ·published 2006-09-22 10:38 UTC
rendered paste body
.0.la' seems to be moved
libtool: link: warning: `/usr/lib/gcc/i386-pc-linux-gnu/3.4.4/../../..//libgobject-2.0.la' seems to be moved
libtool: link: warning: `/usr/lib/gcc/i386-pc-linux-gnu/3.4.4/../../..//libgmodule-2.0.la' seems to be moved
libtool: link: warning: `/usr/lib/gcc/i386-pc-linux-gnu/3.4.4/../../..//libglib-2.0.la' seems to be moved
libtool: link: warning: `/usr/lib/gcc/i386-pc-linux-gnu/3.4.4/../../..//libcairo.la' seems to be moved
gcc -shared  .libs/imviqr.o  -Wl,--rpath -Wl,/var/tmp/portage/gtk+-2.8.20-r1/work/gtk+-2.8.20/gdk-pixbuf/.libs -Wl,--rpath -Wl,/var/tmp/portage/gtk+-2.8.20-r1/work/gtk+-2.8.20/gdk/.libs -Wl,--rpath -Wl,/var/tmp/portage/gtk+-2.8.20-r1/work/gtk+-2.8.20/gtk/.libs -L/var/tmp/portage/gtk+-2.8.20-r1/work/gtk+-2.8.20/gdk-pixbuf/.libs -L/var/tmp/portage/gtk+-2.8.20-r1/work/gtk+-2.8.20/gdk/.libs ../../gdk-pixbuf/.libs/libgdk_pixbuf-2.0.so -L/usr/lib/gcc/i386-pc-linux-gnu/3.4.4/../../../ -L/usr/lib ../../gdk/.libs/libgdk-x11-2.0.so ../../gtk/.libs/libgtk-x11-2.0.so /usr/lib/libpangocairo-1.0.so /usr/lib/libpango-1.0.so /usr/lib/libX11.so /usr/lib/libatk-1.0.so /usr/lib/libgobject-2.0.so /usr/lib/libgmodule-2.0.so -ldl /usr/lib/libglib-2.0.so /usr/lib/libcairo.so -lm  -mtune=i686 -Wl,-soname -Wl,im-viqr.so -o .libs/im-viqr.so
creating im-viqr.la
(cd .libs && rm -f im-viqr.la && ln -s ../im-viqr.la im-viqr.la)
../../gtk/gtk-query-immodules-2.0 im-xim.la  im-am-et.la im-cedilla.la im-cyrillic-translit.la im-inuktitut.la im-ipa.la im-thai-broken.la im-ti-er.la im-ti-et.la im-viqr.la  > gtk.immodules
/var/tmp/portage/gtk+-2.8.20-r1/work/gtk+-2.8.20/gtk/.libs/lt-gtk-query-immodules-2.0: error while loading shared libraries: libexpat.so.0: cannot open shared object file: No such file or directory
make[3]: *** [gtk.immodules] Error 127
make[3]: Leaving directory `/var/tmp/portage/gtk+-2.8.20-r1/work/gtk+-2.8.20/modules/input'
make[2]: *** [all-recursive] Error 1
make[2]: Leaving directory `/var/tmp/portage/gtk+-2.8.20-r1/work/gtk+-2.8.20/modules'
make[1]: *** [all-recursive] Error 1
make[1]: Leaving directory `/var/tmp/portage/gtk+-2.8.20-r1/work/gtk+-2.8.20'
make: *** [all] Error 2

!!! ERROR: x11-libs/gtk+-2.8.20-r1 failed.
Call stack:
  ebuild.sh, line 1546:   Called dyn_compile
  ebuild.sh, line 937:   Called src_compile
  gtk+-2.8.20-r1.ebuild, line 119:   Called die

!!! gtk+ failed to compile
!!! If you need support, post the topmost build error, and the call stack if relevant.