All pastes #179528 Raw Edit

Untitled

public text v1 · immutable
#179528 ·published 2006-09-22 08:43 UTC
rendered paste body
stage1/xgcc -Bstage1/ -B/usr/i686-pc-linux-gnu/bin/ -c   -pipe -O2 -fprofile-generate -DIN_GCC   -W -Wall -Wwrite-strings -Wstrict-prototypes -Wmissing-prototypes -pedantic -Wno-long-long -Wno-variadic-macros -Wold-style-definition -Wmissing-format-attribute     -DHAVE_CONFIG_H -I. -I. -I/var/tmp/portage/gcc-4.1.1/work/gcc-4.1.1/gcc -I/var/tmp/portage/gcc-4.1.1/work/gcc-4.1.1/gcc/. -I/var/tmp/portage/gcc-4.1.1/work/gcc-4.1.1/gcc/../include -I/var/tmp/portage/gcc-4.1.1/work/gcc-4.1.1/gcc/../libcpp/include     /var/tmp/portage/gcc-4.1.1/work/gcc-4.1.1/gcc/bb-reorder.c -o bb-reorder.o
/var/tmp/portage/gcc-4.1.1/work/gcc-4.1.1/gcc/bb-reorder.c: In function 'reorder_basic_blocks':
/var/tmp/portage/gcc-4.1.1/work/gcc-4.1.1/gcc/bb-reorder.c:1892: error: structured COND_EXPR at the end of bb 105
/var/tmp/portage/gcc-4.1.1/work/gcc-4.1.1/gcc/bb-reorder.c:1892: error: 'then' label does not match edge at end of bb 105
/var/tmp/portage/gcc-4.1.1/work/gcc-4.1.1/gcc/bb-reorder.c:1892: error: 'else' label does not match edge at end of bb 105
/var/tmp/portage/gcc-4.1.1/work/gcc-4.1.1/gcc/bb-reorder.c:1892: error: structured COND_EXPR at the end of bb 111
/var/tmp/portage/gcc-4.1.1/work/gcc-4.1.1/gcc/bb-reorder.c:1892: error: 'else' label does not match edge at end of bb 111
/var/tmp/portage/gcc-4.1.1/work/gcc-4.1.1/gcc/bb-reorder.c:1892: internal compiler error: verify_flow_info failed
Please submit a full bug report,
with preprocessed source if appropriate.
See <URL:http://bugs.gentoo.org/> for instructions.
The bug is not reproducible, so it is likely a hardware or OS problem.
make[2]: *** [bb-reorder.o] Error 1
make[2]: Leaving directory `/var/tmp/portage/gcc-4.1.1/work/build/gcc'
make[1]: *** [stageprofile_build] Error 2
make[1]: Leaving directory `/var/tmp/portage/gcc-4.1.1/work/build/gcc'
make: *** [profiledbootstrap] Error 2

!!! ERROR: sys-devel/gcc-4.1.1 failed.
Call stack:
  ebuild.sh, line 1546:   Called dyn_compile
  ebuild.sh, line 937:   Called src_compile
  ebuild.sh, line 1255:   Called toolchain_src_compile
  toolchain.eclass, line 24:   Called gcc_src_compile
  toolchain.eclass, line 1534:   Called gcc_do_make
  toolchain.eclass, line 1408:   Called die

!!! emake failed with profiledbootstrap