[32;01m*[0m CPV: kde-base/step-4.3.5
[32;01m*[0m REPO: gentoo
[32;01m*[0m USE: amd64 elibc_glibc gsl handbook kernel_linux multilib qalculate userland_GNU
>>> Unpacking source...
[32;01m*[0m Unpacking parts of kdeedu-4.3.5.tar.bz2 to /var/tmp/portage/kde-base/step-4.3.5/work ...
[A[113C [34;01m[ [32;01mok[34;01m ][0m
>>> Source unpacked in /var/tmp/portage/kde-base/step-4.3.5/work
>>> Preparing source in /var/tmp/portage/kde-base/step-4.3.5/work/step-4.3.5 ...
[32;01m*[0m Applying step-4.3.2-solaris.patch ...
[A[113C [34;01m[ [32;01mok[34;01m ][0m
>>> Source prepared.
>>> Configuring source in /var/tmp/portage/kde-base/step-4.3.5/work/step-4.3.5 ...
>>> Working in BUILD_DIR: "/var/tmp/portage/kde-base/step-4.3.5/work/step-4.3.5_build"
cmake -C /var/tmp/portage/kde-base/step-4.3.5/temp/gentoo_common_config.cmake -DCMAKE_INSTALL_PREFIX=/usr -DKDE4_BUILD_TESTS=OFF -DCMAKE_INSTALL_PREFIX=/usr -DSYSCONF_INSTALL_DIR=/etc -DWITH_gsl=ON -DWITH_GSL=ON -DWITH_Gsl=ON -DWITH_qalculate=ON -DWITH_QALCULATE=ON -DWITH_Qalculate=ON -DCMAKE_BUILD_TYPE=Gentoo -DCMAKE_INSTALL_DO_STRIP=OFF -DCMAKE_USER_MAKE_RULES_OVERRIDE=/var/tmp/portage/kde-base/step-4.3.5/temp/gentoo_rules.cmake /var/tmp/portage/kde-base/step-4.3.5/work/step-4.3.5
loading initial cache file /var/tmp/portage/kde-base/step-4.3.5/temp/gentoo_common_config.cmake
-- The C compiler identification is GNU
-- The CXX compiler identification is GNU
-- Check for working C compiler: /usr/bin/x86_64-pc-linux-gnu-gcc
-- Check for working C compiler: /usr/bin/x86_64-pc-linux-gnu-gcc -- works
-- Detecting C compiler ABI info
-- Detecting C compiler ABI info - done
-- Check for working CXX compiler: /usr/bin/x86_64-pc-linux-gnu-g++
-- Check for working CXX compiler: /usr/bin/x86_64-pc-linux-gnu-g++ -- works
-- Detecting CXX compiler ABI info
-- Detecting CXX compiler ABI info - done
-- Looking for Q_WS_X11
-- Looking for Q_WS_X11 - found
-- Looking for Q_WS_WIN
-- Looking for Q_WS_WIN - not found.
-- Looking for Q_WS_QWS
-- Looking for Q_WS_QWS - not found.
-- Looking for Q_WS_MAC
-- Looking for Q_WS_MAC - not found.
-- Found Qt-Version 4.6.1 (using /usr/bin/qmake)
-- Looking for XOpenDisplay in /usr/lib64/libX11.so;/usr/lib64/libXext.so;/usr/lib64/libXft.so;/usr/lib64/libXau.so;/usr/lib64/libXdmcp.so;/usr/lib64/libXpm.so
-- Looking for XOpenDisplay in /usr/lib64/libX11.so;/usr/lib64/libXext.so;/usr/lib64/libXft.so;/usr/lib64/libXau.so;/usr/lib64/libXdmcp.so;/usr/lib64/libXpm.so - found
-- Looking for gethostbyname
-- Looking for gethostbyname - found
-- Looking for connect
-- Looking for connect - found
-- Looking for remove
-- Looking for remove - found
-- Looking for shmat
-- Looking for shmat - found
-- Looking for IceConnectionNumber in ICE
-- Looking for IceConnectionNumber in ICE - found
-- Found X11: /usr/lib64/libX11.so
-- Looking for include files CMAKE_HAVE_PTHREAD_H
-- Looking for include files CMAKE_HAVE_PTHREAD_H - found
-- Looking for pthread_create in pthreads
-- Looking for pthread_create in pthreads - not found
-- Looking for pthread_create in pthread
-- Looking for pthread_create in pthread - found
-- Found Threads: TRUE
-- Found Automoc4: /usr/bin/automoc4
-- Found Perl: /usr/bin/perl
-- Phonon Version: 4.3.50
-- Found Phonon: /usr/lib64/libphonon.so
-- Found Phonon Includes: /usr/include/KDE;/usr/include
-- Performing Test _OFFT_IS_64BIT
-- Performing Test _OFFT_IS_64BIT - Success
-- Performing Test HAVE_FPIE_SUPPORT
-- Performing Test HAVE_FPIE_SUPPORT - Success
-- Performing Test __KDE_HAVE_W_OVERLOADED_VIRTUAL
-- Performing Test __KDE_HAVE_W_OVERLOADED_VIRTUAL - Success
-- Performing Test __KDE_HAVE_GCC_VISIBILITY
-- Performing Test __KDE_HAVE_GCC_VISIBILITY - Success
-- Found KDE 4.3 include dir: /usr/include
-- Found KDE 4.3 library dir: /usr/lib64
-- Found the KDE4 kconfig_compiler preprocessor: /usr/bin/kconfig_compiler
-- Found automoc4: /usr/bin/automoc4
-- Found Eigen2: /usr/include/eigen2
-- WARNING: you are using the obsolete 'PKGCONFIG' macro use FindPkgConfig
-- Found GSL: -lgsl -lgslcblas -lm
-- checking for module 'libqalculate'
-- found libqalculate, version 0.9.6
-----------------------------------------------------------------------------
-- The following external packages were located on your system.
-- This installation will have the extra features provided by these packages.
-----------------------------------------------------------------------------
* Eigen2 - A generic C++ template library for dense and sparse matrices
* Qalculate - A multi-purpose desktop calculator
* GSL - The GNU Scientific Library, a numerical library for C and C++
-----------------------------------------------------------------------------
-- The following OPTIONAL packages could NOT be located on your system.
-- Consider installing them to enable more features from this software.
-----------------------------------------------------------------------------
* Experimental Python binding support for the Marble library <http://techbase.kde.org/Development/Languages/Python>
Experimental Python binding support for the Marble library
Experimental Python binding support for the Marble library. To activate it pass -DEXPERIMENTAL_PYTHON_BINDINGS=TRUE to cmake.
-----------------------------------------------------------------------------
-- <<< Gentoo configuration >>>
Build type: Gentoo
Install path: /usr
-- Configuring done
-- Generating done
-- Build files have been written to: /var/tmp/portage/kde-base/step-4.3.5/work/step-4.3.5_build
>>> Source configured.
>>> Compiling source in /var/tmp/portage/kde-base/step-4.3.5/work/step-4.3.5 ...
>>> Working in BUILD_DIR: "/var/tmp/portage/kde-base/step-4.3.5/work/step-4.3.5_build"
make -j3
[35m[1mScanning dependencies of target stepcore_automoc
[0m[35m[1mScanning dependencies of target step-handbook
[0m[35m[1mScanning dependencies of target step_automoc
[0m[ 0%] [ 0%] Built target stepcore_automoc
[34m[1mGenerating index.cache.bz2
[0m[35m[1mScanning dependencies of target stepcore
[34m[1mGenerating mainwindow.moc
[0m[34m[1mGenerating worldscene.moc
[0m[34m[1mGenerating simulationthread.moc
[0m[34m[1mGenerating worldbrowser.moc
[0m[34m[1mGenerating infobrowser.moc
[0m[34m[1mGenerating itempalette.moc
[0m[34m[1mGenerating propertiesbrowser.moc
[0m[34m[1mGenerating softbodygraphics.moc
[0m[0m[ 1%] [32mBuilding CXX object step/stepcore/CMakeFiles/stepcore.dir/stepcore_automoc.o
[0m[ 3%] [32mBuilding CXX object step/stepcore/CMakeFiles/stepcore.dir/object.o
[0m[34m[1mGenerating toolgraphics.moc
[0m[34m[1mGenerating worldmodel.moc
[0m[34m[1mGenerating gasgraphics.moc
[0m[ 5%] Built target step-handbook
[ 7%] [32mBuilding CXX object step/stepcore/CMakeFiles/stepcore.dir/constants.o
[0m[ 9%] [34m[1mGenerating undobrowser.moc
[0m[32mBuilding CXX object step/stepcore/CMakeFiles/stepcore.dir/world.o
[0m[ 11%] [32mBuilding CXX object step/stepcore/CMakeFiles/stepcore.dir/solver.o
[0m[34m[1mGenerating moc_messageframe.cpp
[0m[34m[1mGenerating moc_polygongraphics.cpp
[0m[34m[1mGenerating moc_worldgraphics.cpp
[0m[ 11%] Built target step_automoc
[ 12%] [32mBuilding CXX object step/stepcore/CMakeFiles/stepcore.dir/collisionsolver.o
[0m[ 14%] [32mBuilding CXX object step/stepcore/CMakeFiles/stepcore.dir/constraintsolver.o
[0m/var/tmp/portage/kde-base/step-4.3.5/work/step-4.3.5/step/stepcore/collisionsolver.cc: In member function 'virtual int StepCore::GJKCollisionSolver::solveCollisions(StepCore::BodyList&)':
/var/tmp/portage/kde-base/step-4.3.5/work/step-4.3.5/step/stepcore/collisionsolver.cc:1193: warning: suggest braces around empty body in an 'else' statement
[ 16%] [32mBuilding CXX object step/stepcore/CMakeFiles/stepcore.dir/factory.o
[0m/var/tmp/portage/kde-base/step-4.3.5/work/step-4.3.5/step/stepcore/collisionsolver.cc: In member function 'int StepCore::GJKCollisionSolver::checkPolygonParticle(StepCore::Contact*)':
/var/tmp/portage/kde-base/step-4.3.5/work/step-4.3.5/step/stepcore/collisionsolver.cc:567: warning: 'si' may be used uninitialized in this function
/var/tmp/portage/kde-base/step-4.3.5/work/step-4.3.5/step/stepcore/collisionsolver.cc: In member function 'int StepCore::GJKCollisionSolver::checkPolygonDisk(StepCore::Contact*)':
/var/tmp/portage/kde-base/step-4.3.5/work/step-4.3.5/step/stepcore/collisionsolver.cc:373: warning: 'si' may be used uninitialized in this function
/var/tmp/portage/kde-base/step-4.3.5/work/step-4.3.5/step/stepcore/collisionsolver.cc: In member function 'int StepCore::GJKCollisionSolver::checkPolygonPolygon(StepCore::Contact*)':
/var/tmp/portage/kde-base/step-4.3.5/work/step-4.3.5/step/stepcore/collisionsolver.cc:75: warning: 'si[0]' may be used uninitialized in this function
/var/tmp/portage/kde-base/step-4.3.5/work/step-4.3.5/step/stepcore/collisionsolver.cc:75: warning: 'si[1]' may be used uninitialized in this function
[ 18%] [32mBuilding CXX object step/stepcore/CMakeFiles/stepcore.dir/xmlfile.o
[0m[ 20%] [32mBuilding CXX object step/stepcore/CMakeFiles/stepcore.dir/particle.o
[0m[ 22%] [32mBuilding CXX object step/stepcore/CMakeFiles/stepcore.dir/rigidbody.o
[0m[ 24%] [32mBuilding CXX object step/stepcore/CMakeFiles/stepcore.dir/gas.o
[0m[ 25%] [32mBuilding CXX object step/stepcore/CMakeFiles/stepcore.dir/softbody.o
[0m[ 27%] [32mBuilding CXX object step/stepcore/CMakeFiles/stepcore.dir/gravitation.o
[0m[ 29%] [32mBuilding CXX object step/stepcore/CMakeFiles/stepcore.dir/coulombforce.o
[0m[ 31%] [32mBuilding CXX object step/stepcore/CMakeFiles/stepcore.dir/spring.o
[0m/var/tmp/portage/kde-base/step-4.3.5/work/step-4.3.5/step/stepcore/spring.cc:192:2: warning: #warning variance calculation for spring connected to rigidbody is not finished !
/var/tmp/portage/kde-base/step-4.3.5/work/step-4.3.5/step/stepcore/spring.cc:193:2: warning: #warning consider unification of some part of Particle and RigidBody
[ 33%] [32mBuilding CXX object step/stepcore/CMakeFiles/stepcore.dir/motor.o
[0m[ 35%] [32mBuilding CXX object step/stepcore/CMakeFiles/stepcore.dir/joint.o
[0m/var/tmp/portage/kde-base/step-4.3.5/work/step-4.3.5/step/stepcore/motor.cc:48: warning: unused parameter 'calcVariances'
/var/tmp/portage/kde-base/step-4.3.5/work/step-4.3.5/step/stepcore/motor.cc:109: warning: unused parameter 'calcVariances'
[ 37%] [32mBuilding CXX object step/stepcore/CMakeFiles/stepcore.dir/eulersolver.o
[0m[ 38%] [32mBuilding CXX object step/stepcore/CMakeFiles/stepcore.dir/tool.o
[0m[ 40%] [32mBuilding CXX object step/stepcore/CMakeFiles/stepcore.dir/gslsolver.o
[0m/var/tmp/portage/kde-base/step-4.3.5/work/step-4.3.5/step/stepcore/gslsolver.cc:126: warning: unused parameter 'yvar'
[31m[1mLinking CXX static library ../../lib/libstepcore.a
[0m[ 40%] Built target stepcore
[ 42%] [ 44%] [ 46%] [34m[1mGenerating ui_create_gas_particles.h
[0m[34m[1mGenerating ui_create_softbody_items.h
[0m[34m[1mGenerating settings.h, settings.cpp
[0mWarning: name label is already used
Warning: name label is already used
[ 50%] [ 50%] [ 51%] [34m[1mGenerating ui_configure_graph.h
[0m[34m[1mGenerating ui_configure_meter.h
[0m[34m[1mGenerating ui_configure_controller.h
[0m[ 53%] [34m[1mGenerating ui_configure_step_general.h
[0m[35m[1mScanning dependencies of target step
[0m[ 55%] [ 57%] [ 59%] [32mBuilding CXX object step/step/CMakeFiles/step.dir/worldmodel.o
[0m[32mBuilding CXX object step/step/CMakeFiles/step.dir/mainwindow.o
[0m[32mBuilding CXX object step/step/CMakeFiles/step.dir/step_automoc.o
[0m[ 61%] [32mBuilding CXX object step/step/CMakeFiles/step.dir/worldscene.o
[0m/var/tmp/portage/kde-base/step-4.3.5/work/step-4.3.5/step/step/worldscene.cc:133:6: warning: #warning TODO: measure what index method is faster
/var/tmp/portage/kde-base/step-4.3.5/work/step-4.3.5/step/step/worldscene.cc:568:6: warning: #warning Check paint() for all items to preserve painter state
/var/tmp/portage/kde-base/step-4.3.5/work/step-4.3.5/step/step/worldscene.cc:569:6: warning: #warning Use NoViewportUpdate and manual updating here !
[ 62%] [32mBuilding CXX object step/step/CMakeFiles/step.dir/worldgraphics.o
[0m/var/tmp/portage/kde-base/step-4.3.5/work/step-4.3.5/step/step/worldgraphics.cc:75:2: warning: #warning Do not add item until it is fully created
[ 64%] [32mBuilding CXX object step/step/CMakeFiles/step.dir/worldbrowser.o
[0m[ 66%] [32mBuilding CXX object step/step/CMakeFiles/step.dir/propertiesbrowser.o
[0m/var/tmp/portage/kde-base/step-4.3.5/work/step-4.3.5/step/step/propertiesbrowser.cc:243:2: warning: #warning XXX: add error information for lists
/var/tmp/portage/kde-base/step-4.3.5/work/step-4.3.5/step/step/propertiesbrowser.cc:744: warning: unused parameter 'parent'
/var/tmp/portage/kde-base/step-4.3.5/work/step-4.3.5/step/step/propertiesbrowser.cc:744: warning: unused parameter 'start'
/var/tmp/portage/kde-base/step-4.3.5/work/step-4.3.5/step/step/propertiesbrowser.cc:744: warning: unused parameter 'end'
[ 68%] [32mBuilding CXX object step/step/CMakeFiles/step.dir/infobrowser.o
[0m[ 70%] [32mBuilding CXX object step/step/CMakeFiles/step.dir/undobrowser.o
[0m[ 72%] [32mBuilding CXX object step/step/CMakeFiles/step.dir/itempalette.o
[0m[ 74%] [32mBuilding CXX object step/step/CMakeFiles/step.dir/worldfactory.o
[0m[ 75%] [32mBuilding CXX object step/step/CMakeFiles/step.dir/particlegraphics.o
[0m[ 77%] [32mBuilding CXX object step/step/CMakeFiles/step.dir/polygongraphics.o
[0m[ 79%] [32mBuilding CXX object step/step/CMakeFiles/step.dir/gasgraphics.o
[0m/var/tmp/portage/kde-base/step-4.3.5/work/step-4.3.5/step/step/gasgraphics.cc:203:2: warning: #warning Consider renaming measureRectCenter to position
[ 81%] [32mBuilding CXX object step/step/CMakeFiles/step.dir/softbodygraphics.o
[0m[ 83%] [32mBuilding CXX object step/step/CMakeFiles/step.dir/springgraphics.o
[0m[ 85%] [32mBuilding CXX object step/step/CMakeFiles/step.dir/motorgraphics.o
[0m[ 87%] [32mBuilding CXX object step/step/CMakeFiles/step.dir/jointgraphics.o
[0m[ 88%] [32mBuilding CXX object step/step/CMakeFiles/step.dir/toolgraphics.o
[0m[ 90%] [32mBuilding CXX object step/step/CMakeFiles/step.dir/simulationthread.o
[0m/var/tmp/portage/kde-base/step-4.3.5/work/step-4.3.5/step/step/toolgraphics.cc:414:2: warning: #warning Select right icon here
/var/tmp/portage/kde-base/step-4.3.5/work/step-4.3.5/step/step/toolgraphics.cc:611:2: warning: #warning Strange, the following line does nothing !
[ 92%] [32mBuilding CXX object step/step/CMakeFiles/step.dir/unitscalc.o
[0mIn file included from /usr/lib/gcc/x86_64-pc-linux-gnu/4.3.4/include/g++-v4/ext/hash_map:64,
from /usr/include/libqalculate/includes.h:40,
from /usr/include/libqalculate/qalculate.h:15,
from /var/tmp/portage/kde-base/step-4.3.5/work/step-4.3.5/step/step/unitscalc.cc:23:
/usr/lib/gcc/x86_64-pc-linux-gnu/4.3.4/include/g++-v4/backward/backward_warning.h:33:2: warning: #warning This file includes at least one deprecated or antiquated header which may be removed without further notice at a future date. Please use a non-deprecated interface with equivalent functionality instead. For a listing of replacement headers and interfaces, consult the file backward_warning.h. To disable this warning use -Wno-deprecated.
[ 94%] [32mBuilding CXX object step/step/CMakeFiles/step.dir/latexformula.o
[0m[ 96%] [32mBuilding CXX object step/step/CMakeFiles/step.dir/messageframe.o
[0m[ 98%] [32mBuilding CXX object step/step/CMakeFiles/step.dir/main.o
[0m[100%] [32mBuilding CXX object step/step/CMakeFiles/step.dir/settings.o
[0m[31m[1mLinking CXX executable step
[0m/usr/lib/gcc/x86_64-pc-linux-gnu/4.3.4/../../../../lib64/libqalculate.so: undefined reference to `cl_module__cl_no_ring__globalctors'
/usr/lib/gcc/x86_64-pc-linux-gnu/4.3.4/../../../../lib64/libqalculate.so: undefined reference to `cl_module__cl_GV_I__globalctors'
/usr/lib/gcc/x86_64-pc-linux-gnu/4.3.4/../../../../lib64/libqalculate.so: undefined reference to `cl_module__cl_MI__globalctors'
/usr/lib/gcc/x86_64-pc-linux-gnu/4.3.4/../../../../lib64/libqalculate.so: undefined reference to `cl_module__cl_UP__globalctors'
/usr/lib/gcc/x86_64-pc-linux-gnu/4.3.4/../../../../lib64/libqalculate.so: undefined reference to `cl_module__cl_DF_globals__globalctors'
/usr/lib/gcc/x86_64-pc-linux-gnu/4.3.4/../../../../lib64/libqalculate.so: undefined reference to `cl_module__cl_LF_globals__globalctors'
/usr/lib/gcc/x86_64-pc-linux-gnu/4.3.4/../../../../lib64/libqalculate.so: undefined reference to `cl_module__cl_SV_number__globalctors'
/usr/lib/gcc/x86_64-pc-linux-gnu/4.3.4/../../../../lib64/libqalculate.so: undefined reference to `cl_module__cl_st_null__globalctors'
/usr/lib/gcc/x86_64-pc-linux-gnu/4.3.4/../../../../lib64/libqalculate.so: undefined reference to `cl_module__cl_R_ring__globalctors'
/usr/lib/gcc/x86_64-pc-linux-gnu/4.3.4/../../../../lib64/libqalculate.so: undefined reference to `cl_module__cl_RA_ring__globalctors'
/usr/lib/gcc/x86_64-pc-linux-gnu/4.3.4/../../../../lib64/libqalculate.so: undefined reference to `cl_module__cl_UP_no_ring__globalctors'
/usr/lib/gcc/x86_64-pc-linux-gnu/4.3.4/../../../../lib64/libqalculate.so: undefined reference to `cl_module__cl_C_ring__globalctors'
/usr/lib/gcc/x86_64-pc-linux-gnu/4.3.4/../../../../lib64/libqalculate.so: undefined reference to `cl_module__cl_I_ring__globalctors'
/usr/lib/gcc/x86_64-pc-linux-gnu/4.3.4/../../../../lib64/libqalculate.so: undefined reference to `cl_module__cl_symbol__globalctors'
/usr/lib/gcc/x86_64-pc-linux-gnu/4.3.4/../../../../lib64/libqalculate.so: undefined reference to `cl_module__cl_random_def__globalctors'
/usr/lib/gcc/x86_64-pc-linux-gnu/4.3.4/../../../../lib64/libqalculate.so: undefined reference to `cl_module__cl_SV_ringelt__globalctors'
/usr/lib/gcc/x86_64-pc-linux-gnu/4.3.4/../../../../lib64/libqalculate.so: undefined reference to `cl_module__cl_prin_globals__globalctors'
/usr/lib/gcc/x86_64-pc-linux-gnu/4.3.4/../../../../lib64/libqalculate.so: undefined reference to `cl_module__cl_GV_number__globalctors'
/usr/lib/gcc/x86_64-pc-linux-gnu/4.3.4/../../../../lib64/libqalculate.so: undefined reference to `cl_module__cl_ieee__globalctors'
collect2: ld returned 1 exit status
make[2]: *** [step/step/step] Error 1
make[1]: *** [step/step/CMakeFiles/step.dir/all] Error 2
make: *** [all] Error 2
[31;01m*[0m ERROR: kde-base/step-4.3.5 failed:
[31;01m*[0m Make failed!
[31;01m*[0m
[31;01m*[0m Call stack:
[31;01m*[0m ebuild.sh, line 54: Called src_compile
[31;01m*[0m environment, line 4207: Called kde4-meta_src_compile
[31;01m*[0m environment, line 3289: Called kde4-base_src_compile
[31;01m*[0m environment, line 2969: Called cmake-utils_src_compile
[31;01m*[0m environment, line 1111: Called _execute_optionaly 'src_compile'
[31;01m*[0m environment, line 537: Called enable_cmake-utils_src_compile
[31;01m*[0m environment, line 1484: Called cmake-utils_src_make
[31;01m*[0m environment, line 1130: Called die
[31;01m*[0m The specific snippet of code:
[31;01m*[0m emake "$@" || die "Make failed!";
[31;01m*[0m
[31;01m*[0m If you need support, post the output of 'emerge --info =kde-base/step-4.3.5',
[31;01m*[0m the complete build log and the output of 'emerge -pqv =kde-base/step-4.3.5'.
[31;01m*[0m The complete build log is located at '/var/tmp/portage/kde-base/step-4.3.5/temp/build.log'.
[31;01m*[0m The ebuild environment file is located at '/var/tmp/portage/kde-base/step-4.3.5/temp/environment'.
[31;01m*[0m S: '/var/tmp/portage/kde-base/step-4.3.5/work/step-4.3.5'