All pastes #1788890 Raw Edit

Untitled

public text v1 · immutable
#1788890 ·published 2010-02-07 09:31 UTC
rendered paste body
mipsel-uclibc-gcc -shared  -o extensions/libipt_ipp2p.so extensions/libipt_ipp2p_sh.o
mipsel-uclibc-gcc -Os -DBCMWPA2 -fno-delete-null-pointer-checks -funit-at-a-time -Wno-pointer-sign -mtune=mips32 -mips32 -Wall -Wunused -I/home/bog/tomato/release/src/linux/linux/include -Iinclude/ -DIPTABLES_VERSION=\"1.3.8\"  -DIPT_LIB_DIR=\"/usr/lib/iptables\" -c -o iptables.o iptables.c
iptables.c: In function 'print_firewall':
iptables.c:1426: warning: passing argument 1 of 'ipt_get_target' discards qualifiers from pointer target type
iptables.c: In function 'print_firewall_line':
iptables.c:1539: warning: passing argument 1 of 'ipt_get_target' discards qualifiers from pointer target type
mipsel-uclibc-gcc -Os -DBCMWPA2 -fno-delete-null-pointer-checks -funit-at-a-time -Wno-pointer-sign -mtune=mips32 -mips32 -Wall -Wunused -I/home/bog/tomato/release/src/linux/linux/include -Iinclude/ -DIPTABLES_VERSION=\"1.3.8\"  -DIPTABLES_MULTI -DIPT_LIB_DIR=\"/usr/lib/iptables\" -rdynamic -o iptables iptables-multi.c iptables-restore.c iptables-standalone.c iptables.o -ldl -L. -liptc
sed -e '/@MATCH@/ r extensions/libipt_matches.man' -e '/@TARGET@/ r extensions/libipt_targets.man' iptables.8.in >iptables.8
mipsel-uclibc-gcc -Os -DBCMWPA2 -fno-delete-null-pointer-checks -funit-at-a-time -Wno-pointer-sign -mtune=mips32 -mips32 -Wall -Wunused -I/home/bog/tomato/release/src/linux/linux/include -Iinclude/ -DIPTABLES_VERSION=\"1.3.8\"    -c -o libipq/libipq.o libipq/libipq.c
mipsel-uclibc-ar rv libipq/libipq.a libipq/libipq.o
mipsel-uclibc-ar: creating libipq/libipq.a
a - libipq/libipq.o
rm libiptc/libip4tc.o libipq/libipq.o
make[4]: Leaving directory `/home/bog/tomato/release/src/router/iptables'
\033[41;1m   rc   \033[0m
grep: /home/bog/tomato/release/src/linux/linux/include/linux/version.h: No such file or directory
make[4]: Entering directory `/home/bog/tomato/release/src/router/rc'
In file included from /home/bog/tomato/tools/brcm/K26/hndtools-mipsel-uclibc-4.2.4/bin/../lib/gcc/mipsel-linux-uclibc/4.2.4/../../../../mipsel-linux-uclibc/sys-include/asm/cpu-info.h:15,
                 from /home/bog/tomato/tools/brcm/K26/hndtools-mipsel-uclibc-4.2.4/bin/../lib/gcc/mipsel-linux-uclibc/4.2.4/../../../../mipsel-linux-uclibc/sys-include/asm/cpu-features.h:14,
                 from /home/bog/tomato/tools/brcm/K26/hndtools-mipsel-uclibc-4.2.4/bin/../lib/gcc/mipsel-linux-uclibc/4.2.4/../../../../mipsel-linux-uclibc/sys-include/asm/bitops.h:18,
                 from /home/bog/tomato/tools/brcm/K26/hndtools-mipsel-uclibc-4.2.4/bin/../lib/gcc/mipsel-linux-uclibc/4.2.4/../../../../mipsel-linux-uclibc/sys-include/linux/bitops.h:9,
                 from /home/bog/tomato/tools/brcm/K26/hndtools-mipsel-uclibc-4.2.4/bin/../lib/gcc/mipsel-linux-uclibc/4.2.4/../../../../mipsel-linux-uclibc/sys-include/linux/thread_info.h:33,
                 from /home/bog/tomato/tools/brcm/K26/hndtools-mipsel-uclibc-4.2.4/bin/../lib/gcc/mipsel-linux-uclibc/4.2.4/../../../../mipsel-linux-uclibc/sys-include/linux/preempt.h:9,
                 from /home/bog/tomato/tools/brcm/K26/hndtools-mipsel-uclibc-4.2.4/bin/../lib/gcc/mipsel-linux-uclibc/4.2.4/../../../../mipsel-linux-uclibc/sys-include/linux/spinlock.h:49,
                 from /home/bog/tomato/tools/brcm/K26/hndtools-mipsel-uclibc-4.2.4/bin/../lib/gcc/mipsel-linux-uclibc/4.2.4/../../../../mipsel-linux-uclibc/sys-include/linux/module.h:9,
                 from /home/bog/tomato/tools/brcm/K26/hndtools-mipsel-uclibc-4.2.4/bin/../lib/gcc/mipsel-linux-uclibc/4.2.4/../../../../mipsel-linux-uclibc/sys-include/linux/mtd/mtd.h:13,
                 from mtd.c:52:
/home/bog/tomato/tools/brcm/K26/hndtools-mipsel-uclibc-4.2.4/bin/../lib/gcc/mipsel-linux-uclibc/4.2.4/../../../../mipsel-linux-uclibc/sys-include/asm/cache.h:12:21: error: kmalloc.h: No such file or directory
In file included from /home/bog/tomato/tools/brcm/K26/hndtools-mipsel-uclibc-4.2.4/bin/../lib/gcc/mipsel-linux-uclibc/4.2.4/../../../../mipsel-linux-uclibc/sys-include/asm/bitops.h:18,
                 from /home/bog/tomato/tools/brcm/K26/hndtools-mipsel-uclibc-4.2.4/bin/../lib/gcc/mipsel-linux-uclibc/4.2.4/../../../../mipsel-linux-uclibc/sys-include/linux/bitops.h:9,
                 from /home/bog/tomato/tools/brcm/K26/hndtools-mipsel-uclibc-4.2.4/bin/../lib/gcc/mipsel-linux-uclibc/4.2.4/../../../../mipsel-linux-uclibc/sys-include/linux/thread_info.h:33,
                 from /home/bog/tomato/tools/brcm/K26/hndtools-mipsel-uclibc-4.2.4/bin/../lib/gcc/mipsel-linux-uclibc/4.2.4/../../../../mipsel-linux-uclibc/sys-include/linux/preempt.h:9,
                 from /home/bog/tomato/tools/brcm/K26/hndtools-mipsel-uclibc-4.2.4/bin/../lib/gcc/mipsel-linux-uclibc/4.2.4/../../../../mipsel-linux-uclibc/sys-include/linux/spinlock.h:49,
                 from /home/bog/tomato/tools/brcm/K26/hndtools-mipsel-uclibc-4.2.4/bin/../lib/gcc/mipsel-linux-uclibc/4.2.4/../../../../mipsel-linux-uclibc/sys-include/linux/module.h:9,
                 from /home/bog/tomato/tools/brcm/K26/hndtools-mipsel-uclibc-4.2.4/bin/../lib/gcc/mipsel-linux-uclibc/4.2.4/../../../../mipsel-linux-uclibc/sys-include/linux/mtd/mtd.h:13,
                 from mtd.c:52:
/home/bog/tomato/tools/brcm/K26/hndtools-mipsel-uclibc-4.2.4/bin/../lib/gcc/mipsel-linux-uclibc/4.2.4/../../../../mipsel-linux-uclibc/sys-include/asm/cpu-features.h:15:35: error: cpu-feature-overrides.h: No such file or directory
In file included from /home/bog/tomato/tools/brcm/K26/hndtools-mipsel-uclibc-4.2.4/bin/../lib/gcc/mipsel-linux-uclibc/4.2.4/../../../../mipsel-linux-uclibc/sys-include/asm/system.h:19,
                 from /home/bog/tomato/tools/brcm/K26/hndtools-mipsel-uclibc-4.2.4/bin/../lib/gcc/mipsel-linux-uclibc/4.2.4/../../../../mipsel-linux-uclibc/sys-include/linux/spinlock.h:57,
                 from /home/bog/tomato/tools/brcm/K26/hndtools-mipsel-uclibc-4.2.4/bin/../lib/gcc/mipsel-linux-uclibc/4.2.4/../../../../mipsel-linux-uclibc/sys-include/linux/module.h:9,
                 from /home/bog/tomato/tools/brcm/K26/hndtools-mipsel-uclibc-4.2.4/bin/../lib/gcc/mipsel-linux-uclibc/4.2.4/../../../../mipsel-linux-uclibc/sys-include/linux/mtd/mtd.h:13,
                 from mtd.c:52:
/home/bog/tomato/tools/brcm/K26/hndtools-mipsel-uclibc-4.2.4/bin/../lib/gcc/mipsel-linux-uclibc/4.2.4/../../../../mipsel-linux-uclibc/sys-include/asm/addrspace.h:13:20: error: spaces.h: No such file or directory
In file included from /home/bog/tomato/tools/brcm/K26/hndtools-mipsel-uclibc-4.2.4/bin/../lib/gcc/mipsel-linux-uclibc/4.2.4/../../../../mipsel-linux-uclibc/sys-include/asm/dsp.h:16,
                 from /home/bog/tomato/tools/brcm/K26/hndtools-mipsel-uclibc-4.2.4/bin/../lib/gcc/mipsel-linux-uclibc/4.2.4/../../../../mipsel-linux-uclibc/sys-include/asm/system.h:22,
                 from /home/bog/tomato/tools/brcm/K26/hndtools-mipsel-uclibc-4.2.4/bin/../lib/gcc/mipsel-linux-uclibc/4.2.4/../../../../mipsel-linux-uclibc/sys-include/linux/spinlock.h:57,
                 from /home/bog/tomato/tools/brcm/K26/hndtools-mipsel-uclibc-4.2.4/bin/../lib/gcc/mipsel-linux-uclibc/4.2.4/../../../../mipsel-linux-uclibc/sys-include/linux/module.h:9,
                 from /home/bog/tomato/tools/brcm/K26/hndtools-mipsel-uclibc-4.2.4/bin/../lib/gcc/mipsel-linux-uclibc/4.2.4/../../../../mipsel-linux-uclibc/sys-include/linux/mtd/mtd.h:13,
                 from mtd.c:52:
/home/bog/tomato/tools/brcm/K26/hndtools-mipsel-uclibc-4.2.4/bin/../lib/gcc/mipsel-linux-uclibc/4.2.4/../../../../mipsel-linux-uclibc/sys-include/asm/mipsregs.h:207:2: error: #error Bad page size configuration!
In file included from /home/bog/tomato/tools/brcm/K26/hndtools-mipsel-uclibc-4.2.4/bin/../lib/gcc/mipsel-linux-uclibc/4.2.4/../../../../mipsel-linux-uclibc/sys-include/linux/module.h:21,
                 from /home/bog/tomato/tools/brcm/K26/hndtools-mipsel-uclibc-4.2.4/bin/../lib/gcc/mipsel-linux-uclibc/4.2.4/../../../../mipsel-linux-uclibc/sys-include/linux/mtd/mtd.h:13,
                 from mtd.c:52:
/home/bog/tomato/tools/brcm/K26/hndtools-mipsel-uclibc-4.2.4/bin/../lib/gcc/mipsel-linux-uclibc/4.2.4/../../../../mipsel-linux-uclibc/sys-include/asm/module.h:116:2: error: #error MODULE_PROC_FAMILY undefined for your processor configuration
In file included from mtd.c:52:
/home/bog/tomato/tools/brcm/K26/hndtools-mipsel-uclibc-4.2.4/bin/../lib/gcc/mipsel-linux-uclibc/4.2.4/../../../../mipsel-linux-uclibc/sys-include/linux/mtd/mtd.h:18:25: error: mtd/mtd-abi.h: No such file or directory
make[4]: Leaving directory `/home/bog/tomato/release/src/router/rc'
grep: /home/bog/tomato/release/src/linux/linux/include/linux/version.h: No such file or directory
make[4]: Entering directory `/home/bog/tomato/release/src/router/rc'
 [rc] CC rc.o
 [rc] CC init.o
 [rc] CC interface.o
 [rc] CC network.o
 [rc] CC wan.o
 [rc] CC services.o
 [rc] CC dhcp.o
 [rc] CC firewall.o
 [rc] CC ppp.o
 [rc] CC telssh.o
 [rc] CC wnas.o
 [rc] CC listen.o
listen.c: In function 'listen_main':
listen.c:166: warning: 'ifindex' may be used uninitialized in this function
listen.c:166: note: 'ifindex' was declared here
 [rc] CC redial.o
 [rc] CC led.o
 [rc] CC qos.o
 [rc] CC forward.o
 [rc] CC misc.o
 [rc] CC mtd.o
In file included from /home/bog/tomato/tools/brcm/K26/hndtools-mipsel-uclibc-4.2.4/bin/../lib/gcc/mipsel-linux-uclibc/4.2.4/../../../../mipsel-linux-uclibc/sys-include/linux/preempt.h:9,
                 from /home/bog/tomato/tools/brcm/K26/hndtools-mipsel-uclibc-4.2.4/bin/../lib/gcc/mipsel-linux-uclibc/4.2.4/../../../../mipsel-linux-uclibc/sys-include/linux/spinlock.h:49,
                 from /home/bog/tomato/tools/brcm/K26/hndtools-mipsel-uclibc-4.2.4/bin/../lib/gcc/mipsel-linux-uclibc/4.2.4/../../../../mipsel-linux-uclibc/sys-include/linux/module.h:9,
                 from /home/bog/tomato/tools/brcm/K26/hndtools-mipsel-uclibc-4.2.4/bin/../lib/gcc/mipsel-linux-uclibc/4.2.4/../../../../mipsel-linux-uclibc/sys-include/linux/mtd/mtd.h:13,
                 from mtd.c:52:
/home/bog/tomato/tools/brcm/K26/hndtools-mipsel-uclibc-4.2.4/bin/../lib/gcc/mipsel-linux-uclibc/4.2.4/../../../../mipsel-linux-uclibc/sys-include/linux/thread_info.h:23: error: expected specifier-qualifier-list before 'u32'
In file included from /home/bog/tomato/tools/brcm/K26/hndtools-mipsel-uclibc-4.2.4/bin/../lib/gcc/mipsel-linux-uclibc/4.2.4/../../../../mipsel-linux-uclibc/sys-include/asm/cpu-info.h:15,
                 from /home/bog/tomato/tools/brcm/K26/hndtools-mipsel-uclibc-4.2.4/bin/../lib/gcc/mipsel-linux-uclibc/4.2.4/../../../../mipsel-linux-uclibc/sys-include/asm/cpu-features.h:14,
                 from /home/bog/tomato/tools/brcm/K26/hndtools-mipsel-uclibc-4.2.4/bin/../lib/gcc/mipsel-linux-uclibc/4.2.4/../../../../mipsel-linux-uclibc/sys-include/asm/bitops.h:18,
                 from /home/bog/tomato/tools/brcm/K26/hndtools-mipsel-uclibc-4.2.4/bin/../lib/gcc/mipsel-linux-uclibc/4.2.4/../../../../mipsel-linux-uclibc/sys-include/linux/bitops.h:9,
                 from /home/bog/tomato/tools/brcm/K26/hndtools-mipsel-uclibc-4.2.4/bin/../lib/gcc/mipsel-linux-uclibc/4.2.4/../../../../mipsel-linux-uclibc/sys-include/linux/thread_info.h:33,
                 from /home/bog/tomato/tools/brcm/K26/hndtools-mipsel-uclibc-4.2.4/bin/../lib/gcc/mipsel-linux-uclibc/4.2.4/../../../../mipsel-linux-uclibc/sys-include/linux/preempt.h:9,
                 from /home/bog/tomato/tools/brcm/K26/hndtools-mipsel-uclibc-4.2.4/bin/../lib/gcc/mipsel-linux-uclibc/4.2.4/../../../../mipsel-linux-uclibc/sys-include/linux/spinlock.h:49,
                 from /home/bog/tomato/tools/brcm/K26/hndtools-mipsel-uclibc-4.2.4/bin/../lib/gcc/mipsel-linux-uclibc/4.2.4/../../../../mipsel-linux-uclibc/sys-include/linux/module.h:9,
                 from /home/bog/tomato/tools/brcm/K26/hndtools-mipsel-uclibc-4.2.4/bin/../lib/gcc/mipsel-linux-uclibc/4.2.4/../../../../mipsel-linux-uclibc/sys-include/linux/mtd/mtd.h:13,
                 from mtd.c:52:
/home/bog/tomato/tools/brcm/K26/hndtools-mipsel-uclibc-4.2.4/bin/../lib/gcc/mipsel-linux-uclibc/4.2.4/../../../../mipsel-linux-uclibc/sys-include/asm/cache.h:12:21: error: kmalloc.h: No such file or directory
In file included from /home/bog/tomato/tools/brcm/K26/hndtools-mipsel-uclibc-4.2.4/bin/../lib/gcc/mipsel-linux-uclibc/4.2.4/../../../../mipsel-linux-uclibc/sys-include/asm/cpu-features.h:14,
                 from /home/bog/tomato/tools/brcm/K26/hndtools-mipsel-uclibc-4.2.4/bin/../lib/gcc/mipsel-linux-uclibc/4.2.4/../../../../mipsel-linux-uclibc/sys-include/asm/bitops.h:18,
                 from /home/bog/tomato/tools/brcm/K26/hndtools-mipsel-uclibc-4.2.4/bin/../lib/gcc/mipsel-linux-uclibc/4.2.4/../../../../mipsel-linux-uclibc/sys-include/linux/bitops.h:9,
                 from /home/bog/tomato/tools/brcm/K26/hndtools-mipsel-uclibc-4.2.4/bin/../lib/gcc/mipsel-linux-uclibc/4.2.4/../../../../mipsel-linux-uclibc/sys-include/linux/thread_info.h:33,
                 from /home/bog/tomato/tools/brcm/K26/hndtools-mipsel-uclibc-4.2.4/bin/../lib/gcc/mipsel-linux-uclibc/4.2.4/../../../../mipsel-linux-uclibc/sys-include/linux/preempt.h:9,
                 from /home/bog/tomato/tools/brcm/K26/hndtools-mipsel-uclibc-4.2.4/bin/../lib/gcc/mipsel-linux-uclibc/4.2.4/../../../../mipsel-linux-uclibc/sys-include/linux/spinlock.h:49,
                 from /home/bog/tomato/tools/brcm/K26/hndtools-mipsel-uclibc-4.2.4/bin/../lib/gcc/mipsel-linux-uclibc/4.2.4/../../../../mipsel-linux-uclibc/sys-include/linux/module.h:9,
                 from /home/bog/tomato/tools/brcm/K26/hndtools-mipsel-uclibc-4.2.4/bin/../lib/gcc/mipsel-linux-uclibc/4.2.4/../../../../mipsel-linux-uclibc/sys-include/linux/mtd/mtd.h:13,
                 from mtd.c:52:
/home/bog/tomato/tools/brcm/K26/hndtools-mipsel-uclibc-4.2.4/bin/../lib/gcc/mipsel-linux-uclibc/4.2.4/../../../../mipsel-linux-uclibc/sys-include/asm/cpu-info.h:87: error: 'CONFIG_MIPS_L1_CACHE_SHIFT' undeclared here (not in a function)
/home/bog/tomato/tools/brcm/K26/hndtools-mipsel-uclibc-4.2.4/bin/../lib/gcc/mipsel-linux-uclibc/4.2.4/../../../../mipsel-linux-uclibc/sys-include/asm/cpu-info.h:87: error: requested alignment is not a constant
In file included from /home/bog/tomato/tools/brcm/K26/hndtools-mipsel-uclibc-4.2.4/bin/../lib/gcc/mipsel-linux-uclibc/4.2.4/../../../../mipsel-linux-uclibc/sys-include/asm/bitops.h:18,
                 from /home/bog/tomato/tools/brcm/K26/hndtools-mipsel-uclibc-4.2.4/bin/../lib/gcc/mipsel-linux-uclibc/4.2.4/../../../../mipsel-linux-uclibc/sys-include/linux/bitops.h:9,
                 from /home/bog/tomato/tools/brcm/K26/hndtools-mipsel-uclibc-4.2.4/bin/../lib/gcc/mipsel-linux-uclibc/4.2.4/../../../../mipsel-linux-uclibc/sys-include/linux/thread_info.h:33,
                 from /home/bog/tomato/tools/brcm/K26/hndtools-mipsel-uclibc-4.2.4/bin/../lib/gcc/mipsel-linux-uclibc/4.2.4/../../../../mipsel-linux-uclibc/sys-include/linux/preempt.h:9,
                 from /home/bog/tomato/tools/brcm/K26/hndtools-mipsel-uclibc-4.2.4/bin/../lib/gcc/mipsel-linux-uclibc/4.2.4/../../../../mipsel-linux-uclibc/sys-include/linux/spinlock.h:49,
                 from /home/bog/tomato/tools/brcm/K26/hndtools-mipsel-uclibc-4.2.4/bin/../lib/gcc/mipsel-linux-uclibc/4.2.4/../../../../mipsel-linux-uclibc/sys-include/linux/module.h:9,
                 from /home/bog/tomato/tools/brcm/K26/hndtools-mipsel-uclibc-4.2.4/bin/../lib/gcc/mipsel-linux-uclibc/4.2.4/../../../../mipsel-linux-uclibc/sys-include/linux/mtd/mtd.h:13,
                 from mtd.c:52:
/home/bog/tomato/tools/brcm/K26/hndtools-mipsel-uclibc-4.2.4/bin/../lib/gcc/mipsel-linux-uclibc/4.2.4/../../../../mipsel-linux-uclibc/sys-include/asm/cpu-features.h:15:35: error: cpu-feature-overrides.h: No such file or directory
In file included from /home/bog/tomato/tools/brcm/K26/hndtools-mipsel-uclibc-4.2.4/bin/../lib/gcc/mipsel-linux-uclibc/4.2.4/../../../../mipsel-linux-uclibc/sys-include/asm/bitops.h:453,
                 from /home/bog/tomato/tools/brcm/K26/hndtools-mipsel-uclibc-4.2.4/bin/../lib/gcc/mipsel-linux-uclibc/4.2.4/../../../../mipsel-linux-uclibc/sys-include/linux/bitops.h:9,
                 from /home/bog/tomato/tools/brcm/K26/hndtools-mipsel-uclibc-4.2.4/bin/../lib/gcc/mipsel-linux-uclibc/4.2.4/../../../../mipsel-linux-uclibc/sys-include/linux/thread_info.h:33,
                 from /home/bog/tomato/tools/brcm/K26/hndtools-mipsel-uclibc-4.2.4/bin/../lib/gcc/mipsel-linux-uclibc/4.2.4/../../../../mipsel-linux-uclibc/sys-include/linux/preempt.h:9,
                 from /home/bog/tomato/tools/brcm/K26/hndtools-mipsel-uclibc-4.2.4/bin/../lib/gcc/mipsel-linux-uclibc/4.2.4/../../../../mipsel-linux-uclibc/sys-include/linux/spinlock.h:49,
                 from /home/bog/tomato/tools/brcm/K26/hndtools-mipsel-uclibc-4.2.4/bin/../lib/gcc/mipsel-linux-uclibc/4.2.4/../../../../mipsel-linux-uclibc/sys-include/linux/module.h:9,
                 from /home/bog/tomato/tools/brcm/K26/hndtools-mipsel-uclibc-4.2.4/bin/../lib/gcc/mipsel-linux-uclibc/4.2.4/../../../../mipsel-linux-uclibc/sys-include/linux/mtd/mtd.h:13,
                 from mtd.c:52:
/home/bog/tomato/tools/brcm/K26/hndtools-mipsel-uclibc-4.2.4/bin/../lib/gcc/mipsel-linux-uclibc/4.2.4/../../../../mipsel-linux-uclibc/sys-include/asm-generic/bitops/non-atomic.h: In function '__set_bit':
/home/bog/tomato/tools/brcm/K26/hndtools-mipsel-uclibc-4.2.4/bin/../lib/gcc/mipsel-linux-uclibc/4.2.4/../../../../mipsel-linux-uclibc/sys-include/asm-generic/bitops/non-atomic.h:20: error: 'BITS_PER_LONG' undeclared (first use in this function)
/home/bog/tomato/tools/brcm/K26/hndtools-mipsel-uclibc-4.2.4/bin/../lib/gcc/mipsel-linux-uclibc/4.2.4/../../../../mipsel-linux-uclibc/sys-include/asm-generic/bitops/non-atomic.h:20: error: (Each undeclared identifier is reported only once
/home/bog/tomato/tools/brcm/K26/hndtools-mipsel-uclibc-4.2.4/bin/../lib/gcc/mipsel-linux-uclibc/4.2.4/../../../../mipsel-linux-uclibc/sys-include/asm-generic/bitops/non-atomic.h:20: error: for each function it appears in.)
/home/bog/tomato/tools/brcm/K26/hndtools-mipsel-uclibc-4.2.4/bin/../lib/gcc/mipsel-linux-uclibc/4.2.4/../../../../mipsel-linux-uclibc/sys-include/asm-generic/bitops/non-atomic.h: In function '__clear_bit':
/home/bog/tomato/tools/brcm/K26/hndtools-mipsel-uclibc-4.2.4/bin/../lib/gcc/mipsel-linux-uclibc/4.2.4/../../../../mipsel-linux-uclibc/sys-include/asm-generic/bitops/non-atomic.h:28: error: 'BITS_PER_LONG' undeclared (first use in this function)
/home/bog/tomato/tools/brcm/K26/hndtools-mipsel-uclibc-4.2.4/bin/../lib/gcc/mipsel-linux-uclibc/4.2.4/../../../../mipsel-linux-uclibc/sys-include/asm-generic/bitops/non-atomic.h: In function '__change_bit':
/home/bog/tomato/tools/brcm/K26/hndtools-mipsel-uclibc-4.2.4/bin/../lib/gcc/mipsel-linux-uclibc/4.2.4/../../../../mipsel-linux-uclibc/sys-include/asm-generic/bitops/non-atomic.h:45: error: 'BITS_PER_LONG' undeclared (first use in this function)
/home/bog/tomato/tools/brcm/K26/hndtools-mipsel-uclibc-4.2.4/bin/../lib/gcc/mipsel-linux-uclibc/4.2.4/../../../../mipsel-linux-uclibc/sys-include/asm-generic/bitops/non-atomic.h: In function '__test_and_set_bit':
/home/bog/tomato/tools/brcm/K26/hndtools-mipsel-uclibc-4.2.4/bin/../lib/gcc/mipsel-linux-uclibc/4.2.4/../../../../mipsel-linux-uclibc/sys-include/asm-generic/bitops/non-atomic.h:62: error: 'BITS_PER_LONG' undeclared (first use in this function)
/home/bog/tomato/tools/brcm/K26/hndtools-mipsel-uclibc-4.2.4/bin/../lib/gcc/mipsel-linux-uclibc/4.2.4/../../../../mipsel-linux-uclibc/sys-include/asm-generic/bitops/non-atomic.h: In function '__test_and_clear_bit':
/home/bog/tomato/tools/brcm/K26/hndtools-mipsel-uclibc-4.2.4/bin/../lib/gcc/mipsel-linux-uclibc/4.2.4/../../../../mipsel-linux-uclibc/sys-include/asm-generic/bitops/non-atomic.h:81: error: 'BITS_PER_LONG' undeclared (first use in this function)
/home/bog/tomato/tools/brcm/K26/hndtools-mipsel-uclibc-4.2.4/bin/../lib/gcc/mipsel-linux-uclibc/4.2.4/../../../../mipsel-linux-uclibc/sys-include/asm-generic/bitops/non-atomic.h: In function '__test_and_change_bit':
/home/bog/tomato/tools/brcm/K26/hndtools-mipsel-uclibc-4.2.4/bin/../lib/gcc/mipsel-linux-uclibc/4.2.4/../../../../mipsel-linux-uclibc/sys-include/asm-generic/bitops/non-atomic.h:93: error: 'BITS_PER_LONG' undeclared (first use in this function)
/home/bog/tomato/tools/brcm/K26/hndtools-mipsel-uclibc-4.2.4/bin/../lib/gcc/mipsel-linux-uclibc/4.2.4/../../../../mipsel-linux-uclibc/sys-include/asm-generic/bitops/non-atomic.h: In function 'test_bit':
/home/bog/tomato/tools/brcm/K26/hndtools-mipsel-uclibc-4.2.4/bin/../lib/gcc/mipsel-linux-uclibc/4.2.4/../../../../mipsel-linux-uclibc/sys-include/asm-generic/bitops/non-atomic.h:108: error: 'BITS_PER_LONG' undeclared (first use in this function)
In file included from /home/bog/tomato/tools/brcm/K26/hndtools-mipsel-uclibc-4.2.4/bin/../lib/gcc/mipsel-linux-uclibc/4.2.4/../../../../mipsel-linux-uclibc/sys-include/asm/bitops.h:546,
                 from /home/bog/tomato/tools/brcm/K26/hndtools-mipsel-uclibc-4.2.4/bin/../lib/gcc/mipsel-linux-uclibc/4.2.4/../../../../mipsel-linux-uclibc/sys-include/linux/bitops.h:9,
                 from /home/bog/tomato/tools/brcm/K26/hndtools-mipsel-uclibc-4.2.4/bin/../lib/gcc/mipsel-linux-uclibc/4.2.4/../../../../mipsel-linux-uclibc/sys-include/linux/thread_info.h:33,
                 from /home/bog/tomato/tools/brcm/K26/hndtools-mipsel-uclibc-4.2.4/bin/../lib/gcc/mipsel-linux-uclibc/4.2.4/../../../../mipsel-linux-uclibc/sys-include/linux/preempt.h:9,
                 from /home/bog/tomato/tools/brcm/K26/hndtools-mipsel-uclibc-4.2.4/bin/../lib/gcc/mipsel-linux-uclibc/4.2.4/../../../../mipsel-linux-uclibc/sys-include/linux/spinlock.h:49,
                 from /home/bog/tomato/tools/brcm/K26/hndtools-mipsel-uclibc-4.2.4/bin/../lib/gcc/mipsel-linux-uclibc/4.2.4/../../../../mipsel-linux-uclibc/sys-include/linux/module.h:9,
                 from /home/bog/tomato/tools/brcm/K26/hndtools-mipsel-uclibc-4.2.4/bin/../lib/gcc/mipsel-linux-uclibc/4.2.4/../../../../mipsel-linux-uclibc/sys-include/linux/mtd/mtd.h:13,
                 from mtd.c:52:
/home/bog/tomato/tools/brcm/K26/hndtools-mipsel-uclibc-4.2.4/bin/../lib/gcc/mipsel-linux-uclibc/4.2.4/../../../../mipsel-linux-uclibc/sys-include/asm-generic/bitops/ffs.h: At top level:
/home/bog/tomato/tools/brcm/K26/hndtools-mipsel-uclibc-4.2.4/bin/../lib/gcc/mipsel-linux-uclibc/4.2.4/../../../../mipsel-linux-uclibc/sys-include/asm-generic/bitops/ffs.h:13: error: static declaration of 'ffs' follows non-static declaration
In file included from /home/bog/tomato/tools/brcm/K26/hndtools-mipsel-uclibc-4.2.4/bin/../lib/gcc/mipsel-linux-uclibc/4.2.4/../../../../mipsel-linux-uclibc/sys-include/linux/spinlock.h:53,
                 from /home/bog/tomato/tools/brcm/K26/hndtools-mipsel-uclibc-4.2.4/bin/../lib/gcc/mipsel-linux-uclibc/4.2.4/../../../../mipsel-linux-uclibc/sys-include/linux/module.h:9,
                 from /home/bog/tomato/tools/brcm/K26/hndtools-mipsel-uclibc-4.2.4/bin/../lib/gcc/mipsel-linux-uclibc/4.2.4/../../../../mipsel-linux-uclibc/sys-include/linux/mtd/mtd.h:13,
                 from mtd.c:52:
/home/bog/tomato/tools/brcm/K26/hndtools-mipsel-uclibc-4.2.4/bin/../lib/gcc/mipsel-linux-uclibc/4.2.4/../../../../mipsel-linux-uclibc/sys-include/linux/kernel.h:346: error: redefinition of 'struct sysinfo'
In file included from /home/bog/tomato/tools/brcm/K26/hndtools-mipsel-uclibc-4.2.4/bin/../lib/gcc/mipsel-linux-uclibc/4.2.4/../../../../mipsel-linux-uclibc/sys-include/asm/system.h:19,
                 from /home/bog/tomato/tools/brcm/K26/hndtools-mipsel-uclibc-4.2.4/bin/../lib/gcc/mipsel-linux-uclibc/4.2.4/../../../../mipsel-linux-uclibc/sys-include/linux/spinlock.h:57,
                 from /home/bog/tomato/tools/brcm/K26/hndtools-mipsel-uclibc-4.2.4/bin/../lib/gcc/mipsel-linux-uclibc/4.2.4/../../../../mipsel-linux-uclibc/sys-include/linux/module.h:9,
                 from /home/bog/tomato/tools/brcm/K26/hndtools-mipsel-uclibc-4.2.4/bin/../lib/gcc/mipsel-linux-uclibc/4.2.4/../../../../mipsel-linux-uclibc/sys-include/linux/mtd/mtd.h:13,
                 from mtd.c:52:
/home/bog/tomato/tools/brcm/K26/hndtools-mipsel-uclibc-4.2.4/bin/../lib/gcc/mipsel-linux-uclibc/4.2.4/../../../../mipsel-linux-uclibc/sys-include/asm/addrspace.h:13:20: error: spaces.h: No such file or directory
In file included from /home/bog/tomato/tools/brcm/K26/hndtools-mipsel-uclibc-4.2.4/bin/../lib/gcc/mipsel-linux-uclibc/4.2.4/../../../../mipsel-linux-uclibc/sys-include/asm/dsp.h:16,
                 from /home/bog/tomato/tools/brcm/K26/hndtools-mipsel-uclibc-4.2.4/bin/../lib/gcc/mipsel-linux-uclibc/4.2.4/../../../../mipsel-linux-uclibc/sys-include/asm/system.h:22,
                 from /home/bog/tomato/tools/brcm/K26/hndtools-mipsel-uclibc-4.2.4/bin/../lib/gcc/mipsel-linux-uclibc/4.2.4/../../../../mipsel-linux-uclibc/sys-include/linux/spinlock.h:57,
                 from /home/bog/tomato/tools/brcm/K26/hndtools-mipsel-uclibc-4.2.4/bin/../lib/gcc/mipsel-linux-uclibc/4.2.4/../../../../mipsel-linux-uclibc/sys-include/linux/module.h:9,
                 from /home/bog/tomato/tools/brcm/K26/hndtools-mipsel-uclibc-4.2.4/bin/../lib/gcc/mipsel-linux-uclibc/4.2.4/../../../../mipsel-linux-uclibc/sys-include/linux/mtd/mtd.h:13,
                 from mtd.c:52:
/home/bog/tomato/tools/brcm/K26/hndtools-mipsel-uclibc-4.2.4/bin/../lib/gcc/mipsel-linux-uclibc/4.2.4/../../../../mipsel-linux-uclibc/sys-include/asm/mipsregs.h:207:2: error: #error Bad page size configuration!
In file included from /home/bog/tomato/tools/brcm/K26/hndtools-mipsel-uclibc-4.2.4/bin/../lib/gcc/mipsel-linux-uclibc/4.2.4/../../../../mipsel-linux-uclibc/sys-include/linux/module.h:10,
                 from /home/bog/tomato/tools/brcm/K26/hndtools-mipsel-uclibc-4.2.4/bin/../lib/gcc/mipsel-linux-uclibc/4.2.4/../../../../mipsel-linux-uclibc/sys-include/linux/mtd/mtd.h:13,
                 from mtd.c:52:
/home/bog/tomato/tools/brcm/K26/hndtools-mipsel-uclibc-4.2.4/bin/../lib/gcc/mipsel-linux-uclibc/4.2.4/../../../../mipsel-linux-uclibc/sys-include/linux/list.h:970:2: warning: #warning "don't include kernel headers in userspace"
In file included from /home/bog/tomato/tools/brcm/K26/hndtools-mipsel-uclibc-4.2.4/bin/../lib/gcc/mipsel-linux-uclibc/4.2.4/../../../../mipsel-linux-uclibc/sys-include/linux/cpumask.h:86,
                 from /home/bog/tomato/tools/brcm/K26/hndtools-mipsel-uclibc-4.2.4/bin/../lib/gcc/mipsel-linux-uclibc/4.2.4/../../../../mipsel-linux-uclibc/sys-include/linux/percpu.h:8,
                 from /home/bog/tomato/tools/brcm/K26/hndtools-mipsel-uclibc-4.2.4/bin/../lib/gcc/mipsel-linux-uclibc/4.2.4/../../../../mipsel-linux-uclibc/sys-include/asm/local.h:4,
                 from /home/bog/tomato/tools/brcm/K26/hndtools-mipsel-uclibc-4.2.4/bin/../lib/gcc/mipsel-linux-uclibc/4.2.4/../../../../mipsel-linux-uclibc/sys-include/linux/module.h:19,
                 from /home/bog/tomato/tools/brcm/K26/hndtools-mipsel-uclibc-4.2.4/bin/../lib/gcc/mipsel-linux-uclibc/4.2.4/../../../../mipsel-linux-uclibc/sys-include/linux/mtd/mtd.h:13,
                 from mtd.c:52:
/home/bog/tomato/tools/brcm/K26/hndtools-mipsel-uclibc-4.2.4/bin/../lib/gcc/mipsel-linux-uclibc/4.2.4/../../../../mipsel-linux-uclibc/sys-include/linux/bitmap.h: In function 'bitmap_zero':
/home/bog/tomato/tools/brcm/K26/hndtools-mipsel-uclibc-4.2.4/bin/../lib/gcc/mipsel-linux-uclibc/4.2.4/../../../../mipsel-linux-uclibc/sys-include/linux/bitmap.h:134: error: 'BITS_PER_LONG' undeclared (first use in this function)
/home/bog/tomato/tools/brcm/K26/hndtools-mipsel-uclibc-4.2.4/bin/../lib/gcc/mipsel-linux-uclibc/4.2.4/../../../../mipsel-linux-uclibc/sys-include/linux/bitmap.h: In function 'bitmap_fill':
/home/bog/tomato/tools/brcm/K26/hndtools-mipsel-uclibc-4.2.4/bin/../lib/gcc/mipsel-linux-uclibc/4.2.4/../../../../mipsel-linux-uclibc/sys-include/linux/bitmap.h:149: error: 'BITS_PER_LONG' undeclared (first use in this function)
/home/bog/tomato/tools/brcm/K26/hndtools-mipsel-uclibc-4.2.4/bin/../lib/gcc/mipsel-linux-uclibc/4.2.4/../../../../mipsel-linux-uclibc/sys-include/linux/bitmap.h: In function 'bitmap_copy':
/home/bog/tomato/tools/brcm/K26/hndtools-mipsel-uclibc-4.2.4/bin/../lib/gcc/mipsel-linux-uclibc/4.2.4/../../../../mipsel-linux-uclibc/sys-include/linux/bitmap.h:155: error: 'BITS_PER_LONG' undeclared (first use in this function)
/home/bog/tomato/tools/brcm/K26/hndtools-mipsel-uclibc-4.2.4/bin/../lib/gcc/mipsel-linux-uclibc/4.2.4/../../../../mipsel-linux-uclibc/sys-include/linux/bitmap.h: In function 'bitmap_and':
/home/bog/tomato/tools/brcm/K26/hndtools-mipsel-uclibc-4.2.4/bin/../lib/gcc/mipsel-linux-uclibc/4.2.4/../../../../mipsel-linux-uclibc/sys-include/linux/bitmap.h:166: error: 'BITS_PER_LONG' undeclared (first use in this function)
/home/bog/tomato/tools/brcm/K26/hndtools-mipsel-uclibc-4.2.4/bin/../lib/gcc/mipsel-linux-uclibc/4.2.4/../../../../mipsel-linux-uclibc/sys-include/linux/bitmap.h: In function 'bitmap_or':
/home/bog/tomato/tools/brcm/K26/hndtools-mipsel-uclibc-4.2.4/bin/../lib/gcc/mipsel-linux-uclibc/4.2.4/../../../../mipsel-linux-uclibc/sys-include/linux/bitmap.h:175: error: 'BITS_PER_LONG' undeclared (first use in this function)
/home/bog/tomato/tools/brcm/K26/hndtools-mipsel-uclibc-4.2.4/bin/../lib/gcc/mipsel-linux-uclibc/4.2.4/../../../../mipsel-linux-uclibc/sys-include/linux/bitmap.h: In function 'bitmap_xor':
/home/bog/tomato/tools/brcm/K26/hndtools-mipsel-uclibc-4.2.4/bin/../lib/gcc/mipsel-linux-uclibc/4.2.4/../../../../mipsel-linux-uclibc/sys-include/linux/bitmap.h:184: error: 'BITS_PER_LONG' undeclared (first use in this function)
/home/bog/tomato/tools/brcm/K26/hndtools-mipsel-uclibc-4.2.4/bin/../lib/gcc/mipsel-linux-uclibc/4.2.4/../../../../mipsel-linux-uclibc/sys-include/linux/bitmap.h: In function 'bitmap_andnot':
/home/bog/tomato/tools/brcm/K26/hndtools-mipsel-uclibc-4.2.4/bin/../lib/gcc/mipsel-linux-uclibc/4.2.4/../../../../mipsel-linux-uclibc/sys-include/linux/bitmap.h:193: error: 'BITS_PER_LONG' undeclared (first use in this function)
/home/bog/tomato/tools/brcm/K26/hndtools-mipsel-uclibc-4.2.4/bin/../lib/gcc/mipsel-linux-uclibc/4.2.4/../../../../mipsel-linux-uclibc/sys-include/linux/bitmap.h: In function 'bitmap_complement':
/home/bog/tomato/tools/brcm/K26/hndtools-mipsel-uclibc-4.2.4/bin/../lib/gcc/mipsel-linux-uclibc/4.2.4/../../../../mipsel-linux-uclibc/sys-include/linux/bitmap.h:202: error: 'BITS_PER_LONG' undeclared (first use in this function)
/home/bog/tomato/tools/brcm/K26/hndtools-mipsel-uclibc-4.2.4/bin/../lib/gcc/mipsel-linux-uclibc/4.2.4/../../../../mipsel-linux-uclibc/sys-include/linux/bitmap.h: In function 'bitmap_equal':
/home/bog/tomato/tools/brcm/K26/hndtools-mipsel-uclibc-4.2.4/bin/../lib/gcc/mipsel-linux-uclibc/4.2.4/../../../../mipsel-linux-uclibc/sys-include/linux/bitmap.h:211: error: 'BITS_PER_LONG' undeclared (first use in this function)
/home/bog/tomato/tools/brcm/K26/hndtools-mipsel-uclibc-4.2.4/bin/../lib/gcc/mipsel-linux-uclibc/4.2.4/../../../../mipsel-linux-uclibc/sys-include/linux/bitmap.h: In function 'bitmap_intersects':
/home/bog/tomato/tools/brcm/K26/hndtools-mipsel-uclibc-4.2.4/bin/../lib/gcc/mipsel-linux-uclibc/4.2.4/../../../../mipsel-linux-uclibc/sys-include/linux/bitmap.h:220: error: 'BITS_PER_LONG' undeclared (first use in this function)
/home/bog/tomato/tools/brcm/K26/hndtools-mipsel-uclibc-4.2.4/bin/../lib/gcc/mipsel-linux-uclibc/4.2.4/../../../../mipsel-linux-uclibc/sys-include/linux/bitmap.h: In function 'bitmap_subset':
/home/bog/tomato/tools/brcm/K26/hndtools-mipsel-uclibc-4.2.4/bin/../lib/gcc/mipsel-linux-uclibc/4.2.4/../../../../mipsel-linux-uclibc/sys-include/linux/bitmap.h:229: error: 'BITS_PER_LONG' undeclared (first use in this function)
/home/bog/tomato/tools/brcm/K26/hndtools-mipsel-uclibc-4.2.4/bin/../lib/gcc/mipsel-linux-uclibc/4.2.4/../../../../mipsel-linux-uclibc/sys-include/linux/bitmap.h: In function 'bitmap_empty':
/home/bog/tomato/tools/brcm/K26/hndtools-mipsel-uclibc-4.2.4/bin/../lib/gcc/mipsel-linux-uclibc/4.2.4/../../../../mipsel-linux-uclibc/sys-include/linux/bitmap.h:237: error: 'BITS_PER_LONG' undeclared (first use in this function)
/home/bog/tomato/tools/brcm/K26/hndtools-mipsel-uclibc-4.2.4/bin/../lib/gcc/mipsel-linux-uclibc/4.2.4/../../../../mipsel-linux-uclibc/sys-include/linux/bitmap.h: In function 'bitmap_full':
/home/bog/tomato/tools/brcm/K26/hndtools-mipsel-uclibc-4.2.4/bin/../lib/gcc/mipsel-linux-uclibc/4.2.4/../../../../mipsel-linux-uclibc/sys-include/linux/bitmap.h:245: error: 'BITS_PER_LONG' undeclared (first use in this function)
/home/bog/tomato/tools/brcm/K26/hndtools-mipsel-uclibc-4.2.4/bin/../lib/gcc/mipsel-linux-uclibc/4.2.4/../../../../mipsel-linux-uclibc/sys-include/linux/bitmap.h: In function 'bitmap_weight':
/home/bog/tomato/tools/brcm/K26/hndtools-mipsel-uclibc-4.2.4/bin/../lib/gcc/mipsel-linux-uclibc/4.2.4/../../../../mipsel-linux-uclibc/sys-include/linux/bitmap.h:253: error: 'BITS_PER_LONG' undeclared (first use in this function)
/home/bog/tomato/tools/brcm/K26/hndtools-mipsel-uclibc-4.2.4/bin/../lib/gcc/mipsel-linux-uclibc/4.2.4/../../../../mipsel-linux-uclibc/sys-include/linux/bitmap.h: In function 'bitmap_shift_right':
/home/bog/tomato/tools/brcm/K26/hndtools-mipsel-uclibc-4.2.4/bin/../lib/gcc/mipsel-linux-uclibc/4.2.4/../../../../mipsel-linux-uclibc/sys-include/linux/bitmap.h:261: error: 'BITS_PER_LONG' undeclared (first use in this function)
/home/bog/tomato/tools/brcm/K26/hndtools-mipsel-uclibc-4.2.4/bin/../lib/gcc/mipsel-linux-uclibc/4.2.4/../../../../mipsel-linux-uclibc/sys-include/linux/bitmap.h: In function 'bitmap_shift_left':
/home/bog/tomato/tools/brcm/K26/hndtools-mipsel-uclibc-4.2.4/bin/../lib/gcc/mipsel-linux-uclibc/4.2.4/../../../../mipsel-linux-uclibc/sys-include/linux/bitmap.h:270: error: 'BITS_PER_LONG' undeclared (first use in this function)
In file included from /home/bog/tomato/tools/brcm/K26/hndtools-mipsel-uclibc-4.2.4/bin/../lib/gcc/mipsel-linux-uclibc/4.2.4/../../../../mipsel-linux-uclibc/sys-include/linux/percpu.h:8,
                 from /home/bog/tomato/tools/brcm/K26/hndtools-mipsel-uclibc-4.2.4/bin/../lib/gcc/mipsel-linux-uclibc/4.2.4/../../../../mipsel-linux-uclibc/sys-include/asm/local.h:4,
                 from /home/bog/tomato/tools/brcm/K26/hndtools-mipsel-uclibc-4.2.4/bin/../lib/gcc/mipsel-linux-uclibc/4.2.4/../../../../mipsel-linux-uclibc/sys-include/linux/module.h:19,
                 from /home/bog/tomato/tools/brcm/K26/hndtools-mipsel-uclibc-4.2.4/bin/../lib/gcc/mipsel-linux-uclibc/4.2.4/../../../../mipsel-linux-uclibc/sys-include/linux/mtd/mtd.h:13,
                 from mtd.c:52:
/home/bog/tomato/tools/brcm/K26/hndtools-mipsel-uclibc-4.2.4/bin/../lib/gcc/mipsel-linux-uclibc/4.2.4/../../../../mipsel-linux-uclibc/sys-include/linux/cpumask.h: At top level:
/home/bog/tomato/tools/brcm/K26/hndtools-mipsel-uclibc-4.2.4/bin/../lib/gcc/mipsel-linux-uclibc/4.2.4/../../../../mipsel-linux-uclibc/sys-include/linux/cpumask.h:88: error: expected specifier-qualifier-list before 'DECLARE_BITMAP'
/home/bog/tomato/tools/brcm/K26/hndtools-mipsel-uclibc-4.2.4/bin/../lib/gcc/mipsel-linux-uclibc/4.2.4/../../../../mipsel-linux-uclibc/sys-include/linux/cpumask.h: In function '__cpu_set':
/home/bog/tomato/tools/brcm/K26/hndtools-mipsel-uclibc-4.2.4/bin/../lib/gcc/mipsel-linux-uclibc/4.2.4/../../../../mipsel-linux-uclibc/sys-include/linux/cpumask.h:94: error: 'cpumask_t' has no member named 'bits'
/home/bog/tomato/tools/brcm/K26/hndtools-mipsel-uclibc-4.2.4/bin/../lib/gcc/mipsel-linux-uclibc/4.2.4/../../../../mipsel-linux-uclibc/sys-include/linux/cpumask.h: In function '__cpu_clear':
/home/bog/tomato/tools/brcm/K26/hndtools-mipsel-uclibc-4.2.4/bin/../lib/gcc/mipsel-linux-uclibc/4.2.4/../../../../mipsel-linux-uclibc/sys-include/linux/cpumask.h:100: error: 'cpumask_t' has no member named 'bits'
/home/bog/tomato/tools/brcm/K26/hndtools-mipsel-uclibc-4.2.4/bin/../lib/gcc/mipsel-linux-uclibc/4.2.4/../../../../mipsel-linux-uclibc/sys-include/linux/cpumask.h: In function '__cpus_setall':
/home/bog/tomato/tools/brcm/K26/hndtools-mipsel-uclibc-4.2.4/bin/../lib/gcc/mipsel-linux-uclibc/4.2.4/../../../../mipsel-linux-uclibc/sys-include/linux/cpumask.h:106: error: 'cpumask_t' has no member named 'bits'
/home/bog/tomato/tools/brcm/K26/hndtools-mipsel-uclibc-4.2.4/bin/../lib/gcc/mipsel-linux-uclibc/4.2.4/../../../../mipsel-linux-uclibc/sys-include/linux/cpumask.h: In function '__cpus_clear':
/home/bog/tomato/tools/brcm/K26/hndtools-mipsel-uclibc-4.2.4/bin/../lib/gcc/mipsel-linux-uclibc/4.2.4/../../../../mipsel-linux-uclibc/sys-include/linux/cpumask.h:112: error: 'cpumask_t' has no member named 'bits'
/home/bog/tomato/tools/brcm/K26/hndtools-mipsel-uclibc-4.2.4/bin/../lib/gcc/mipsel-linux-uclibc/4.2.4/../../../../mipsel-linux-uclibc/sys-include/linux/cpumask.h: In function '__cpu_test_and_set':
/home/bog/tomato/tools/brcm/K26/hndtools-mipsel-uclibc-4.2.4/bin/../lib/gcc/mipsel-linux-uclibc/4.2.4/../../../../mipsel-linux-uclibc/sys-include/linux/cpumask.h:121: error: 'cpumask_t' has no member named 'bits'
/home/bog/tomato/tools/brcm/K26/hndtools-mipsel-uclibc-4.2.4/bin/../lib/gcc/mipsel-linux-uclibc/4.2.4/../../../../mipsel-linux-uclibc/sys-include/linux/cpumask.h: In function '__cpus_and':
/home/bog/tomato/tools/brcm/K26/hndtools-mipsel-uclibc-4.2.4/bin/../lib/gcc/mipsel-linux-uclibc/4.2.4/../../../../mipsel-linux-uclibc/sys-include/linux/cpumask.h:128: error: 'cpumask_t' has no member named 'bits'
/home/bog/tomato/tools/brcm/K26/hndtools-mipsel-uclibc-4.2.4/bin/../lib/gcc/mipsel-linux-uclibc/4.2.4/../../../../mipsel-linux-uclibc/sys-include/linux/cpumask.h:128: error: 'cpumask_t' has no member named 'bits'
/home/bog/tomato/tools/brcm/K26/hndtools-mipsel-uclibc-4.2.4/bin/../lib/gcc/mipsel-linux-uclibc/4.2.4/../../../../mipsel-linux-uclibc/sys-include/linux/cpumask.h:128: error: 'cpumask_t' has no member named 'bits'
/home/bog/tomato/tools/brcm/K26/hndtools-mipsel-uclibc-4.2.4/bin/../lib/gcc/mipsel-linux-uclibc/4.2.4/../../../../mipsel-linux-uclibc/sys-include/linux/cpumask.h: In function '__cpus_or':
/home/bog/tomato/tools/brcm/K26/hndtools-mipsel-uclibc-4.2.4/bin/../lib/gcc/mipsel-linux-uclibc/4.2.4/../../../../mipsel-linux-uclibc/sys-include/linux/cpumask.h:135: error: 'cpumask_t' has no member named 'bits'
/home/bog/tomato/tools/brcm/K26/hndtools-mipsel-uclibc-4.2.4/bin/../lib/gcc/mipsel-linux-uclibc/4.2.4/../../../../mipsel-linux-uclibc/sys-include/linux/cpumask.h:135: error: 'cpumask_t' has no member named 'bits'
/home/bog/tomato/tools/brcm/K26/hndtools-mipsel-uclibc-4.2.4/bin/../lib/gcc/mipsel-linux-uclibc/4.2.4/../../../../mipsel-linux-uclibc/sys-include/linux/cpumask.h:135: error: 'cpumask_t' has no member named 'bits'
/home/bog/tomato/tools/brcm/K26/hndtools-mipsel-uclibc-4.2.4/bin/../lib/gcc/mipsel-linux-uclibc/4.2.4/../../../../mipsel-linux-uclibc/sys-include/linux/cpumask.h: In function '__cpus_xor':
/home/bog/tomato/tools/brcm/K26/hndtools-mipsel-uclibc-4.2.4/bin/../lib/gcc/mipsel-linux-uclibc/4.2.4/../../../../mipsel-linux-uclibc/sys-include/linux/cpumask.h:142: error: 'cpumask_t' has no member named 'bits'
/home/bog/tomato/tools/brcm/K26/hndtools-mipsel-uclibc-4.2.4/bin/../lib/gcc/mipsel-linux-uclibc/4.2.4/../../../../mipsel-linux-uclibc/sys-include/linux/cpumask.h:142: error: 'cpumask_t' has no member named 'bits'
/home/bog/tomato/tools/brcm/K26/hndtools-mipsel-uclibc-4.2.4/bin/../lib/gcc/mipsel-linux-uclibc/4.2.4/../../../../mipsel-linux-uclibc/sys-include/linux/cpumask.h:142: error: 'cpumask_t' has no member named 'bits'
/home/bog/tomato/tools/brcm/K26/hndtools-mipsel-uclibc-4.2.4/bin/../lib/gcc/mipsel-linux-uclibc/4.2.4/../../../../mipsel-linux-uclibc/sys-include/linux/cpumask.h: In function '__cpus_andnot':
/home/bog/tomato/tools/brcm/K26/hndtools-mipsel-uclibc-4.2.4/bin/../lib/gcc/mipsel-linux-uclibc/4.2.4/../../../../mipsel-linux-uclibc/sys-include/linux/cpumask.h:150: error: 'cpumask_t' has no member named 'bits'
/home/bog/tomato/tools/brcm/K26/hndtools-mipsel-uclibc-4.2.4/bin/../lib/gcc/mipsel-linux-uclibc/4.2.4/../../../../mipsel-linux-uclibc/sys-include/linux/cpumask.h:150: error: 'cpumask_t' has no member named 'bits'
/home/bog/tomato/tools/brcm/K26/hndtools-mipsel-uclibc-4.2.4/bin/../lib/gcc/mipsel-linux-uclibc/4.2.4/../../../../mipsel-linux-uclibc/sys-include/linux/cpumask.h:150: error: 'cpumask_t' has no member named 'bits'
/home/bog/tomato/tools/brcm/K26/hndtools-mipsel-uclibc-4.2.4/bin/../lib/gcc/mipsel-linux-uclibc/4.2.4/../../../../mipsel-linux-uclibc/sys-include/linux/cpumask.h: In function '__cpus_complement':
/home/bog/tomato/tools/brcm/K26/hndtools-mipsel-uclibc-4.2.4/bin/../lib/gcc/mipsel-linux-uclibc/4.2.4/../../../../mipsel-linux-uclibc/sys-include/linux/cpumask.h:157: error: 'cpumask_t' has no member named 'bits'
/home/bog/tomato/tools/brcm/K26/hndtools-mipsel-uclibc-4.2.4/bin/../lib/gcc/mipsel-linux-uclibc/4.2.4/../../../../mipsel-linux-uclibc/sys-include/linux/cpumask.h:157: error: 'cpumask_t' has no member named 'bits'
/home/bog/tomato/tools/brcm/K26/hndtools-mipsel-uclibc-4.2.4/bin/../lib/gcc/mipsel-linux-uclibc/4.2.4/../../../../mipsel-linux-uclibc/sys-include/linux/cpumask.h: In function '__cpus_equal':
/home/bog/tomato/tools/brcm/K26/hndtools-mipsel-uclibc-4.2.4/bin/../lib/gcc/mipsel-linux-uclibc/4.2.4/../../../../mipsel-linux-uclibc/sys-include/linux/cpumask.h:164: error: 'cpumask_t' has no member named 'bits'
/home/bog/tomato/tools/brcm/K26/hndtools-mipsel-uclibc-4.2.4/bin/../lib/gcc/mipsel-linux-uclibc/4.2.4/../../../../mipsel-linux-uclibc/sys-include/linux/cpumask.h:164: error: 'cpumask_t' has no member named 'bits'
/home/bog/tomato/tools/brcm/K26/hndtools-mipsel-uclibc-4.2.4/bin/../lib/gcc/mipsel-linux-uclibc/4.2.4/../../../../mipsel-linux-uclibc/sys-include/linux/cpumask.h: In function '__cpus_intersects':
/home/bog/tomato/tools/brcm/K26/hndtools-mipsel-uclibc-4.2.4/bin/../lib/gcc/mipsel-linux-uclibc/4.2.4/../../../../mipsel-linux-uclibc/sys-include/linux/cpumask.h:171: error: 'cpumask_t' has no member named 'bits'
/home/bog/tomato/tools/brcm/K26/hndtools-mipsel-uclibc-4.2.4/bin/../lib/gcc/mipsel-linux-uclibc/4.2.4/../../../../mipsel-linux-uclibc/sys-include/linux/cpumask.h:171: error: 'cpumask_t' has no member named 'bits'
/home/bog/tomato/tools/brcm/K26/hndtools-mipsel-uclibc-4.2.4/bin/../lib/gcc/mipsel-linux-uclibc/4.2.4/../../../../mipsel-linux-uclibc/sys-include/linux/cpumask.h: In function '__cpus_subset':
/home/bog/tomato/tools/brcm/K26/hndtools-mipsel-uclibc-4.2.4/bin/../lib/gcc/mipsel-linux-uclibc/4.2.4/../../../../mipsel-linux-uclibc/sys-include/linux/cpumask.h:178: error: 'cpumask_t' has no member named 'bits'
/home/bog/tomato/tools/brcm/K26/hndtools-mipsel-uclibc-4.2.4/bin/../lib/gcc/mipsel-linux-uclibc/4.2.4/../../../../mipsel-linux-uclibc/sys-include/linux/cpumask.h:178: error: 'cpumask_t' has no member named 'bits'
/home/bog/tomato/tools/brcm/K26/hndtools-mipsel-uclibc-4.2.4/bin/../lib/gcc/mipsel-linux-uclibc/4.2.4/../../../../mipsel-linux-uclibc/sys-include/linux/cpumask.h: In function '__cpus_empty':
/home/bog/tomato/tools/brcm/K26/hndtools-mipsel-uclibc-4.2.4/bin/../lib/gcc/mipsel-linux-uclibc/4.2.4/../../../../mipsel-linux-uclibc/sys-include/linux/cpumask.h:184: error: 'cpumask_t' has no member named 'bits'
/home/bog/tomato/tools/brcm/K26/hndtools-mipsel-uclibc-4.2.4/bin/../lib/gcc/mipsel-linux-uclibc/4.2.4/../../../../mipsel-linux-uclibc/sys-include/linux/cpumask.h: In function '__cpus_full':
/home/bog/tomato/tools/brcm/K26/hndtools-mipsel-uclibc-4.2.4/bin/../lib/gcc/mipsel-linux-uclibc/4.2.4/../../../../mipsel-linux-uclibc/sys-include/linux/cpumask.h:190: error: 'cpumask_t' has no member named 'bits'
/home/bog/tomato/tools/brcm/K26/hndtools-mipsel-uclibc-4.2.4/bin/../lib/gcc/mipsel-linux-uclibc/4.2.4/../../../../mipsel-linux-uclibc/sys-include/linux/cpumask.h: In function '__cpus_weight':
/home/bog/tomato/tools/brcm/K26/hndtools-mipsel-uclibc-4.2.4/bin/../lib/gcc/mipsel-linux-uclibc/4.2.4/../../../../mipsel-linux-uclibc/sys-include/linux/cpumask.h:196: error: 'cpumask_t' has no member named 'bits'
/home/bog/tomato/tools/brcm/K26/hndtools-mipsel-uclibc-4.2.4/bin/../lib/gcc/mipsel-linux-uclibc/4.2.4/../../../../mipsel-linux-uclibc/sys-include/linux/cpumask.h: In function '__cpus_shift_right':
/home/bog/tomato/tools/brcm/K26/hndtools-mipsel-uclibc-4.2.4/bin/../lib/gcc/mipsel-linux-uclibc/4.2.4/../../../../mipsel-linux-uclibc/sys-include/linux/cpumask.h:204: error: 'cpumask_t' has no member named 'bits'
/home/bog/tomato/tools/brcm/K26/hndtools-mipsel-uclibc-4.2.4/bin/../lib/gcc/mipsel-linux-uclibc/4.2.4/../../../../mipsel-linux-uclibc/sys-include/linux/cpumask.h:204: error: 'cpumask_t' has no member named 'bits'
/home/bog/tomato/tools/brcm/K26/hndtools-mipsel-uclibc-4.2.4/bin/../lib/gcc/mipsel-linux-uclibc/4.2.4/../../../../mipsel-linux-uclibc/sys-include/linux/cpumask.h: In function '__cpus_shift_left':
/home/bog/tomato/tools/brcm/K26/hndtools-mipsel-uclibc-4.2.4/bin/../lib/gcc/mipsel-linux-uclibc/4.2.4/../../../../mipsel-linux-uclibc/sys-include/linux/cpumask.h:212: error: 'cpumask_t' has no member named 'bits'
/home/bog/tomato/tools/brcm/K26/hndtools-mipsel-uclibc-4.2.4/bin/../lib/gcc/mipsel-linux-uclibc/4.2.4/../../../../mipsel-linux-uclibc/sys-include/linux/cpumask.h:212: error: 'cpumask_t' has no member named 'bits'
/home/bog/tomato/tools/brcm/K26/hndtools-mipsel-uclibc-4.2.4/bin/../lib/gcc/mipsel-linux-uclibc/4.2.4/../../../../mipsel-linux-uclibc/sys-include/linux/cpumask.h: In function '__cpumask_scnprintf':
/home/bog/tomato/tools/brcm/K26/hndtools-mipsel-uclibc-4.2.4/bin/../lib/gcc/mipsel-linux-uclibc/4.2.4/../../../../mipsel-linux-uclibc/sys-include/linux/cpumask.h:273: error: 'cpumask_t' has no member named 'bits'
/home/bog/tomato/tools/brcm/K26/hndtools-mipsel-uclibc-4.2.4/bin/../lib/gcc/mipsel-linux-uclibc/4.2.4/../../../../mipsel-linux-uclibc/sys-include/linux/cpumask.h: In function '__cpumask_parse_user':
/home/bog/tomato/tools/brcm/K26/hndtools-mipsel-uclibc-4.2.4/bin/../lib/gcc/mipsel-linux-uclibc/4.2.4/../../../../mipsel-linux-uclibc/sys-include/linux/cpumask.h:281: error: 'cpumask_t' has no member named 'bits'
/home/bog/tomato/tools/brcm/K26/hndtools-mipsel-uclibc-4.2.4/bin/../lib/gcc/mipsel-linux-uclibc/4.2.4/../../../../mipsel-linux-uclibc/sys-include/linux/cpumask.h: In function '__cpulist_scnprintf':
/home/bog/tomato/tools/brcm/K26/hndtools-mipsel-uclibc-4.2.4/bin/../lib/gcc/mipsel-linux-uclibc/4.2.4/../../../../mipsel-linux-uclibc/sys-include/linux/cpumask.h:289: error: 'cpumask_t' has no member named 'bits'
/home/bog/tomato/tools/brcm/K26/hndtools-mipsel-uclibc-4.2.4/bin/../lib/gcc/mipsel-linux-uclibc/4.2.4/../../../../mipsel-linux-uclibc/sys-include/linux/cpumask.h: In function '__cpulist_parse':
/home/bog/tomato/tools/brcm/K26/hndtools-mipsel-uclibc-4.2.4/bin/../lib/gcc/mipsel-linux-uclibc/4.2.4/../../../../mipsel-linux-uclibc/sys-include/linux/cpumask.h:295: error: 'cpumask_t' has no member named 'bits'
/home/bog/tomato/tools/brcm/K26/hndtools-mipsel-uclibc-4.2.4/bin/../lib/gcc/mipsel-linux-uclibc/4.2.4/../../../../mipsel-linux-uclibc/sys-include/linux/cpumask.h: In function '__cpu_remap':
/home/bog/tomato/tools/brcm/K26/hndtools-mipsel-uclibc-4.2.4/bin/../lib/gcc/mipsel-linux-uclibc/4.2.4/../../../../mipsel-linux-uclibc/sys-include/linux/cpumask.h:303: error: 'cpumask_t' has no member named 'bits'
/home/bog/tomato/tools/brcm/K26/hndtools-mipsel-uclibc-4.2.4/bin/../lib/gcc/mipsel-linux-uclibc/4.2.4/../../../../mipsel-linux-uclibc/sys-include/linux/cpumask.h:303: error: 'cpumask_t' has no member named 'bits'
/home/bog/tomato/tools/brcm/K26/hndtools-mipsel-uclibc-4.2.4/bin/../lib/gcc/mipsel-linux-uclibc/4.2.4/../../../../mipsel-linux-uclibc/sys-include/linux/cpumask.h: In function '__cpus_remap':
/home/bog/tomato/tools/brcm/K26/hndtools-mipsel-uclibc-4.2.4/bin/../lib/gcc/mipsel-linux-uclibc/4.2.4/../../../../mipsel-linux-uclibc/sys-include/linux/cpumask.h:311: error: 'cpumask_t' has no member named 'bits'
/home/bog/tomato/tools/brcm/K26/hndtools-mipsel-uclibc-4.2.4/bin/../lib/gcc/mipsel-linux-uclibc/4.2.4/../../../../mipsel-linux-uclibc/sys-include/linux/cpumask.h:311: error: 'cpumask_t' has no member named 'bits'
/home/bog/tomato/tools/brcm/K26/hndtools-mipsel-uclibc-4.2.4/bin/../lib/gcc/mipsel-linux-uclibc/4.2.4/../../../../mipsel-linux-uclibc/sys-include/linux/cpumask.h:311: error: 'cpumask_t' has no member named 'bits'
/home/bog/tomato/tools/brcm/K26/hndtools-mipsel-uclibc-4.2.4/bin/../lib/gcc/mipsel-linux-uclibc/4.2.4/../../../../mipsel-linux-uclibc/sys-include/linux/cpumask.h:311: error: 'cpumask_t' has no member named 'bits'
In file included from /home/bog/tomato/tools/brcm/K26/hndtools-mipsel-uclibc-4.2.4/bin/../lib/gcc/mipsel-linux-uclibc/4.2.4/../../../../mipsel-linux-uclibc/sys-include/asm/local.h:4,
                 from /home/bog/tomato/tools/brcm/K26/hndtools-mipsel-uclibc-4.2.4/bin/../lib/gcc/mipsel-linux-uclibc/4.2.4/../../../../mipsel-linux-uclibc/sys-include/linux/module.h:19,
                 from /home/bog/tomato/tools/brcm/K26/hndtools-mipsel-uclibc-4.2.4/bin/../lib/gcc/mipsel-linux-uclibc/4.2.4/../../../../mipsel-linux-uclibc/sys-include/linux/mtd/mtd.h:13,
                 from mtd.c:52:
/home/bog/tomato/tools/brcm/K26/hndtools-mipsel-uclibc-4.2.4/bin/../lib/gcc/mipsel-linux-uclibc/4.2.4/../../../../mipsel-linux-uclibc/sys-include/linux/percpu.h: At top level:
/home/bog/tomato/tools/brcm/K26/hndtools-mipsel-uclibc-4.2.4/bin/../lib/gcc/mipsel-linux-uclibc/4.2.4/../../../../mipsel-linux-uclibc/sys-include/linux/percpu.h:72: error: expected declaration specifiers or '...' before 'gfp_t'
/home/bog/tomato/tools/brcm/K26/hndtools-mipsel-uclibc-4.2.4/bin/../lib/gcc/mipsel-linux-uclibc/4.2.4/../../../../mipsel-linux-uclibc/sys-include/linux/percpu.h:78: error: expected declaration specifiers or '...' before 'gfp_t'
/home/bog/tomato/tools/brcm/K26/hndtools-mipsel-uclibc-4.2.4/bin/../lib/gcc/mipsel-linux-uclibc/4.2.4/../../../../mipsel-linux-uclibc/sys-include/linux/percpu.h:84: error: expected declaration specifiers or '...' before 'gfp_t'
/home/bog/tomato/tools/brcm/K26/hndtools-mipsel-uclibc-4.2.4/bin/../lib/gcc/mipsel-linux-uclibc/4.2.4/../../../../mipsel-linux-uclibc/sys-include/linux/percpu.h: In function '__percpu_alloc_mask':
/home/bog/tomato/tools/brcm/K26/hndtools-mipsel-uclibc-4.2.4/bin/../lib/gcc/mipsel-linux-uclibc/4.2.4/../../../../mipsel-linux-uclibc/sys-include/linux/percpu.h:86: error: 'gfp' undeclared (first use in this function)
In file included from /home/bog/tomato/tools/brcm/K26/hndtools-mipsel-uclibc-4.2.4/bin/../lib/gcc/mipsel-linux-uclibc/4.2.4/../../../../mipsel-linux-uclibc/sys-include/asm/module.h:5,
                 from /home/bog/tomato/tools/brcm/K26/hndtools-mipsel-uclibc-4.2.4/bin/../lib/gcc/mipsel-linux-uclibc/4.2.4/../../../../mipsel-linux-uclibc/sys-include/linux/module.h:21,
                 from /home/bog/tomato/tools/brcm/K26/hndtools-mipsel-uclibc-4.2.4/bin/../lib/gcc/mipsel-linux-uclibc/4.2.4/../../../../mipsel-linux-uclibc/sys-include/linux/mtd/mtd.h:13,
                 from mtd.c:52:
/home/bog/tomato/tools/brcm/K26/hndtools-mipsel-uclibc-4.2.4/bin/../lib/gcc/mipsel-linux-uclibc/4.2.4/../../../../mipsel-linux-uclibc/sys-include/asm/uaccess.h: In function '__clear_user':
/home/bog/tomato/tools/brcm/K26/hndtools-mipsel-uclibc-4.2.4/bin/../lib/gcc/mipsel-linux-uclibc/4.2.4/../../../../mipsel-linux-uclibc/sys-include/asm/uaccess.h:660: error: expected string literal before '__UA_t0'
/home/bog/tomato/tools/brcm/K26/hndtools-mipsel-uclibc-4.2.4/bin/../lib/gcc/mipsel-linux-uclibc/4.2.4/../../../../mipsel-linux-uclibc/sys-include/asm/uaccess.h: In function '__strncpy_from_user':
/home/bog/tomato/tools/brcm/K26/hndtools-mipsel-uclibc-4.2.4/bin/../lib/gcc/mipsel-linux-uclibc/4.2.4/../../../../mipsel-linux-uclibc/sys-include/asm/uaccess.h:709: error: expected string literal before '__UA_t0'
/home/bog/tomato/tools/brcm/K26/hndtools-mipsel-uclibc-4.2.4/bin/../lib/gcc/mipsel-linux-uclibc/4.2.4/../../../../mipsel-linux-uclibc/sys-include/asm/uaccess.h: In function 'strncpy_from_user':
/home/bog/tomato/tools/brcm/K26/hndtools-mipsel-uclibc-4.2.4/bin/../lib/gcc/mipsel-linux-uclibc/4.2.4/../../../../mipsel-linux-uclibc/sys-include/asm/uaccess.h:746: error: expected string literal before '__UA_t0'
/home/bog/tomato/tools/brcm/K26/hndtools-mipsel-uclibc-4.2.4/bin/../lib/gcc/mipsel-linux-uclibc/4.2.4/../../../../mipsel-linux-uclibc/sys-include/asm/uaccess.h: In function '__strlen_user':
/home/bog/tomato/tools/brcm/K26/hndtools-mipsel-uclibc-4.2.4/bin/../lib/gcc/mipsel-linux-uclibc/4.2.4/../../../../mipsel-linux-uclibc/sys-include/asm/uaccess.h:763: error: expected string literal before '__UA_t0'
/home/bog/tomato/tools/brcm/K26/hndtools-mipsel-uclibc-4.2.4/bin/../lib/gcc/mipsel-linux-uclibc/4.2.4/../../../../mipsel-linux-uclibc/sys-include/asm/uaccess.h: In function 'strlen_user':
/home/bog/tomato/tools/brcm/K26/hndtools-mipsel-uclibc-4.2.4/bin/../lib/gcc/mipsel-linux-uclibc/4.2.4/../../../../mipsel-linux-uclibc/sys-include/asm/uaccess.h:793: error: expected string literal before '__UA_t0'
/home/bog/tomato/tools/brcm/K26/hndtools-mipsel-uclibc-4.2.4/bin/../lib/gcc/mipsel-linux-uclibc/4.2.4/../../../../mipsel-linux-uclibc/sys-include/asm/uaccess.h: In function '__strnlen_user':
/home/bog/tomato/tools/brcm/K26/hndtools-mipsel-uclibc-4.2.4/bin/../lib/gcc/mipsel-linux-uclibc/4.2.4/../../../../mipsel-linux-uclibc/sys-include/asm/uaccess.h:811: error: expected string literal before '__UA_t0'
/home/bog/tomato/tools/brcm/K26/hndtools-mipsel-uclibc-4.2.4/bin/../lib/gcc/mipsel-linux-uclibc/4.2.4/../../../../mipsel-linux-uclibc/sys-include/asm/uaccess.h: In function 'strnlen_user':
/home/bog/tomato/tools/brcm/K26/hndtools-mipsel-uclibc-4.2.4/bin/../lib/gcc/mipsel-linux-uclibc/4.2.4/../../../../mipsel-linux-uclibc/sys-include/asm/uaccess.h:842: error: expected string literal before '__UA_t0'
In file included from /home/bog/tomato/tools/brcm/K26/hndtools-mipsel-uclibc-4.2.4/bin/../lib/gcc/mipsel-linux-uclibc/4.2.4/../../../../mipsel-linux-uclibc/sys-include/linux/module.h:21,
                 from /home/bog/tomato/tools/brcm/K26/hndtools-mipsel-uclibc-4.2.4/bin/../lib/gcc/mipsel-linux-uclibc/4.2.4/../../../../mipsel-linux-uclibc/sys-include/linux/mtd/mtd.h:13,
                 from mtd.c:52:
/home/bog/tomato/tools/brcm/K26/hndtools-mipsel-uclibc-4.2.4/bin/../lib/gcc/mipsel-linux-uclibc/4.2.4/../../../../mipsel-linux-uclibc/sys-include/asm/module.h: At top level:
/home/bog/tomato/tools/brcm/K26/hndtools-mipsel-uclibc-4.2.4/bin/../lib/gcc/mipsel-linux-uclibc/4.2.4/../../../../mipsel-linux-uclibc/sys-include/asm/module.h:9: error: field 'dbe_list' has incomplete type
In file included from /home/bog/tomato/tools/brcm/K26/hndtools-mipsel-uclibc-4.2.4/bin/../lib/gcc/mipsel-linux-uclibc/4.2.4/../../../../mipsel-linux-uclibc/sys-include/linux/module.h:21,
                 from /home/bog/tomato/tools/brcm/K26/hndtools-mipsel-uclibc-4.2.4/bin/../lib/gcc/mipsel-linux-uclibc/4.2.4/../../../../mipsel-linux-uclibc/sys-include/linux/mtd/mtd.h:13,
                 from mtd.c:52:
/home/bog/tomato/tools/brcm/K26/hndtools-mipsel-uclibc-4.2.4/bin/../lib/gcc/mipsel-linux-uclibc/4.2.4/../../../../mipsel-linux-uclibc/sys-include/asm/module.h:116:2: error: #error MODULE_PROC_FAMILY undefined for your processor configuration
In file included from /home/bog/tomato/tools/brcm/K26/hndtools-mipsel-uclibc-4.2.4/bin/../lib/gcc/mipsel-linux-uclibc/4.2.4/../../../../mipsel-linux-uclibc/sys-include/linux/mtd/mtd.h:13,
                 from mtd.c:52:
/home/bog/tomato/tools/brcm/K26/hndtools-mipsel-uclibc-4.2.4/bin/../lib/gcc/mipsel-linux-uclibc/4.2.4/../../../../mipsel-linux-uclibc/sys-include/linux/module.h:48: error: field 'attr' has incomplete type
/home/bog/tomato/tools/brcm/K26/hndtools-mipsel-uclibc-4.2.4/bin/../lib/gcc/mipsel-linux-uclibc/4.2.4/../../../../mipsel-linux-uclibc/sys-include/linux/module.h:59: error: field 'kobj' has incomplete type
In file included from /home/bog/tomato/tools/brcm/K26/hndtools-mipsel-uclibc-4.2.4/bin/../lib/gcc/mipsel-linux-uclibc/4.2.4/../../../../mipsel-linux-uclibc/sys-include/linux/mtd/mtd.h:14,
                 from mtd.c:52:
/home/bog/tomato/tools/brcm/K26/hndtools-mipsel-uclibc-4.2.4/bin/../lib/gcc/mipsel-linux-uclibc/4.2.4/../../../../mipsel-linux-uclibc/sys-include/linux/uio.h:21: error: redefinition of 'struct iovec'
In file included from /home/bog/tomato/tools/brcm/K26/hndtools-mipsel-uclibc-4.2.4/bin/../lib/gcc/mipsel-linux-uclibc/4.2.4/../../../../mipsel-linux-uclibc/sys-include/linux/notifier.h:13,
                 from /home/bog/tomato/tools/brcm/K26/hndtools-mipsel-uclibc-4.2.4/bin/../lib/gcc/mipsel-linux-uclibc/4.2.4/../../../../mipsel-linux-uclibc/sys-include/linux/mtd/mtd.h:15,
                 from mtd.c:52:
/home/bog/tomato/tools/brcm/K26/hndtools-mipsel-uclibc-4.2.4/bin/../lib/gcc/mipsel-linux-uclibc/4.2.4/../../../../mipsel-linux-uclibc/sys-include/linux/mutex.h:51: error: field 'wait_list' has incomplete type
/home/bog/tomato/tools/brcm/K26/hndtools-mipsel-uclibc-4.2.4/bin/../lib/gcc/mipsel-linux-uclibc/4.2.4/../../../../mipsel-linux-uclibc/sys-include/linux/mutex.h:67: error: field 'list' has incomplete type
/home/bog/tomato/tools/brcm/K26/hndtools-mipsel-uclibc-4.2.4/bin/../lib/gcc/mipsel-linux-uclibc/4.2.4/../../../../mipsel-linux-uclibc/sys-include/linux/mutex.h:124: error: expected '=', ',', ';', 'asm' or '__attribute__' before 'mutex_lock_interruptible'
In file included from /home/bog/tomato/tools/brcm/K26/hndtools-mipsel-uclibc-4.2.4/bin/../lib/gcc/mipsel-linux-uclibc/4.2.4/../../../../mipsel-linux-uclibc/sys-include/linux/mtd/mtd.h:15,
                 from mtd.c:52:
/home/bog/tomato/tools/brcm/K26/hndtools-mipsel-uclibc-4.2.4/bin/../lib/gcc/mipsel-linux-uclibc/4.2.4/../../../../mipsel-linux-uclibc/sys-include/linux/notifier.h:62: error: field 'rwsem' has incomplete type
In file included from mtd.c:52:
/home/bog/tomato/tools/brcm/K26/hndtools-mipsel-uclibc-4.2.4/bin/../lib/gcc/mipsel-linux-uclibc/4.2.4/../../../../mipsel-linux-uclibc/sys-include/linux/mtd/mtd.h:18:25: error: mtd/mtd-abi.h: No such file or directory
In file included from mtd.c:52:
/home/bog/tomato/tools/brcm/K26/hndtools-mipsel-uclibc-4.2.4/bin/../lib/gcc/mipsel-linux-uclibc/4.2.4/../../../../mipsel-linux-uclibc/sys-include/linux/mtd/mtd.h:189: error: field 'ecc_stats' has incomplete type
/home/bog/tomato/tools/brcm/K26/hndtools-mipsel-uclibc-4.2.4/bin/../lib/gcc/mipsel-linux-uclibc/4.2.4/../../../../mipsel-linux-uclibc/sys-include/linux/mtd/mtd.h:221: error: field 'list' has incomplete type
mtd.c: In function 'crc_calc':
mtd.c:108: warning: value computed is not used
mtd.c: In function '_unlock_erase':
mtd.c:160: error: 'mtd_info_t' undeclared (first use in this function)
mtd.c:160: error: expected ';' before 'mi'
mtd.c:161: error: 'erase_info_t' undeclared (first use in this function)
mtd.c:161: error: expected ';' before 'ei'
mtd.c:170: error: 'MEMGETINFO' undeclared (first use in this function)
mtd.c:170: error: 'mi' undeclared (first use in this function)
mtd.c:173: error: 'ei' undeclared (first use in this function)
mtd.c:178: error: 'MEMUNLOCK' undeclared (first use in this function)
mtd.c:184: error: 'MEMERASE' undeclared (first use in this function)
mtd.c: In function 'mtd_write_main':
mtd.c:260: error: 'mtd_info_t' undeclared (first use in this function)
mtd.c:260: error: expected ';' before 'mi'
mtd.c:261: error: 'erase_info_t' undeclared (first use in this function)
mtd.c:261: error: expected ';' before 'ei'
mtd.c:381: error: 'MEMGETINFO' undeclared (first use in this function)
mtd.c:381: error: 'mi' undeclared (first use in this function)
mtd.c:396: error: 'ei' undeclared (first use in this function)
mtd.c:465: error: 'MEMUNLOCK' undeclared (first use in this function)
mtd.c:466: error: 'MEMERASE' undeclared (first use in this function)
make[4]: *** [mtd.o] Error 1
make[4]: Leaving directory `/home/bog/tomato/release/src/router/rc'
make[3]: *** [rc] Error 2
make[3]: Leaving directory `/home/bog/tomato/release/src/router'
make[2]: *** [all] Error 2
make[2]: Leaving directory `/home/bog/tomato/release/src'
make[1]: *** [a] Error 2
make[1]: Leaving directory `/home/bog/tomato/release/src'
make: *** [all] Error 2
cp: cannot stat `release/image/code.bin': No such file or directory
bog@debian:~/tomato$