All pastes #1788623 Raw Edit

config.log

public text v1 · immutable
#1788623 ·published 2010-02-07 01:23 UTC
rendered paste body
This file contains any messages produced by compilers while
running configure, to aid debugging if configure makes a mistake.

It was created by lzop configure 1.01, which was
generated by GNU Autoconf 2.57.  Invocation command line was

  $ ./configure 

## --------- ##
## Platform. ##
## --------- ##

hostname = neo
uname -m = x86_64
uname -r = 2.6.29.6
uname -s = Linux
uname -v = #2 SMP Mon Aug 17 11:58:18 CDT 2009

/usr/bin/uname -p = Intel(R) Core(TM)2 Duo CPU     E4500  @ 2.20GHz
/bin/uname -X     = unknown

/bin/arch              = x86_64
/usr/bin/arch -k       = unknown
/usr/convex/getsysinfo = unknown
hostinfo               = unknown
/bin/machine           = unknown
/usr/bin/oslevel       = unknown
/bin/universe          = unknown

PATH: /usr/local/sbin
PATH: /usr/sbin
PATH: /sbin
PATH: /usr/local/bin
PATH: /usr/bin
PATH: /bin
PATH: /usr/games


## ----------- ##
## Core tests. ##
## ----------- ##

configure:1323: checking build system type
configure:1341: result: x86_64-unknown-linux-gnu
configure:1349: checking host system type
configure:1363: result: x86_64-unknown-linux-gnu
configure:1371: checking target system type
configure:1385: result: x86_64-unknown-linux-gnu
configure:1399: checking whether to enable maintainer-specific portions of Makefiles
configure:1408: result: no
configure:1487: checking for gcc
configure:1503: found /usr/bin/gcc
configure:1513: result: gcc
configure:1757: checking for C compiler version
configure:1760: gcc --version </dev/null >&5
gcc (GCC) 4.3.3
Copyright (C) 2008 Free Software Foundation, Inc.
This is free software; see the source for copying conditions.  There is NO
warranty; not even for MERCHANTABILITY or FITNESS FOR A PARTICULAR PURPOSE.

configure:1763: $? = 0
configure:1765: gcc -v </dev/null >&5
Reading specs from /usr/lib64/gcc/x86_64-slackware-linux/4.3.3/specs
Target: x86_64-slackware-linux
Configured with: ../gcc-4.3.3/configure --prefix=/usr --libdir=/usr/lib64 --enable-shared --enable-bootstrap --enable-languages=ada,c,c++,fortran,java,objc --enable-threads=posix --enable-checking=release --with-system-zlib --disable-libunwind-exceptions --enable-__cxa_atexit --enable-libssp --with-gnu-ld --verbose --disable-multilib --target=x86_64-slackware-linux --build=x86_64-slackware-linux --host=x86_64-slackware-linux
Thread model: posix
gcc version 4.3.3 (GCC) 
configure:1768: $? = 0
configure:1770: gcc -V </dev/null >&5
gcc: '-V' option must have argument
configure:1773: $? = 1
configure:1797: checking for C compiler default output
configure:1800: gcc  -I /root/lzo-2.03/include/lzo -L /root/lzo-2.03/src conftest.c  >&5
configure:1803: $? = 0
configure:1849: result: a.out
configure:1854: checking whether the C compiler works
configure:1860: ./a.out
configure:1863: $? = 0
configure:1880: result: yes
configure:1887: checking whether we are cross compiling
configure:1889: result: no
configure:1892: checking for suffix of executables
configure:1894: gcc -o conftest  -I /root/lzo-2.03/include/lzo -L /root/lzo-2.03/src conftest.c  >&5
configure:1897: $? = 0
configure:1922: result: 
configure:1928: checking for suffix of object files
configure:1950: gcc -c  -I /root/lzo-2.03/include/lzo conftest.c >&5
configure:1953: $? = 0
configure:1975: result: o
configure:1979: checking whether we are using the GNU C compiler
configure:2004: gcc -c  -I /root/lzo-2.03/include/lzo conftest.c >&5
configure:2007: $? = 0
configure:2010: test -s conftest.o
configure:2013: $? = 0
configure:2026: result: yes
configure:2032: checking whether gcc accepts -g
configure:2054: gcc -c -g -I /root/lzo-2.03/include/lzo conftest.c >&5
configure:2057: $? = 0
configure:2060: test -s conftest.o
configure:2063: $? = 0
configure:2074: result: yes
configure:2091: checking for gcc option to accept ANSI C
configure:2152: gcc  -c -g -O2 -I /root/lzo-2.03/include/lzo conftest.c >&5
configure:2155: $? = 0
configure:2158: test -s conftest.o
configure:2161: $? = 0
configure:2179: result: none needed
configure:2197: gcc -c -g -O2 -I /root/lzo-2.03/include/lzo conftest.c >&5
conftest.c:2: error: expected '=', ',', ';', 'asm' or '__attribute__' before 'me'
configure:2200: $? = 1
configure: failed program was:
| #ifndef __cplusplus
|   choke me
| #endif
configure:2315: checking how to run the C preprocessor
configure:2351: gcc -E -I /root/lzo-2.03/include/lzo conftest.c
configure:2357: $? = 0
configure:2389: gcc -E -I /root/lzo-2.03/include/lzo conftest.c
configure:2389:28: error: ac_nonexistent.h: No such file or directory
configure:2395: $? = 1
configure: failed program was:
| #line 2380 "configure"
| /* confdefs.h.  */
| 
| #define PACKAGE_NAME "lzop"
| #define PACKAGE_TARNAME "lzop"
| #define PACKAGE_VERSION "1.01"
| #define PACKAGE_STRING "lzop 1.01"
| #define PACKAGE_BUGREPORT "lzop-bugs@oberhumer.com"
| #define LZOP_ENABLE_ANSI 1
| /* end confdefs.h.  */
| #include <ac_nonexistent.h>
configure:2433: result: gcc -E
configure:2458: gcc -E -I /root/lzo-2.03/include/lzo conftest.c
configure:2464: $? = 0
configure:2496: gcc -E -I /root/lzo-2.03/include/lzo conftest.c
configure:2496:28: error: ac_nonexistent.h: No such file or directory
configure:2502: $? = 1
configure: failed program was:
| #line 2487 "configure"
| /* confdefs.h.  */
| 
| #define PACKAGE_NAME "lzop"
| #define PACKAGE_TARNAME "lzop"
| #define PACKAGE_VERSION "1.01"
| #define PACKAGE_STRING "lzop 1.01"
| #define PACKAGE_BUGREPORT "lzop-bugs@oberhumer.com"
| #define LZOP_ENABLE_ANSI 1
| /* end confdefs.h.  */
| #include <ac_nonexistent.h>
configure:2545: checking for an ANSI C-conforming const
configure:2613: gcc -c -g -O2 -I /root/lzo-2.03/include/lzo conftest.c >&5
configure:2616: $? = 0
configure:2619: test -s conftest.o
configure:2622: $? = 0
configure:2633: result: yes
configure:2643: checking whether byte ordering is bigendian
configure:2671: gcc -c -g -O2 -I /root/lzo-2.03/include/lzo conftest.c >&5
configure:2674: $? = 0
configure:2677: test -s conftest.o
configure:2680: $? = 0
configure:2705: gcc -c -g -O2 -I /root/lzo-2.03/include/lzo conftest.c >&5
configure: In function 'main':
configure:2699: error: 'not' undeclared (first use in this function)
configure:2699: error: (Each undeclared identifier is reported only once
configure:2699: error: for each function it appears in.)
configure:2699: error: expected ';' before 'big'
configure:2708: $? = 1
configure: failed program was:
| #line 2683 "configure"
| /* confdefs.h.  */
| 
| #define PACKAGE_NAME "lzop"
| #define PACKAGE_TARNAME "lzop"
| #define PACKAGE_VERSION "1.01"
| #define PACKAGE_STRING "lzop 1.01"
| #define PACKAGE_BUGREPORT "lzop-bugs@oberhumer.com"
| #define LZOP_ENABLE_ANSI 1
| /* end confdefs.h.  */
| #include <sys/types.h>
| #include <sys/param.h>
| 
| int
| main ()
| {
| #if BYTE_ORDER != BIG_ENDIAN
|  not big endian
| #endif
| 
|   ;
|   return 0;
| }
configure:2828: result: no
configure:2857: checking for special C compiler options needed for large files
configure:2937: result: no
configure:2943: checking for _FILE_OFFSET_BITS value needed for large files
configure:2975: gcc -c -g -O2 -I /root/lzo-2.03/include/lzo conftest.c >&5
configure:2978: $? = 0
configure:2981: test -s conftest.o
configure:2984: $? = 0
configure:3040: result: no
configure:3050: checking for _LARGE_FILES value needed for large files
configure:3082: gcc -c -g -O2 -I /root/lzo-2.03/include/lzo conftest.c >&5
configure:3085: $? = 0
configure:3088: test -s conftest.o
configure:3091: $? = 0
configure:3147: result: no
configure:3173: checking for a BSD-compatible install
configure:3227: result: /usr/bin/ginstall -c
configure:3238: checking whether build environment is sane
configure:3281: result: yes
configure:3314: checking for gawk
configure:3330: found /usr/bin/gawk
configure:3340: result: gawk
configure:3350: checking whether make sets $(MAKE)
configure:3370: result: yes
configure:3399: checking for style of include used by make
configure:3427: result: GNU
configure:3599: checking dependency style of gcc
configure:3667: result: gcc3
configure:3694: checking for egrep
configure:3704: result: grep -E
configure:3709: checking for ANSI C header files
configure:3735: gcc -c -g -O2 -I /root/lzo-2.03/include/lzo conftest.c >&5
configure:3738: $? = 0
configure:3741: test -s conftest.o
configure:3744: $? = 0
configure:3836: gcc -o conftest -g -O2 -I /root/lzo-2.03/include/lzo -L /root/lzo-2.03/src conftest.c  >&5
configure: In function 'main':
configure:3833: warning: incompatible implicit declaration of built-in function 'exit'
configure:3839: $? = 0
configure:3841: ./conftest
configure:3844: $? = 0
configure:3859: result: yes
configure:3883: checking for sys/types.h
configure:3900: gcc -c -g -O2 -I /root/lzo-2.03/include/lzo conftest.c >&5
configure:3903: $? = 0
configure:3906: test -s conftest.o
configure:3909: $? = 0
configure:3920: result: yes
configure:3883: checking for sys/stat.h
configure:3900: gcc -c -g -O2 -I /root/lzo-2.03/include/lzo conftest.c >&5
configure:3903: $? = 0
configure:3906: test -s conftest.o
configure:3909: $? = 0
configure:3920: result: yes
configure:3883: checking for stdlib.h
configure:3900: gcc -c -g -O2 -I /root/lzo-2.03/include/lzo conftest.c >&5
configure:3903: $? = 0
configure:3906: test -s conftest.o
configure:3909: $? = 0
configure:3920: result: yes
configure:3883: checking for string.h
configure:3900: gcc -c -g -O2 -I /root/lzo-2.03/include/lzo conftest.c >&5
configure:3903: $? = 0
configure:3906: test -s conftest.o
configure:3909: $? = 0
configure:3920: result: yes
configure:3883: checking for memory.h
configure:3900: gcc -c -g -O2 -I /root/lzo-2.03/include/lzo conftest.c >&5
configure:3903: $? = 0
configure:3906: test -s conftest.o
configure:3909: $? = 0
configure:3920: result: yes
configure:3883: checking for strings.h
configure:3900: gcc -c -g -O2 -I /root/lzo-2.03/include/lzo conftest.c >&5
configure:3903: $? = 0
configure:3906: test -s conftest.o
configure:3909: $? = 0
configure:3920: result: yes
configure:3883: checking for inttypes.h
configure:3900: gcc -c -g -O2 -I /root/lzo-2.03/include/lzo conftest.c >&5
configure:3903: $? = 0
configure:3906: test -s conftest.o
configure:3909: $? = 0
configure:3920: result: yes
configure:3883: checking for stdint.h
configure:3900: gcc -c -g -O2 -I /root/lzo-2.03/include/lzo conftest.c >&5
configure:3903: $? = 0
configure:3906: test -s conftest.o
configure:3909: $? = 0
configure:3920: result: yes
configure:3883: checking for unistd.h
configure:3900: gcc -c -g -O2 -I /root/lzo-2.03/include/lzo conftest.c >&5
configure:3903: $? = 0
configure:3906: test -s conftest.o
configure:3909: $? = 0
configure:3920: result: yes
configure:3947: checking lzoconf.h usability
configure:3960: gcc -c -g -O2 -I /root/lzo-2.03/include/lzo conftest.c >&5
configure:3963: $? = 0
configure:3966: test -s conftest.o
configure:3969: $? = 0
configure:3979: result: yes
configure:3983: checking lzoconf.h presence
configure:3994: gcc -E -I /root/lzo-2.03/include/lzo conftest.c
configure:4000: $? = 0
configure:4019: result: yes
configure:4055: checking for lzoconf.h
configure:4062: result: yes
configure:3947: checking lzo1x.h usability
configure:3960: gcc -c -g -O2 -I /root/lzo-2.03/include/lzo conftest.c >&5
configure:3963: $? = 0
configure:3966: test -s conftest.o
configure:3969: $? = 0
configure:3979: result: yes
configure:3983: checking lzo1x.h presence
configure:3994: gcc -E -I /root/lzo-2.03/include/lzo conftest.c
configure:4000: $? = 0
configure:4019: result: yes
configure:4055: checking for lzo1x.h
configure:4062: result: yes
configure:4081: checking for __lzo_init2 in -llzo
configure:4112: gcc -o conftest -g -O2 -I /root/lzo-2.03/include/lzo -L /root/lzo-2.03/src conftest.c -llzo   >&5
/usr/lib64/gcc/x86_64-slackware-linux/4.3.3/../../../../x86_64-slackware-linux/bin/ld: cannot find -llzo
collect2: ld returned 1 exit status
configure:4115: $? = 1
configure: failed program was:
| #line 4088 "configure"
| /* confdefs.h.  */
| 
| #define PACKAGE_NAME "lzop"
| #define PACKAGE_TARNAME "lzop"
| #define PACKAGE_VERSION "1.01"
| #define PACKAGE_STRING "lzop 1.01"
| #define PACKAGE_BUGREPORT "lzop-bugs@oberhumer.com"
| #define LZOP_ENABLE_ANSI 1
| #define LZOP_BYTE_ORDER 1234
| #define PACKAGE "lzop"
| #define VERSION "1.01"
| #define STDC_HEADERS 1
| #define HAVE_SYS_TYPES_H 1
| #define HAVE_SYS_STAT_H 1
| #define HAVE_STDLIB_H 1
| #define HAVE_STRING_H 1
| #define HAVE_MEMORY_H 1
| #define HAVE_STRINGS_H 1
| #define HAVE_INTTYPES_H 1
| #define HAVE_STDINT_H 1
| #define HAVE_UNISTD_H 1
| #define HAVE_LZOCONF_H 1
| #define HAVE_LZO1X_H 1
| /* end confdefs.h.  */
| 
| /* Override any gcc2 internal prototype to avoid an error.  */
| #ifdef __cplusplus
| extern "C"
| #endif
| /* We use char because int might match the return type of a gcc2
|    builtin and then its argument prototype would still apply.  */
| char __lzo_init2 ();
| int
| main ()
| {
| __lzo_init2 ();
|   ;
|   return 0;
| }
configure:4133: result: no
configure:4143: error: LZO library not found. Please check your installation or set the environment variable `LDFLAGS'.

## ---------------- ##
## Cache variables. ##
## ---------------- ##

ac_cv_build=x86_64-unknown-linux-gnu
ac_cv_build_alias=x86_64-unknown-linux-gnu
ac_cv_c_bigendian=no
ac_cv_c_compiler_gnu=yes
ac_cv_c_const=yes
ac_cv_env_CC_set=
ac_cv_env_CC_value=
ac_cv_env_CFLAGS_set=
ac_cv_env_CFLAGS_value=
ac_cv_env_CPPFLAGS_set=set
ac_cv_env_CPPFLAGS_value='-I /root/lzo-2.03/include/lzo'
ac_cv_env_CPP_set=
ac_cv_env_CPP_value=
ac_cv_env_LDFLAGS_set=set
ac_cv_env_LDFLAGS_value='-L /root/lzo-2.03/src'
ac_cv_env_build_alias_set=
ac_cv_env_build_alias_value=
ac_cv_env_host_alias_set=
ac_cv_env_host_alias_value=
ac_cv_env_target_alias_set=
ac_cv_env_target_alias_value=
ac_cv_exeext=
ac_cv_header_inttypes_h=yes
ac_cv_header_lzo1x_h=yes
ac_cv_header_lzoconf_h=yes
ac_cv_header_memory_h=yes
ac_cv_header_stdc=yes
ac_cv_header_stdint_h=yes
ac_cv_header_stdlib_h=yes
ac_cv_header_string_h=yes
ac_cv_header_strings_h=yes
ac_cv_header_sys_stat_h=yes
ac_cv_header_sys_types_h=yes
ac_cv_header_unistd_h=yes
ac_cv_host=x86_64-unknown-linux-gnu
ac_cv_host_alias=x86_64-unknown-linux-gnu
ac_cv_lib_lzo___lzo_init2=no
ac_cv_objext=o
ac_cv_path_install='/usr/bin/ginstall -c'
ac_cv_prog_AWK=gawk
ac_cv_prog_CPP='gcc -E'
ac_cv_prog_ac_ct_CC=gcc
ac_cv_prog_cc_g=yes
ac_cv_prog_cc_stdc=
ac_cv_prog_egrep='grep -E'
ac_cv_prog_make_make_set=yes
ac_cv_sys_file_offset_bits=no
ac_cv_sys_large_files=no
ac_cv_sys_largefile_CC=no
ac_cv_target=x86_64-unknown-linux-gnu
ac_cv_target_alias=x86_64-unknown-linux-gnu
am_cv_CC_dependencies_compiler_type=gcc3

## ----------------- ##
## Output variables. ##
## ----------------- ##

ACLOCAL='${SHELL} /root/lzop-1.01/acconfig/missing --run aclocal-1.7'
AMDEPBACKSLASH='\'
AMDEP_FALSE='#'
AMDEP_TRUE=''
AMTAR='${SHELL} /root/lzop-1.01/acconfig/missing --run tar'
AUTOCONF='${SHELL} /root/lzop-1.01/acconfig/missing --run autoconf'
AUTOHEADER='${SHELL} /root/lzop-1.01/acconfig/missing --run autoheader'
AUTOMAKE='${SHELL} /root/lzop-1.01/acconfig/missing --run automake-1.7'
AWK='gawk'
CC='gcc'
CCDEPMODE='depmode=gcc3'
CFLAGS='-g -O2'
CPP='gcc -E'
CPPFLAGS='-I /root/lzo-2.03/include/lzo'
CYGPATH_W='echo'
DEFS=''
DEPDIR='.deps'
ECHO_C=''
ECHO_N='-n'
ECHO_T=''
EGREP='grep -E'
EXEEXT=''
INSTALL_DATA='${INSTALL} -m 644'
INSTALL_PROGRAM='${INSTALL}'
INSTALL_SCRIPT='${INSTALL}'
INSTALL_STRIP_PROGRAM='${SHELL} $(install_sh) -c -s'
LDFLAGS='-L /root/lzo-2.03/src'
LIBOBJS=''
LIBS=''
LTLIBOBJS=''
MAINT='#'
MAINTAINER_MODE_FALSE=''
MAINTAINER_MODE_TRUE='#'
MAKEINFO='${SHELL} /root/lzop-1.01/acconfig/missing --run makeinfo'
OBJEXT='o'
PACKAGE='lzop'
PACKAGE_BUGREPORT='lzop-bugs@oberhumer.com'
PACKAGE_NAME='lzop'
PACKAGE_STRING='lzop 1.01'
PACKAGE_TARNAME='lzop'
PACKAGE_VERSION='1.01'
PATH_SEPARATOR=':'
SET_MAKE=''
SHELL='/bin/sh'
STRIP=''
VERSION='1.01'
ac_ct_CC='gcc'
ac_ct_STRIP=''
am__fastdepCC_FALSE='#'
am__fastdepCC_TRUE=''
am__include='include'
am__leading_dot='.'
am__quote=''
bindir='${exec_prefix}/bin'
build='x86_64-unknown-linux-gnu'
build_alias=''
build_cpu='x86_64'
build_os='linux-gnu'
build_vendor='unknown'
datadir='${prefix}/share'
exec_prefix='NONE'
host='x86_64-unknown-linux-gnu'
host_alias=''
host_cpu='x86_64'
host_os='linux-gnu'
host_vendor='unknown'
includedir='${prefix}/include'
infodir='${prefix}/info'
install_sh='/root/lzop-1.01/acconfig/install-sh'
libdir='${exec_prefix}/lib'
libexecdir='${exec_prefix}/libexec'
localstatedir='${prefix}/var'
mandir='${prefix}/man'
oldincludedir='/usr/include'
prefix='NONE'
program_transform_name='s,x,x,'
sbindir='${exec_prefix}/sbin'
sharedstatedir='${prefix}/com'
sysconfdir='${prefix}/etc'
target='x86_64-unknown-linux-gnu'
target_alias=''
target_cpu='x86_64'
target_os='linux-gnu'
target_vendor='unknown'

## ----------- ##
## confdefs.h. ##
## ----------- ##

#define HAVE_INTTYPES_H 1
#define HAVE_LZO1X_H 1
#define HAVE_LZOCONF_H 1
#define HAVE_MEMORY_H 1
#define HAVE_STDINT_H 1
#define HAVE_STDLIB_H 1
#define HAVE_STRINGS_H 1
#define HAVE_STRING_H 1
#define HAVE_SYS_STAT_H 1
#define HAVE_SYS_TYPES_H 1
#define HAVE_UNISTD_H 1
#define LZOP_BYTE_ORDER 1234
#define LZOP_ENABLE_ANSI 1
#define PACKAGE "lzop"
#define PACKAGE_BUGREPORT "lzop-bugs@oberhumer.com"
#define PACKAGE_NAME "lzop"
#define PACKAGE_STRING "lzop 1.01"
#define PACKAGE_TARNAME "lzop"
#define PACKAGE_VERSION "1.01"
#define STDC_HEADERS 1
#define VERSION "1.01"

configure: exit 1