All pastes #17858 Raw Edit

Anonymous

public text v1 · immutable
#17858 ·published 2005-07-16 20:55 UTC
rendered paste body
nvidia-installer log file '/var/log/nvidia-installer.log'
creation time: Sat Jul 16 14:45:45 2005

option status:
  license pre-accepted    : false
  update                  : false
  force update            : false
  expert                  : false
  uninstall               : false
  driver info             : false
  no precompiled interface: false
  no ncurses color        : false
  query latest driver ver : false
  OpenGL header files     : false
  no questions            : false
  silent                  : false
  X install prefix        : /usr/X11R6
  OpenGL install prefix   : /usr
  Installer install prefix: /usr
  kernel source path      : (not specified)
  kernel install path     : (not specified)
  proc mount point        : /proc
  ui                      : (not specified)
  tmpdir                  : /tmp
  ftp site                : ftp://download.nvidia.com

Using: nvidia-installer ncurses user interface
-> License accepted.
-> No precompiled kernel interface was found to match your kernel; would you li
   ke the installer to attempt to download a kernel interface for your kernel f
   rom the NVIDIA ftp site (ftp://download.nvidia.com)? (Answer: Yes)
-> No matching precompiled kernel interface was found on the NVIDIA ftp site;
   this means that the installer will need to compile a kernel interface for
   your kernel.
-> Kernel source path: '/lib/modules/2.6.11-gentoo-r11/build'
 your kernel.
-> Kernel source path: '/lib/modules/2.6.11-gentoo-r11/build'
-> Performing cc_version_check with CC="cc".
-> Performing rivafb check.
-> Performing rivafb module check.
-> Cleaning kernel module build directory.
   executing: 'cd ./usr/src/nv; make clean'...
   rm -f -f nv.o os-agp.o os-interface.o os-registry.o nv.o os-agp.o os-interfa
   ce.o os-registry.o nvidia.mod.o
   rm -f -f build-in.o nv-linux.o *.d .*.{cmd,flags}
   rm -f -f nvidia.{o,ko,mod.{o,c}} nv_compiler.h *~
-> Building kernel module:
   executing: 'cd ./usr/src/nv; make module SYSSRC=/lib/modules/2.6.11-gentoo-r
   11/build'...

   NVIDIA: calling KBUILD...
   mkdir -p /tmp/selfgz7672/NVIDIA-Linux-x86-1.0-6106-pkg1/usr/src/nv/.tmp_vers
   ions
   make -f scripts/Makefile.build obj=/tmp/selfgz7672/NVIDIA-Linux-x86-1.0-6106
   -pkg1/usr/src/nv
   echo \#define NV_COMPILER \"`cc -v 2>&1 | tail -n 1`\" > /tmp/selfgz7672/NVI
   DIA-Linux-x86-1.0-6106-pkg1/usr/src/nv/nv_compiler.h
     cc -Wp,-MD,/tmp/selfgz7672/NVIDIA-Linux-x86-1.0-6106-pkg1/usr/src/nv/.nv.o
   .d -nostdinc -isystem /usr/lib/gcc-lib/i686-pc-linux-gnu/3.3.6/include -D__K
   ERNEL__ -Iinclude  -Wall -Wstrict-prototypes -Wno-trigraphs -fno-strict-alia
   sing -fno-common -ffreestanding -O2     -fomit-frame-pointer -pipe -msoft-fl
   oat -mpreferred-stack-boundary=2  -march=athlon -Iinclude/asm-i386/mach-defa
   ult   -I/tmp/selfgz7672/NVIDIA-Linux-x86-1.0-6106-pkg1/usr/src/nv -Wall -Wim
   plicit -Wreturn-type -Wswitch -Wformat -Wchar-subscripts -Wparentheses -Wpoi
   nter-arith  -Wno-multichar  -Werror -O -fno-common -MD   -Wno-cast-qual -Wno
   -error -D_LOOSE_KERNEL_NAMES -D__KERNEL__ -DMODULE  -DNTRM -D_GNU_SOURCE -D_
   LOOSE_KER
   NEL_NAMES -D__KERNEL__ -DMODULE  -DNV_MAJOR_VERSION=1 -DNV_MINOR_VERSION=0 -
   DNV_PATCHLEVEL=6106  -DNV_UNIX   -DNV_LINUX   -DNV_INT64_OK   -DNVCPU_X86
      -DNV_CHANGE_PAGE_ATTR_PRESENT -DNV_CLASS_SIMPLE_PRESENT  -DMODULE -DKBUIL
  DNV_PATCHLEVEL=6106  -DNV_UNIX   -DNV_LINUX   -DNV_INT64_OK   -DNVCPU_X86
      -DNV_CHANGE_PAGE_ATTR_PRESENT -DNV_CLASS_SIMPLE_PRESENT  -DMODULE -DKBUIL
   D_BASENAME=nv -DKBUILD_MODNAME=nvidia -c -o /tmp/selfgz7672/NVIDIA-Linux-x86
   -1.0-6106-pkg1/usr/src/nv/nv.o /tmp/selfgz7672/NVIDIA-Linux-x86-1.0-6106-pkg
   1/usr/src/nv/nv.c
   In file included from include/linux/list.h:7,
                    from include/linux/wait.h:23,
                    from include/asm/semaphore.h:41,
                    from include/linux/sched.h:19,
                    from include/linux/module.h:10,
                    from /tmp/selfgz7672/NVIDIA-Linux-x86-1.0-6106-pkg1/usr/src
   /nv/nv-linux.h:52,
                    from /tmp/selfgz7672/NVIDIA-Linux-x86-1.0-6106-pkg1/usr/src
   /nv/nv.c:14:
   include/linux/prefetch.h: In function `prefetch_range':
   include/linux/prefetch.h:62: warning: pointer of type `void *' used in arith
   metic
   In file included from include/linux/dmapool.h:14,
                    from include/linux/pci.h:863,
                    from /tmp/selfgz7672/NVIDIA-Linux-x86-1.0-6106-pkg1/usr/src
   /nv/nv-linux.h:75,
                    from /tmp/selfgz7672/NVIDIA-Linux-x86-1.0-6106-pkg1/usr/src
   /nv/nv.c:14:
   include/asm/io.h: In function `check_signature':
   include/asm/io.h:242: warning: wrong type argument to increment
   /tmp/selfgz7672/NVIDIA-Linux-x86-1.0-6106-pkg1/usr/src/nv/nv.c: In function
   `nvos_find_agp_by_class':
   /tmp/selfgz7672/NVIDIA-Linux-x86-1.0-6106-pkg1/usr/src/nv/nv.c:642: warning:
   implicit declaration of function `pci_find_class'
   /tmp/selfgz7672/NVIDIA-Linux-x86-1.0-6106-pkg1/usr/src/nv/nv.c:642: warning:
   assignment makes pointer from integer without a cast
   /tmp/selfgz7672/NVIDIA-Linux-x86-1.0-6106-pkg1/usr/src/nv/nv.c:653: warning:
   assignment makes pointer from integer without a cast
   /tmp/selfgz7672/NVIDIA-Linux-x86-1.0-6106-pkg1/usr/src/nv/nv.c: In function
   `nv_kern_mmap':
/tmp/selfgz7672/NVIDIA-Linux-x86-1.0-6106-pkg1/usr/src/nv/nv.c: In function
   `nv_kern_mmap':
   /tmp/selfgz7672/NVIDIA-Linux-x86-1.0-6106-pkg1/usr/src/nv/nv.c:1764: warning
   : implicit declaration of function `remap_page_range'
   /tmp/selfgz7672/NVIDIA-Linux-x86-1.0-6106-pkg1/usr/src/nv/nv.c: In function
   `_get_phys_address':
   /tmp/selfgz7672/NVIDIA-Linux-x86-1.0-6106-pkg1/usr/src/nv/nv.c:2732: warning
   : passing arg 1 of `pmd_offset' from incompatible pointer type
   /tmp/selfgz7672/NVIDIA-Linux-x86-1.0-6106-pkg1/usr/src/nv/nv.c: In function
   `nv_agp_init':
   /tmp/selfgz7672/NVIDIA-Linux-x86-1.0-6106-pkg1/usr/src/nv/nv.c:3324: warning
   : `inter_module_put' is deprecated (declared at include/linux/module.h:578)
   /tmp/selfgz7672/NVIDIA-Linux-x86-1.0-6106-pkg1/usr/src/nv/nv.c: In function
   `nvos_count_devices':
   /tmp/selfgz7672/NVIDIA-Linux-x86-1.0-6106-pkg1/usr/src/nv/nv.c:3474: warning
   : assignment makes pointer from integer without a cast
   /tmp/selfgz7672/NVIDIA-Linux-x86-1.0-6106-pkg1/usr/src/nv/nv.c:3479: warning
   : assignment makes pointer from integer without a cast
   /tmp/selfgz7672/NVIDIA-Linux-x86-1.0-6106-pkg1/usr/src/nv/nv.c: In function
   `nv_acpi_event':
   /tmp/selfgz7672/NVIDIA-Linux-x86-1.0-6106-pkg1/usr/src/nv/nv.c:3677: error:
   `PM_SAVE_STATE' undeclared (first use in this function)
   /tmp/selfgz7672/NVIDIA-Linux-x86-1.0-6106-pkg1/usr/src/nv/nv.c:3677: error:
   (Each undeclared identifier is reported only once
   /tmp/selfgz7672/NVIDIA-Linux-x86-1.0-6106-pkg1/usr/src/nv/nv.c:3677: error:
   for each function it appears in.)
   make[3]: *** [/tmp/selfgz7672/NVIDIA-Linux-x86-1.0-6106-pkg1/usr/src/nv/nv.o
   ] Error 1
   make[2]: *** [_module_/tmp/selfgz7672/NVIDIA-Linux-x86-1.0-6106-pkg1/usr/src
   /nv] Error 2
   NVIDIA: left KBUILD.
   nvidia.ko failed to build!
   make[1]: *** [module] Error 1
   make: *** [module] Error 2
-> Error.
  make: *** [module] Error 2
-> Error.
ERROR: Unable to build the NVIDIA kernel module.
ERROR: Installation has failed.  Please see the file
       '/var/log/nvidia-installer.log' for details.  You may find suggestions
       on fixing installation problems in the README available on the Linux
       driver download page at www.nvidia.com.