All pastes #178253 Raw Edit

e errors

public text v1 · immutable
#178253 ·published 2006-09-21 03:46 UTC
rendered paste body
e_icon.o(.text+0x51): In function `e_icon_file_set':
/home/kevin/source/e17/apps/e/src/bin/e_icon.c:47: undefined reference to `evas_object_image_load_size_set'
e_icon.o(.text+0xad): In function `e_icon_file_key_set':
/home/kevin/source/e17/apps/e/src/bin/e_icon.c:60: undefined reference to `evas_object_image_load_size_set'
e_int_config_apps.o(.text+0x17f4): In function `_move_file_up_in_order':
/home/kevin/source/e17/apps/e/src/bin/e_int_config_apps.c:703: undefined reference to `evas_list_prepend_relative_list'
e_fm.o(.text+0x1550): In function `_e_fm2_file_add':
/home/kevin/source/e17/apps/e/src/bin/e_fm.c:750: undefined reference to `evas_list_prepend_relative_list'
e_fm.o(.text+0x1a5b): In function `_e_fm2_queue_process':
/home/kevin/source/e17/apps/e/src/bin/e_fm.c:929: undefined reference to `evas_list_prepend_relative_list'
gmake[3]: *** [enlightenment] Error 1
gmake[3]: Leaving directory `/usr/home/kevin/source/e17/apps/e/src/bin'
gmake[2]: *** [all-recursive] Error 1
gmake[2]: Leaving directory `/usr/home/kevin/source/e17/apps/e/src'
gmake[1]: *** [all-recursive] Error 1
gmake[1]: Leaving directory `/usr/home/kevin/source/e17/apps/e'
gmake: *** [all] Error 2