All pastes #177761 Raw Edit

Mine

public text v1 · immutable
#177761 ·published 2006-09-20 17:20 UTC
rendered paste body
Running /home/stearns/shared/main/chandler/parcels/osaf/sharing/tests/compatibility/TestXMLCompatibility.py
- - - - - - - - - - - - - - - - - - - - - - - - - -
/home/stearns/shared/main/chandler/parcels/osaf/sharing/tests/compatibility/TestXMLCompatibility.py [OK]
Using /home/stearns/unshare
Running release functional tests
Running /home/stearns/shared/main/chandler/tools/cats/Functional/FunctionalTestSuite.py
- - - - - - - - - - - - - - - - - - - - - - - - - -
/home/stearns/shared/main/chandler/tools/cats/Functional/FunctionalTestSuite.py []
Chandler directory is /home/stearns/shared/main/chandler
Using /home/stearns/unshared/main/chandler/release/bin/python -O /home/stearns/shared/main/chandler/Chandler.py --create --catch=tests --profileDir=/home/stearns/shared/main/chandler/test_profile --parcelPath=/home/stearns/shared/main/chandler/tools/QATestScripts/DataFiles --scriptTimeout=600 --scriptFile=/home/stearns/shared/main/chandler/tools/cats/Functional/FunctionalTestSuite.py
+++ TestCreateAccounts:TestCreateAccounts +++
+++ TestAllDayEvent:TestAllDayEvent +++
+++ TestNewCollection:TestNewCollection +++
+++ TestNewEvent:TestNewEvent +++
+++ TestNewMail:TestNewMail +++
+++ TestNewTask:TestNewTask +++
+++ TestNewNote:TestNewNote +++
+++ TestTriageSectioning:TestTriageSectioning +++
+++ TestTableSelection:TestTableSelection +++
+++ TestStamping:TestStamping +++
+++ TestSharing:TestSharing +++
+++ TestMoveToTrash:TestMoveToTrash +++
+++ TestDeleteCollection:TestDeleteCollection +++
+++ TestMulti:TestMulti +++
+++ TestRecurrenceImporting:TestRecurrenceImporting +++
+++ TestRecurringEvent:TestRecurringEvent +++
Traceback (most recent call last):
  File "/home/stearns/shared/main/chandler/tools/cats/framework/runTests.py", line 58, in run_test_wrapped
    run_test(logger, paramSet)
  File "/home/stearns/shared/main/chandler/tools/cats/framework/runTests.py", line 53, in run_test
    test.runTest()
  File "/home/stearns/shared/main/chandler/tools/cats/framework/ChandlerTestCase.py", line 68, in runTest
    self.startTest()
  File "/home/stearns/shared/main/chandler/tools/cats/Functional/TestRecurringEvent.py", line 38, in startTest
    recurrenceEnd="03/01/2006")
  File "/home/stearns/shared/main/chandler/tools/cats/framework/ChandlerTestLib.py", line 178, in SetAttr
    method(args[param], timeInfo=False)
  File "/home/stearns/shared/main/chandler/tools/cats/framework/ChandlerTestLib.py", line 321, in SetDisplayName
    self.SetEditableBlock("HeadlineBlock", "display name", displayName, timeInfo=timeInfo)
  File "/home/stearns/shared/main/chandler/tools/cats/framework/ChandlerTestLib.py", line 276, in SetEditableBlock
    scripting.User.emulate_return()
  File "/home/stearns/shared/main/chandler/parcels/osaf/framework/scripting/User.py", line 251, in emulate_return
    widget.ProcessEvent(tu) #for start/end time and location field
AttributeError: 'NoneType' object has no attribute 'ProcessEvent'
+++ TestSwitchingViews:TestSwitchingViews +++
+++ TestExporting:TestExporting +++
+++ TestFlickr:TestFlickr +++
+++ TestImporting:TestImporting +++
+++ TestImportOverwrite:TestImportOverwrite +++
Traceback (most recent call last):
  File "/home/stearns/shared/main/chandler/tools/cats/framework/runTests.py", line 58, in run_test_wrapped
    run_test(logger, paramSet)
  File "/home/stearns/shared/main/chandler/tools/cats/framework/runTests.py", line 53, in run_test
    test.runTest()
  File "/home/stearns/shared/main/chandler/tools/cats/framework/ChandlerTestCase.py", line 68, in runTest
    self.startTest()
  File "/home/stearns/shared/main/chandler/tools/cats/Functional/TestImportOverwrite.py", line 39, in startTest
    event.SetAttr(displayName=uw("Original Event"), startDate="01/01/2001", startTime="12:00 AM", body=uw("This is the original event"))
  File "/home/stearns/shared/main/chandler/tools/cats/framework/ChandlerTestLib.py", line 178, in SetAttr
    method(args[param], timeInfo=False)
  File "/home/stearns/shared/main/chandler/tools/cats/framework/ChandlerTestLib.py", line 321, in SetDisplayName
    self.SetEditableBlock("HeadlineBlock", "display name", displayName, timeInfo=timeInfo)
  File "/home/stearns/shared/main/chandler/tools/cats/framework/ChandlerTestLib.py", line 276, in SetEditableBlock
    scripting.User.emulate_return()
  File "/home/stearns/shared/main/chandler/parcels/osaf/framework/scripting/User.py", line 251, in emulate_return
    widget.ProcessEvent(tu) #for start/end time and location field
AttributeError: 'NoneType' object has no attribute 'ProcessEvent'
+++ TestCertstoreView:TestCertstoreView +++
Traceback (most recent call last):
  File "/home/stearns/shared/main/chandler/tools/cats/framework/runTests.py", line 58, in run_test_wrapped
    run_test(logger, paramSet)
  File "/home/stearns/shared/main/chandler/tools/cats/framework/runTests.py", line 53, in run_test
    test.runTest()
  File "/home/stearns/shared/main/chandler/tools/cats/framework/ChandlerTestCase.py", line 68, in runTest
    self.startTest()
  File "/home/stearns/shared/main/chandler/tools/cats/Functional/TestCertstoreView.py", line 118, in startTest
    cert.SetEditableBlock('TrustAttribute', 'trust', '0', False)
  File "/home/stearns/shared/main/chandler/tools/cats/framework/ChandlerTestLib.py", line 276, in SetEditableBlock
    scripting.User.emulate_return()
  File "/home/stearns/shared/main/chandler/parcels/osaf/framework/scripting/User.py", line 251, in emulate_return
    widget.ProcessEvent(tu) #for start/end time and location field
AttributeError: 'NoneType' object has no attribute 'ProcessEvent'
+++ TestEventStacking:TestEventStacking +++
Traceback (most recent call last):
  File "/home/stearns/shared/main/chandler/tools/cats/framework/runTests.py", line 58, in run_test_wrapped
    run_test(logger, paramSet)
  File "/home/stearns/shared/main/chandler/tools/cats/framework/runTests.py", line 53, in run_test
    test.runTest()
  File "/home/stearns/shared/main/chandler/tools/cats/framework/ChandlerTestCase.py", line 68, in runTest
    self.startTest()
  File "/home/stearns/shared/main/chandler/tools/cats/Functional/TestEventStacking.py", line 53, in startTest
    event.SetAttr(displayName=eventName, startDate=today, startTime="12:00 PM", body=uw("Stacked event test"))
  File "/home/stearns/shared/main/chandler/tools/cats/framework/ChandlerTestLib.py", line 178, in SetAttr
    method(args[param], timeInfo=False)
  File "/home/stearns/shared/main/chandler/tools/cats/framework/ChandlerTestLib.py", line 321, in SetDisplayName
    self.SetEditableBlock("HeadlineBlock", "display name", displayName, timeInfo=timeInfo)
  File "/home/stearns/shared/main/chandler/tools/cats/framework/ChandlerTestLib.py", line 276, in SetEditableBlock
    scripting.User.emulate_return()
  File "/home/stearns/shared/main/chandler/parcels/osaf/framework/scripting/User.py", line 251, in emulate_return
    widget.ProcessEvent(tu) #for start/end time and location field
AttributeError: 'NoneType' object has no attribute 'ProcessEvent'
+++ TestRemoveFromTrashOnImport:TestRemoveFromTrashOnImport +++
Traceback (most recent call last):
  File "/home/stearns/shared/main/chandler/tools/cats/framework/runTests.py", line 58, in run_test_wrapped
    run_test(logger, paramSet)
  File "/home/stearns/shared/main/chandler/tools/cats/framework/runTests.py", line 53, in run_test
    test.runTest()
  File "/home/stearns/shared/main/chandler/tools/cats/framework/ChandlerTestCase.py", line 68, in runTest
    self.startTest()
  File "/home/stearns/shared/main/chandler/tools/cats/Functional/TestRemoveFromTrashOnImport.py", line 52, in startTest
    ev.SetAttr(displayName=eventName, startDate=today, startTime="12:00 PM")
  File "/home/stearns/shared/main/chandler/tools/cats/framework/ChandlerTestLib.py", line 178, in SetAttr
    method(args[param], timeInfo=False)
  File "/home/stearns/shared/main/chandler/tools/cats/framework/ChandlerTestLib.py", line 321, in SetDisplayName
    self.SetEditableBlock("HeadlineBlock", "display name", displayName, timeInfo=timeInfo)
  File "/home/stearns/shared/main/chandler/tools/cats/framework/ChandlerTestLib.py", line 276, in SetEditableBlock
    scripting.User.emulate_return()
  File "/home/stearns/shared/main/chandler/parcels/osaf/framework/scripting/User.py", line 251, in emulate_return
    widget.ProcessEvent(tu) #for start/end time and location field
AttributeError: 'NoneType' object has no attribute 'ProcessEvent'
+++ TestEnableTimezones:TestEnableTimezones +++
+++ TestSwitchTimezone:TestSwitchTimezone +++
+++ TestBlocks:TestBlocks +++
Traceback (most recent call last):
  File "/home/stearns/shared/main/chandler/application/Application.py", line 122, in OnSize
    self.GetChildren()[0].blockItem.size = SizeType (self.GetSize().x, self.GetSize().y)
AttributeError: 'RecurrenceDialog' object has no attribute 'blockItem'
Traceback (most recent call last):
  File "/home/stearns/shared/main/chandler/application/Application.py", line 122, in OnSize
    self.GetChildren()[0].blockItem.size = SizeType (self.GetSize().x, self.GetSize().y)
AttributeError: 'RecurrenceDialog' object has no attribute 'blockItem'

SUITE ChandlerFunctionalTestSuite FAILED
        TEST TestRecurringEvent failed
                ACTION Multiple Attribute Setting
                        REPORT Traceback detected
                        REPORT Action failed due to traceback
        TEST TestImportOverwrite failed
                ACTION Multiple Attribute Setting
                        REPORT Traceback detected
                        REPORT Action failed due to traceback
        TEST TestCertstoreView failed
                ACTION Traceback detected Action created by framework for report call
                        REPORT Action created by framework for report call
        TEST TestEventStacking failed
                ACTION Multiple Attribute Setting
                        REPORT Traceback detected
                        REPORT Action failed due to traceback
        TEST TestRemoveFromTrashOnImport failed
                ACTION Multiple Attribute Setting
                        REPORT Traceback detected
                        REPORT Action failed due to traceback

*********** TEST RESULTS ************
*************************************
TestCreateAccounts____________ passed
TestAllDayEvent_______________ passed
TestNewCollection_____________ passed
TestNewEvent__________________ passed
TestNewMail___________________ passed
TestNewTask___________________ passed
TestNewNote___________________ passed
TestTriageSectioning__________ passed
TestTableSelection____________ passed
TestStamping__________________ passed
TestSharing___________________ passed
TestMoveToTrash_______________ passed
TestDeleteCollection__________ passed
TestMulti_____________________ passed
TestRecurrenceImporting_______ passed
TestRecurringEvent____________*FAILED*
TestSwitchingViews____________ passed
TestExporting_________________ passed
TestFlickr____________________ passed
TestImporting_________________ passed
TestImportOverwrite___________*FAILED*
TestCertstoreView_____________*FAILED*
TestEventStacking_____________*FAILED*
TestRemoveFromTrashOnImport___*FAILED*
TestEnableTimezones___________ passed
TestSwitchTimezone____________ passed
TestBlocks____________________ passed
*************************************
#TINDERBOX# Testname = ChandlerFunctionalTestSuite
#TINDERBOX# Time elapsed = 0:02:34.922066 (seconds)
#TINDERBOX# Status = FAILED
- + - + - + - + - + - + - + - + - + - + - + - + - + - + - +
The following tests failed
    (release)/home/stearns/shared/main/chandler/tools/cats/Functional/FunctionalTestSuite.py

real    12m32.184s
user    11m7.177s
sys     0m33.135s