All pastes #1774286 Raw Edit

kharec

public text v1 · immutable
#1774286 ·published 2010-02-01 12:40 UTC
rendered paste body
Executing(%prep): /bin/sh -e /home/kharec/cooker/iv/BUILDROOT/rpm-tmp.ZBQY9X+ umask 022+ cd /home/kharec/cooker/iv/BUILD+ '[' 1 -eq 1 ']'+ '[' 1 -eq 1 ']'+ '[' 1 -eq 1 ']'+ cd /home/kharec/cooker/iv/BUILD+ rm -rf iv-2.6.1+ /usr/bin/bzip2 -dc /home/kharec/cooker/iv/SOURCES/iv-2.6.1.tar.bz2+ /bin/tar -xf -+ STATUS=0+ '[' 0 -ne 0 ']'+ cd iv-2.6.1+ echo 'Patch #0 (iv-2.6.1-fix-build-errors.patch):'Patch #0 (iv-2.6.1-fix-build-errors.patch):+ /usr/bin/patch -U -s -p1 --fuzz=0 -i /home/kharec/cooker/iv/SOURCES/iv-2.6.1-fix-build-errors.patch+ echo 'Patch #1 (iv-2.5.1-fix-lib64-build.patch):'Patch #1 (iv-2.5.1-fix-lib64-build.patch):+ /usr/bin/patch -U -s -p1 --fuzz=0 -i /home/kharec/cooker/iv/SOURCES/iv-2.5.1-fix-lib64-build.patch+ exit 0Executing(%build): /bin/sh -e /home/kharec/cooker/iv/BUILDROOT/rpm-tmp.gPjDZu+ umask 022+ cd /home/kharec/cooker/iv/BUILD+ cd iv-2.6.1+ '[' 1 -eq 1 ']'+ '[' 1 -eq 1 ']'+ export 'CFLAGS=-O2 -g -pipe -Wformat -Werror=format-security -Wp,-D_FORTIFY_SOURCE=2 -fstack-protector --param=ssp-buffer-size=4 -fomit-frame-pointer -march=i586 -mtune=generic -fasynchronous-unwind-tables -I/usr/include/endeavour2'+ CFLAGS='-O2 -g -pipe -Wformat -Werror=format-security -Wp,-D_FORTIFY_SOURCE=2 -fstack-protector --param=ssp-buffer-size=4 -fomit-frame-pointer -march=i586 -mtune=generic -fasynchronous-unwind-tables -I/usr/include/endeavour2'+ ./configure Linux --disable=arch-i686 --libdir=-L/usr/lib --enable=debugCollecting information about this platform...Generating Platform Configurator and testing system's compiler...rm -f *.o a.out core pconfcc fio.c main.c proc.c utils.c -o pconf -Wall Compiler passed all compatibility tests! Configuring for platform `Linux'...Checking this platform...Checking Dependency: i486...    Preferred (not required) feature `arch-i486' not detected and disabled.Checking Dependency: i586...    Preferred (not required) feature `arch-i586' not detected and disabled.Checking Dependency: pentiumpro...    Preferred (not required) feature `arch-pentiumpro' not detected and disabled.    Preferred feature `title_image' detected and enabled.Checking Dependency: libgif-devel...    Preferred feature `libgif' detected and enabled.Checking Dependency: libjpeg-devel...    Preferred feature `libjpeg' detected and enabled.Checking Dependency: libpng-devel...    Preferred feature `libpng' detected and enabled.Checking Dependency: zlib-devel...Checking Dependency: libmng-devel...    Preferred feature `libmng' detected and enabled.Checking Dependency: libti    *** Object `libXprintUtil.so' not found in defined platform paths! ***    *** Object `X11/XprintUtil/xprintutil.h' not found in defined platform paths! ***ff-devel...    Preferred feature `libtiff' detected and enabled.Checking Dependency: libxpm-devel...    Preferred feature `libxpm' detected and enabled.Checking Dependency: Imlib-devel...    Preferred feature `Imlib' detected and enabled.    Preferred feature `Imlib-transpixel-fix' detected and enabled.Checking Dependency: xf86vidmode-lib...Checking Dependency: xf86vidmode-devel...    Preferred feature `XF86VidMode' detected and enabled.Checking Dependency: libXp-lib...Checking Dependency: libXp-devel...Checking Dependency: libXprintUtil-lib...Checking Dependency: libXprintUtil-devel...    Preferred (not required) feature `libXp' not detected and disabled.Checking Dependency: gtk-devel...Checking Dependency: endeavour2-base-devel...    Preferred feature `libendeavour2-base' detected and enabled.Generating output Makefile `iv/Makefile.pconf'...Platform configuration completed!--------------------------------------------------------------------------------Type 'gmake all' or 'make all' to compile the program.+ make -j4 allBuilding program "iv"...Compiling resourcesCompiling module brightness.oCompiling module cdialog.oCompiling module color_levels.oCompiling module color_levels_dlg.oCompiling module contrast.oCompiling module csd.oCompiling module desktop.oCompiling module fb.oCompiling module fprompt.oCompiling module frames_dlg.ocolor_levels_dlg.c: In function 'apply_iv_image':color_levels_dlg.c:1821: warning: incompatible implicit declaration of built-in function 'memcpy'color_levels_dlg.c: In function 'restore_iv_image':color_levels_dlg.c:1986: warning: incompatible implicit declaration of built-in function 'memcpy'color_levels_dlg.c: In function 'make_histogram':color_levels_dlg.c:2252: warning: incompatible implicit declaration of built-in function 'memset'color_levels_dlg.c: In function 'rerender_gradient_data':color_levels_dlg.c:2303: warning: incompatible implicit declaration of built-in function 'memset'color_levels_dlg.c: In function 'iv_color_levels_query':color_levels_dlg.c:2710: warning: incompatible implicit declaration of built-in function 'memcpy'Compiling module fsd.oCompiling module fullscreen_img.oCompiling module guifullscreen.oCompiling module guirgbimg.ofullscreen_img.c: In function 'FSImgSet':fullscreen_img.c:685: warning: incompatible implicit declaration of built-in function 'memcpy'Compiling module guiutils.oCompiling module header_dlg.oCompiling module hview.oheader_dlg.c: In function 'iv_edit_header':header_dlg.c:1071: warning: incompatible implicit declaration of built-in function 'memcpy'Compiling module hviewcb.ofb.c: In function 'FileBrowserCopyIteration':fb.c:5452: warning: ignoring return value of 'chown', declared with attribute warn_unused_resultfb.c:5575: warning: ignoring return value of 'lchown', declared with attribute warn_unused_resultfb.c:5648: warning: ignoring return value of 'fchown', declared with attribute warn_unused_resultCompiling module img_info_dlg.oCompiling module imgio.oCompiling module imgio_gif.oCompiling module imgio_jpeg.oimg_info_dlg.c: In function 'img_info_dlg_set_values':img_info_dlg.c:1170: warning: comparison between pointer and integerCompiling module imgio_mng.oCompiling module imgio_png.oCompiling module imgio_tga.oCompiling module imgio_tiff.oCompiling module imgio_xpm.oCompiling module imgview.oCompiling module imgviewcrop.oCompiling module iv_title.oCompiling module libps.oCompiling module main.oCompiling module pdialog.oCompiling module print.oCompiling module print_lpr.oCompiling module print_lpr_dlg.oprint_lpr.c: In function 'iv_print_lpr_to_file':print_lpr.c:400: warning: passing argument 11 of 'PSWriteFilePS3RGBA' from incompatible pointer typelibps.h:150: note: expected 'PSProgressFunction' but argument is of type 'gint (*)(void *, gint,  gint,  gint,  gint,  gint,  gint,  guint8 *)'print_lpr.c:411: warning: passing argument 11 of 'PSWriteFilePS3RGB' from incompatible pointer typelibps.h:171: note: expected 'PSProgressFunction' but argument is of type 'gint (*)(void *, gint,  gint,  gint,  gint,  gint,  gint,  guint8 *)'print_lpr.c:422: warning: passing argument 11 of 'PSWriteFilePS3Grey' from incompatible pointer typelibps.h:193: note: expected 'PSProgressFunction' but argument is of type 'gint (*)(void *, gint,  gint,  gint,  gint,  gint,  gint,  guint8 *)'print_lpr.c: In function 'iv_print_lpr_to_printer':print_lpr.c:749: warning: passing argument 11 of 'PSWriteFilePS3RGBA' from incompatible pointer typelibps.h:150: note: expected 'PSProgressFunction' but argument is of type 'gint (*)(void *, gint,  gint,  gint,  gint,  gint,  gint,  guint8 *)'print_lpr.c:760: warning: passing argument 11 of 'PSWriteFilePS3RGB' from incompatible pointer typelibps.h:171: note: expected 'PSProgressFunction' but argument is of type 'gint (*)(void *, gint,  gint,  gint,  gint,  gint,  gint,  guint8 *)'print_lpr.c:771: warning: passing argument 11 of 'PSWriteFilePS3Grey' from incompatible pointer typelibps.h:193: note: expected 'PSProgressFunction' but argument is of type 'gint (*)(void *, gint,  gint,  gint,  gint,  gint,  gint,  guint8 *)'Compiling module print_values.oCompiling module print_xprint.oCompiling module print_xprint_dlg.oCompiling module progressdialog.oCompiling module pulist.oCompiling module resize_dlg.oCompiling module rgba_to_cidx.omain.c: In function 'iv_viewer_dnd_recieved_cb':main.c:1087: warning: ignoring return value of 'chdir', declared with attribute warn_unused_resultmain.c: In function 'iv_viewer_save':main.c:3152: warning: comparison between pointer and integermain.c: In function 'iv_viewer_open_image_cb':main.c:6567: warning: ignoring return value of 'chdir', declared with attribute warn_unused_resultmain.c: In function 'iv_viewer_open_other_cb':main.c:6736: warning: ignoring return value of 'chdir', declared with attribute warn_unused_resultmain.c: In function 'iv_viewer_save_cb':main.c:6881: warning: ignoring return value of 'chdir', declared with attribute warn_unused_resultmain.c: In function 'main':main.c:8939: warning: ignoring return value of 'chdir', declared with attribute warn_unused_resultCompiling module save_options_dlg.osave_options_dlg.c:2243:36: warning: trigraph ??) ignored, use -trigraphs to enableCompiling module screenshot.oCompiling module screenshot_dlg.orgba_to_cidx.c: In function 'median_cut_pass2_fs_dither_gray':rgba_to_cidx.c:1885: warning: incompatible implicit declaration of built-in function 'memset'rgba_to_cidx.c: In function 'median_cut_pass2_fs_dither_rgb':rgba_to_cidx.c:2036: warning: incompatible implicit declaration of built-in function 'memset'Compiling module statictip.oCompiling module text_dlg.oCompiling module tview.oCompiling module tviewcb.oCompiling module disk.occ1plus: error: unrecognized command line option "-Werror=format-security"ICECC[14420] 13:20:02: Compiled on 192.168.2.76make[1]: *** [disk.o] Error 1make[1]: *** Waiting for unfinished jobs....make: *** [all] Error 2error: Bad exit status from /home/kharec/cooker/iv/BUILDROOT/rpm-tmp.gPjDZu (%build)RPM build errors:    Bad exit status from /home/kharec/cooker/iv/BUILDROOT/rpm-tmp.gPjDZu (%build)