-- Build files have been written to: /home/anne/builds/JEFthumb20100127/thumb/build
[anne@anne-laptop build]$ make
Scanning dependencies of target jefthumbnail_automoc
[ 0%] Built target jefthumbnail_automoc
Scanning dependencies of target jefthumbnail
[ 50%] Building CXX object CMakeFiles/jefthumbnail.dir/jefthumbnail_automoc.o
[100%] Building CXX object CMakeFiles/jefthumbnail.dir/jefthumbcreator.o
In file included from /home/anne/builds/JEFthumb20100127/thumb/jefthumbcreator.cpp:3:
/home/anne/builds/JEFthumb20100127/thumb/jefthumbcreator.h:5:30: error: kio/thumbcreator.h: No such file or directory
/home/anne/builds/JEFthumb20100127/thumb/jefthumbcreator.h:6:23: error: kdemacros.h: No such file or directory
In file included from /home/anne/builds/JEFthumb20100127/thumb/jefthumbcreator.cpp:3:
/home/anne/builds/JEFthumb20100127/thumb/jefthumbcreator.h:14: error: expected class-name before { token
/home/anne/builds/JEFthumb20100127/thumb/jefthumbcreator.h:18: error: Flags does not name a type
/home/anne/builds/JEFthumb20100127/thumb/jefthumbcreator.h:14: warning: class JEFThumbCreator has virtual functions and accessible non-virtual destructor
/home/anne/builds/JEFthumb20100127/thumb/jefthumbcreator.cpp:7: error: KDE_EXPORT does not name a type
/home/anne/builds/JEFthumb20100127/thumb/jefthumbcreator.cpp:137: warning: unused parameter width
/home/anne/builds/JEFthumb20100127/thumb/jefthumbcreator.cpp:137: warning: unused parameter height
/home/anne/builds/JEFthumb20100127/thumb/jefthumbcreator.cpp:263: error: ThumbCreator has not been declared
/home/anne/builds/JEFthumb20100127/thumb/jefthumbcreator.cpp:263: error: expected constructor, destructor, or type conversion before JEFThumbCreator
make[2]: *** [CMakeFiles/jefthumbnail.dir/jefthumbcreator.o] Error 1
make[1]: *** [CMakeFiles/jefthumbnail.dir/all] Error 2
make: *** [all] Error 2