All pastes #17576 Raw Edit

Sarge_man

public c v1 · immutable
#17576 ·published 2005-07-12 21:41 UTC
rendered paste body
../../../nucleo/gl/texture/glTexture.H:84: error: ISO C++ forbids declaration    of `coords' with no type../../../nucleo/gl/texture/glTexture.H:84: error: ISO C++ forbids    initialization of member `coords'../../../nucleo/gl/texture/glTexture.H:84: error: making `coords' static../../../nucleo/gl/texture/glTexture.H:84: error: invalid in-class    initialization of static data member of non-integral type `int[1]'../../../nucleo/gl/texture/glTexture.H:85: error: `z' was not declared in this    scope../../../nucleo/gl/texture/glTexture.H:85: error: ISO C++ forbids declaration    of `coords' with no type../../../nucleo/gl/texture/glTexture.H:85: error: ISO C++ forbids    initialization of member `coords'../../../nucleo/gl/texture/glTexture.H:85: error: making `coords' static../../../nucleo/gl/texture/glTexture.H:85: error: invalid in-class    initialization of static data member of non-integral type `int[2]'../../../nucleo/gl/texture/glTexture.H:87: error: missing ';' before right    brace../../../nucleo/gl/texture/glTexture.H:89: error: `Point' was not declared in    this scope../../../nucleo/gl/texture/glTexture.H:89: error: template argument 1 is    invalid../../../nucleo/gl/texture/glTexture.H:89: error: template argument 2 is    invalid../../../nucleo/gl/texture/glTexture.H:89: error: ISO C++ forbids declaration    of `ClipRegion' with no type../../../nucleo/gl/texture/glTexture.H:91: error: `anchor' was not declared in    this scope../../../nucleo/gl/texture/glTexture.H:91: error: parse error before `,' token../../../nucleo/gl/texture/glTexture.H:97: error: parse error before `}' tokenmake[4]: *** [ImageSink.lo] Erreur 1make[3]: *** [all-recursive] Erreur 1make[2]: *** [all-recursive] Erreur 1make[1]: *** [all] Erreur 2make: *** [all-recursive] Erreur 1