All pastes #17575 Raw Edit

Stuff

public text v1 · immutable
#17575 ·published 2005-07-12 21:37 UTC
rendered paste body
../../../nucleo/gl/texture/glTexture.H:84: error: ISO C++ forbids declaration 
   of `coords' with no type
../../../nucleo/gl/texture/glTexture.H:84: error: ISO C++ forbids 
   initialization of member `coords'
../../../nucleo/gl/texture/glTexture.H:84: error: making `coords' static
../../../nucleo/gl/texture/glTexture.H:84: error: invalid in-class 
   initialization of static data member of non-integral type `int[1]'
../../../nucleo/gl/texture/glTexture.H:85: error: `z' was not declared in this 
   scope
../../../nucleo/gl/texture/glTexture.H:85: error: ISO C++ forbids declaration 
   of `coords' with no type
../../../nucleo/gl/texture/glTexture.H:85: error: ISO C++ forbids 
   initialization of member `coords'
../../../nucleo/gl/texture/glTexture.H:85: error: making `coords' static
../../../nucleo/gl/texture/glTexture.H:85: error: invalid in-class 
   initialization of static data member of non-integral type `int[2]'
../../../nucleo/gl/texture/glTexture.H:87: error: missing ';' before right 
   brace
../../../nucleo/gl/texture/glTexture.H:89: error: `Point' was not declared in 
   this scope
../../../nucleo/gl/texture/glTexture.H:89: error: template argument 1 is 
   invalid
../../../nucleo/gl/texture/glTexture.H:89: error: template argument 2 is 
   invalid
../../../nucleo/gl/texture/glTexture.H:89: error: ISO C++ forbids declaration 
   of `ClipRegion' with no type
../../../nucleo/gl/texture/glTexture.H:91: error: `anchor' was not declared in 
   this scope
../../../nucleo/gl/texture/glTexture.H:91: error: parse error before `,' token
../../../nucleo/gl/texture/glTexture.H:97: error: parse error before `}' token
make[4]: *** [ImageSink.lo] Erreur 1
make[3]: *** [all-recursive] Erreur 1
make[2]: *** [all-recursive] Erreur 1
make[1]: *** [all] Erreur 2
make: *** [all-recursive] Erreur 1