open@marvin:~/realextend-viewer-trunk$ make
[ 1%] Built target Core
[ 2%] Built target SceneManager
[ 3%] Built target Interfaces
[ 3%] Building CXX object Foundation/CMakeFiles/Foundation.dir/State.o
In file included from /home/open/realextend-viewer-trunk/Foundation/State.cpp:3:
/home/open/realextend-viewer-trunk/Foundation/State.h:7:18: error: QState: Nessun file o directory
In file included from /home/open/realextend-viewer-trunk/Foundation/State.cpp:3:
/home/open/realextend-viewer-trunk/Foundation/State.h:19: error: expected class-name before ‘{’ token
/home/open/realextend-viewer-trunk/Foundation/State.h:20: error: ‘QState’ has not been declared
/home/open/realextend-viewer-trunk/Foundation/State.h:21: error: ‘QState’ has not been declared
/home/open/realextend-viewer-trunk/Foundation/State.h:21: error: expected ‘,’ or ‘...’ before ‘mode’
/home/open/realextend-viewer-trunk/Foundation/State.h:24: error: ‘QEvent’ has not been declared
/home/open/realextend-viewer-trunk/Foundation/State.h:25: error: ‘QEvent’ has not been declared
/home/open/realextend-viewer-trunk/Foundation/State.cpp:9: error: ‘QState’ has not been declared
/home/open/realextend-viewer-trunk/Foundation/State.cpp: In constructor ‘Foundation::State::State(QString, Foundation::StateMap&, int*)’:
/home/open/realextend-viewer-trunk/Foundation/State.cpp:10: error: class ‘Foundation::State’ does not have any field named ‘QState’
/home/open/realextend-viewer-trunk/Foundation/State.cpp:12: error: ‘setObjectName’ was not declared in this scope
/home/open/realextend-viewer-trunk/Foundation/State.cpp: At global scope:
/home/open/realextend-viewer-trunk/Foundation/State.cpp:16: error: ‘QState’ has not been declared
/home/open/realextend-viewer-trunk/Foundation/State.cpp:16: error: expected ‘,’ or ‘...’ before ‘mode’
/home/open/realextend-viewer-trunk/Foundation/State.cpp: In constructor ‘Foundation::State::State(QString, Foundation::StateMap&, int)’:
/home/open/realextend-viewer-trunk/Foundation/State.cpp:17: error: class ‘Foundation::State’ does not have any field named ‘QState’
/home/open/realextend-viewer-trunk/Foundation/State.cpp:17: error: ‘mode’ was not declared in this scope
/home/open/realextend-viewer-trunk/Foundation/State.cpp:17: error: ‘parent’ was not declared in this scope
/home/open/realextend-viewer-trunk/Foundation/State.cpp:19: error: ‘setObjectName’ was not declared in this scope
/home/open/realextend-viewer-trunk/Foundation/State.cpp: In destructor ‘virtual Foundation::State::~State()’:
/home/open/realextend-viewer-trunk/Foundation/State.cpp:25: error: ‘objectName’ was not declared in this scope
/home/open/realextend-viewer-trunk/Foundation/State.cpp: At global scope:
/home/open/realextend-viewer-trunk/Foundation/State.cpp:30: error: variable or field ‘onEntry’ declared void
/home/open/realextend-viewer-trunk/Foundation/State.cpp:30: error: ‘QEvent’ was not declared in this scope
/home/open/realextend-viewer-trunk/Foundation/State.cpp:30: error: ‘e’ was not declared in this scope
/home/open/realextend-viewer-trunk/Foundation/State.cpp:36: error: variable or field ‘onExit’ declared void
/home/open/realextend-viewer-trunk/Foundation/State.cpp:36: error: ‘QEvent’ was not declared in this scope
/home/open/realextend-viewer-trunk/Foundation/State.cpp:36: error: ‘e’ was not declared in this scope
make[2]: *** [Foundation/CMakeFiles/Foundation.dir/State.o] Errore 1
make[1]: *** [Foundation/CMakeFiles/Foundation.dir/all] Errore 2
make: *** [all] Errore 2