Linking C executable cdda2wav
make[3]: Leaving directory `/tmp/cdrkit-1.0pre4/build'
[ 42%] Built target cdda2wav
make[3]: Entering directory `/tmp/cdrkit-1.0pre4/build'
Scanning dependencies of target wodim
make[3]: Leaving directory `/tmp/cdrkit-1.0pre4/build'
make[3]: Entering directory `/tmp/cdrkit-1.0pre4/build'
[ 42%] Building C object cdrecord/CMakeFiles/wodim.dir/audiosize.o
[ 42%] Building C object cdrecord/CMakeFiles/wodim.dir/auinfo.o
[ 43%] Building C object cdrecord/CMakeFiles/wodim.dir/cd_misc.o
[ 43%] Building C object cdrecord/CMakeFiles/wodim.dir/cdr_drv.o
[ 43%] Building C object cdrecord/CMakeFiles/wodim.dir/cdrecord.o
/tmp/cdrkit-1.0pre4/cdrecord/cdrecord.c:81:56: error: sys/capability.h: No such file or directory
/tmp/cdrkit-1.0pre4/cdrecord/cdrecord.c:273: error: expected ')' before 'cap_array'
/tmp/cdrkit-1.0pre4/cdrecord/cdrecord.c: In function 'main':
/tmp/cdrkit-1.0pre4/cdrecord/cdrecord.c:497: error: 'CAP_SYS_RAWIO' undeclared (first use in this function)
/tmp/cdrkit-1.0pre4/cdrecord/cdrecord.c:497: error: (Each undeclared identifier is reported only once
/tmp/cdrkit-1.0pre4/cdrecord/cdrecord.c:497: error: for each function it appears in.)
/tmp/cdrkit-1.0pre4/cdrecord/cdrecord.c: At top level:
/tmp/cdrkit-1.0pre4/cdrecord/cdrecord.c:4834: error: static declaration of 'get_cap' follows non-static declaration
/tmp/cdrkit-1.0pre4/cdrecord/cdrecord.c:497: error: previous implicit declaration of 'get_cap' was here
/tmp/cdrkit-1.0pre4/cdrecord/cdrecord.c: In function 'get_cap':
/tmp/cdrkit-1.0pre4/cdrecord/cdrecord.c:4834: error: expected declaration specifiers before 'cap_value_t'
/tmp/cdrkit-1.0pre4/cdrecord/cdrecord.c:4837: error: 'cap_t' undeclared (first use in this function)
/tmp/cdrkit-1.0pre4/cdrecord/cdrecord.c:4837: error: expected ';' before 'capa'
/tmp/cdrkit-1.0pre4/cdrecord/cdrecord.c:4838: error: 'capa' undeclared (first use in this function)
/tmp/cdrkit-1.0pre4/cdrecord/cdrecord.c:4839: error: 'CAP_EFFECTIVE' undeclared (first use in this function)
/tmp/cdrkit-1.0pre4/cdrecord/cdrecord.c:4839: error: 'CAP_SET' undeclared (first use in this function)
make[3]: *** [cdrecord/CMakeFiles/wodim.dir/cdrecord.o] Error 1
make[3]: Leaving directory `/tmp/cdrkit-1.0pre4/build'
make[2]: *** [cdrecord/CMakeFiles/wodim.dir/all] Error 2
make[2]: Leaving directory `/tmp/cdrkit-1.0pre4/build'
make[1]: *** [all] Error 2
make[1]: Leaving directory `/tmp/cdrkit-1.0pre4/build'
make: *** [all] Error 2