/bin/sh /var/tmp/portage/subversion-1.4.0/work/subversion-1.4.0/libtool --tag=CXX --silent --mode=compile i686-pc-linux-gnu-g++ -DLINUX=2 -D_REENTRANT -D_GNU_SOURCE -Os -march=pentium-m -mmmx -msse -msse2 -mfpmath=sse -pipe -momit-leaf-frame-pointer -ggdb -DLINUX=2 -D_REENTRANT -D_GNU_SOURCE -pthread -D_LARGEFILE64_SOURCE -DNE_LFS -Os -march=pentium-m -mmmx -msse -msse2 -mfpmath=sse -pipe -momit-leaf-frame-pointer -ggdb -DLINUX=2 -D_REENTRANT -D_GNU_SOURCE -I./subversion/include -I./subversion -I/usr/include/neon -I/usr/include/apr-0 -DLINUX=2 -D_REENTRANT -D_GNU_SOURCE -I/usr/include/apr-0 -I/usr/include/db4.3 -I/usr/lib/gcj-4.2.0_alpha20060909/include -I/usr/lib/gcj-4.2.0_alpha20060909/include -I/usr/lib/gcj-4.2.0_alpha20060909/include/c++ -I/usr/lib/gcj-4.2.0_alpha20060909/include/c++/bits -I/usr/lib/gcj-4.2.0_alpha20060909/include/c++/backward -I/usr/lib/gcj-4.2.0_alpha20060909/include/c++/ext -I/usr/lib/gcj-4.2.0_alpha20060909/include/c++/ext/pb_ds -I/usr/lib/gcj-4.2.0_alpha20060909/include/c++/ext/pb_ds/detail -I/usr/lib/gcj-4.2.0_alpha20060909/include/c++/ext/pb_ds/detail/pairing_heap_ -I/usr/lib/gcj-4.2.0_alpha20060909/include/c++/ext/pb_ds/detail/splay_tree_ -I/usr/lib/gcj-4.2.0_alpha20060909/include/c++/ext/pb_ds/detail/list_update_map_ -I/usr/lib/gcj-4.2.0_alpha20060909/include/c++/ext/pb_ds/detail/typelist -I/usr/lib/gcj-4.2.0_alpha20060909/include/c++/ext/pb_ds/detail/basic_tree_policy -I/usr/lib/gcj-4.2.0_alpha20060909/include/c++/ext/pb_ds/detail/trie_policy -I/usr/lib/gcj-4.2.0_alpha20060909/include/c++/ext/pb_ds/detail/gp_hash_table_map_ -I/usr/lib/gcj-4.2.0_alpha20060909/include/c++/ext/pb_ds/detail/tree_policy -I/usr/lib/gcj-4.2.0_alpha20060909/include/c++/ext/pb_ds/detail/binomial_heap_base_ -I/usr/lib/gcj-4.2.0_alpha20060909/include/c++/ext/pb_ds/detail/resize_policy -I/usr/lib/gcj-4.2.0_alpha20060909/include/c++/ext/pb_ds/detail/bin_search_tree_ -I/usr/lib/gcj-4.2.0_alpha20060909/include/c++/ext/pb_ds/detail/binomial_heap_ -I/usr/lib/gcj-4.2.0_alpha20060909/include/c++/ext/pb_ds/detail/thin_heap_ -I/usr/lib/gcj-4.2.0_alpha20060909/include/c++/ext/pb_ds/detail/pat_trie_ -I/usr/lib/gcj-4.2.0_alpha20060909/include/c++/ext/pb_ds/detail/cc_hash_table_map_ -I/usr/lib/gcj-4.2.0_alpha20060909/include/c++/ext/pb_ds/detail/rc_binomial_heap_ -I/usr/lib/gcj-4.2.0_alpha20060909/include/c++/ext/pb_ds/detail/left_child_next_sibling_heap_ -I/usr/lib/gcj-4.2.0_alpha20060909/include/c++/ext/pb_ds/detail/unordered_iterator -I/usr/lib/gcj-4.2.0_alpha20060909/include/c++/ext/pb_ds/detail/binary_heap_ -I/usr/lib/gcj-4.2.0_alpha20060909/include/c++/ext/pb_ds/detail/ov_tree_map_ -I/usr/lib/gcj-4.2.0_alpha20060909/include/c++/ext/pb_ds/detail/hash_fn -I/usr/lib/gcj-4.2.0_alpha20060909/include/c++/ext/pb_ds/detail/eq_fn -I/usr/lib/gcj-4.2.0_alpha20060909/include/c++/ext/pb_ds/detail/rb_tree_map_ -I/usr/lib/gcj-4.2.0_alpha20060909/include/c++/ext/pb_ds/detail/list_update_policy -I/usr/lib/gcj-4.2.0_alpha20060909/include/c++/tr1 -I/usr/lib/gcj-4.2.0_alpha20060909/include/c++/debug -I/usr/lib/gcj-4.2.0_alpha20060909/include/c++/i686-pc-linux-gnu -I/usr/lib/gcj-4.2.0_alpha20060909/include/c++/i686-pc-linux-gnu/bits -I/usr/lib/gcj-4.2.0_alpha20060909/include/c++/i686-pc-linux-gnu/bits/stdc++.h.gch -I/usr/lib/gcj-4.2.0_alpha20060909/include/c++/i686-pc-linux-gnu/bits/stdtr1c++.h.gch -I/usr/lib/gcj-4.2.0_alpha20060909/include/c++/gcj -I/usr/lib/gcj-4.2.0_alpha20060909/include/c++/gnu -I/usr/lib/gcj-4.2.0_alpha20060909/include/c++/gnu/awt -I/usr/lib/gcj-4.2.0_alpha20060909/include/c++/gnu/awt/j2d -I/usr/lib/gcj-4.2.0_alpha20060909/include/c++/gnu/classpath -I/usr/lib/gcj-4.2.0_alpha20060909/include/c++/gnu/classpath/debug -I/usr/lib/gcj-4.2.0_alpha20060909/include/c++/gnu/classpath/jdwp -I/usr/lib/gcj-4.2.0_alpha20060909/include/c++/gnu/classpath/jdwp/event -I/usr/lib/gcj-4.2.0_alpha20060909/include/c++/gnu/classpath/jdwp/event/filters -I/usr/lib/gcj-4.2.0_alpha20060909/include/c++/gnu/classpath/jdwp/exception -I/usr/lib/gcj-4.2.0_alpha20060909/include/c++/gnu/classpath/jdwp/id -I/usr/lib/gcj-4.2.0_alpha20060909/include/c++/gnu/classpath/jdwp/processor -I/usr/lib/gcj-4.2.0_alpha20060909/include/c++/gnu/classpath/jdwp/transport -I/usr/lib/gcj-4.2.0_alpha20060909/include/c++/gnu/classpath/jdwp/util -I/usr/lib/gcj-4.2.0_alpha20060909/include/c++/gnu/gcj -I/usr/lib/gcj-4.2.0_alpha20060909/include/c++/gnu/gcj/convert -I/usr/lib/gcj-4.2.0_alpha20060909/include/c++/gnu/gcj/io -I/usr/lib/gcj-4.2.0_alpha20060909/include/c++/gnu/gcj/runtime -I/usr/lib/gcj-4.2.0_alpha20060909/include/c++/gnu/gcj/util -I/usr/lib/gcj-4.2.0_alpha20060909/include/c++/gnu/java -I/usr/lib/gcj-4.2.0_alpha20060909/include/c++/gnu/java/awt -I/usr/lib/gcj-4.2.0_alpha20060909/include/c++/gnu/java/awt/color -I/usr/lib/gcj-4.2.0_alpha20060909/include/c++/gnu/java/awt/dnd -I/usr/lib/gcj-4.2.0_alpha20060909/include/c++/gnu/java/awt/font -I/usr/lib/gcj-4.2.0_alpha20060909/include/c++/gnu/java/awt/font/opentype -I/usr/lib/gcj-4.2.0_alpha20060909/include/c++/gnu/java/awt/font/opentype/truetype -I/usr/lib/gcj-4.2.0_alpha20060909/include/c++/gnu/java/awt/image -I/usr/lib/gcj-4.2.0_alpha20060909/include/c++/gnu/java/awt/java2d -I/usr/lib/gcj-4.2.0_alpha20060909/include/c++/gnu/java/awt/peer -I/usr/lib/gcj-4.2.0_alpha20060909/include/c++/gnu/java/awt/print -I/usr/lib/gcj-4.2.0_alpha20060909/include/c++/gnu/java/io -I/usr/lib/gcj-4.2.0_alpha20060909/include/c++/gnu/java/lang -I/usr/lib/gcj-4.2.0_alpha20060909/include/c++/gnu/java/lang/management -I/usr/lib/gcj-4.2.0_alpha20060909/include/c++/gnu/java/lang/reflect -I/usr/lib/gcj-4.2.0_alpha20060909/include/c++/gnu/java/locale -I/usr/lib/gcj-4.2.0_alpha20060909/include/c++/gnu/java/math -I/usr/lib/gcj-4.2.0_alpha20060909/include/c++/gnu/java/net -I/usr/lib/gcj-4.2.0_alpha20060909/include/c++/gnu/java/net/loader -I/usr/lib/gcj-4.2.0_alpha20060909/include/c++/gnu/java/net/local -I/usr/lib/gcj-4.2.0_alpha20060909/include/c++/gnu/java/net/protocol -I/usr/lib/gcj-4.2.0_alpha20060909/include/c++/gnu/java/net/protocol/core -I/usr/lib/gcj-4.2.0_alpha20060909/include/c++/gnu/java/net/protocol/file -I/usr/lib/gcj-4.2.0_alpha20060909/include/c++/gnu/java/net/protocol/ftp -I/usr/lib/gcj-4.2.0_alpha20060909/include/c++/gnu/java/net/protocol/gcjlib -I/usr/lib/gcj-4.2.0_alpha20060909/include/c++/gnu/java/net/protocol/http -I/usr/lib/gcj-4.2.0_alpha20060909/include/c++/gnu/java/net/protocol/https -I/usr/lib/gcj-4.2.0_alpha20060909/include/c++/gnu/java/net/protocol/jar -I/usr/lib/gcj-4.2.0_alpha20060909/include/c++/gnu/java/nio -I/usr/lib/gcj-4.2.0_alpha20060909/include/c++/gnu/java/nio/channels -I/usr/lib/gcj-4.2.0_alpha20060909/include/c++/gnu/java/nio/charset -I/usr/lib/gcj-4.2.0_alpha20060909/include/c++/gnu/java/rmi -I/usr/lib/gcj-4.2.0_alpha20060909/include/c++/gnu/java/rmi/activation -I/usr/lib/gcj-4.2.0_alpha20060909/include/c++/gnu/java/rmi/dgc -I/usr/lib/gcj-4.2.0_alpha20060909/include/c++/gnu/java/rmi/registry -I/usr/lib/gcj-4.2.0_alpha20060909/include/c++/gnu/java/rmi/rmic -I/usr/lib/gcj-4.2.0_alpha20060909/include/c++/gnu/java/rmi/server -I/usr/lib/gcj-4.2.0_alpha20060909/include/c++/gnu/java/security -I/usr/lib/gcj-4.2.0_alpha20060909/include/c++/gnu/java/security/action -I/usr/lib/gcj-4.2.0_alpha20060909/include/c++/gnu/java/security/ber -I/usr/lib/gcj-4.2.0_alpha20060909/include/c++/gnu/java/security/der -I/usr/lib/gcj-4.2.0_alpha20060909/include/c++/gnu/java/security/hash -I/usr/lib/gcj-4.2.0_alpha20060909/include/c++/gnu/java/security/jce -I/usr/lib/gcj-4.2.0_alpha20060909/include/c++/gnu/java/security/jce/hash -I/usr/lib/gcj-4.2.0_alpha20060909/include/c++/gnu/java/security/jce/prng -I/usr/lib/gcj-4.2.0_alpha20060909/include/c++/gnu/java/security/jce/sig -I/usr/lib/gcj-4.2.0_alpha20060909/include/c++/gnu/java/security/key -I/usr/lib/gcj-4.2.0_alpha20060909/include/c++/gnu/java/security/key/dss -I/usr/lib/gcj-4.2.0_alpha20060909/include/c++/gnu/java/security/key/rsa -I/usr/lib/gcj-4.2.0_alpha20060909/include/c++/gnu/java/security/pkcs -I/usr/lib/gcj-4.2.0_alpha20060909/include/c++/gnu/java/security/prng -I/usr/lib/gcj-4.2.0_alpha20060909/include/c++/gnu/java/security/provider -I/usr/lib/gcj-4.2.0_alpha20060909/include/c++/gnu/java/security/sig -I/usr/lib/gcj-4.2.0_alpha20060909/include/c++/gnu/java/security/sig/dss -I/usr/lib/gcj-4.2.0_alpha20060909/include/c++/gnu/java/security/sig/rsa -I/usr/lib/gcj-4.2.0_alpha20060909/include/c++/gnu/java/security/util -I/usr/lib/gcj-4.2.0_alpha20060909/include/c++/gnu/java/security/x509 -I/usr/lib/gcj-4.2.0_alpha20060909/include/c++/gnu/java/security/x509/ext -I/usr/lib/gcj-4.2.0_alpha20060909/include/c++/gnu/java/text -I/usr/lib/gcj-4.2.0_alpha20060909/include/c++/gnu/java/util -I/usr/lib/gcj-4.2.0_alpha20060909/include/c++/gnu/java/util/jar -I/usr/lib/gcj-4.2.0_alpha20060909/include/c++/gnu/java/util/prefs -I/usr/lib/gcj-4.2.0_alpha20060909/include/c++/gnu/java/util/regex -I/usr/lib/gcj-4.2.0_alpha20060909/include/c++/gnu/javax -I/usr/lib/gcj-4.2.0_alpha20060909/include/c++/gnu/javax/crypto -I/usr/lib/gcj-4.2.0_alpha20060909/include/c++/gnu/javax/crypto/assembly -I/usr/lib/gcj-4.2.0_alpha20060909/include/c++/gnu/javax/crypto/cipher -I/usr/lib/gcj-4.2.0_alpha20060909/include/c++/gnu/javax/crypto/jce -I/usr/lib/gcj-4.2.0_alpha20060909/include/c++/gnu/javax/crypto/jce/cipher -I/usr/lib/gcj-4.2.0_alpha20060909/include/c++/gnu/javax/crypto/jce/key -I/usr/lib/gcj-4.2.0_alpha20060909/include/c++/gnu/javax/crypto/jce/keyring -I/usr/lib/gcj-4.2.0_alpha20060909/include/c++/gnu/javax/crypto/jce/mac -I/usr/lib/gcj-4.2.0_alpha20060909/include/c++/gnu/javax/crypto/jce/params -I/usr/lib/gcj-4.2.0_alpha20060909/include/c++/gnu/javax/crypto/jce/prng -I/usr/lib/gcj-4.2.0_alpha20060909/include/c++/gnu/javax/crypto/jce/sig -I/usr/lib/gcj-4.2.0_alpha20060909/include/c++/gnu/javax/crypto/jce/spec -I/usr/lib/gcj-4.2.0_alpha20060909/include/c++/gnu/javax/crypto/key -I/usr/lib/gcj-4.2.0_alpha20060909/include/c++/gnu/javax/crypto/key/dh -I/usr/lib/gcj-4.2.0_alpha20060909/include/c++/gnu/javax/crypto/key/srp6 -I/usr/lib/gcj-4.2.0_alpha20060909/include/c++/gnu/javax/crypto/keyring -I/usr/lib/gcj-4.2.0_alpha20060909/include/c++/gnu/javax/crypto/kwa -I/usr/lib/gcj-4.2.0_alpha20060909/include/c++/gnu/javax/crypto/mac -I/usr/lib/gcj-4.2.0_alpha20060909/include/c++/gnu/javax/crypto/mode -I/usr/lib/gcj-4.2.0_alpha20060909/include/c++/gnu/javax/crypto/pad -I/usr/lib/gcj-4.2.0_alpha20060909/include/c++/gnu/javax/crypto/prng -I/usr/lib/gcj-4.2.0_alpha20060909/include/c++/gnu/javax/crypto/sasl -I/usr/lib/gcj-4.2.0_alpha20060909/include/c++/gnu/javax/crypto/sasl/anonymous -I/usr/lib/gcj-4.2.0_alpha20060909/include/c++/gnu/javax/crypto/sasl/crammd5 -I/usr/lib/gcj-4.2.0_alpha20060909/include/c++/gnu/javax/crypto/sasl/plain -I/usr/lib/gcj-4.2.0_alpha20060909/include/c++/gnu/javax/crypto/sasl/srp -I/usr/lib/gcj-4.2.0_alpha20060909/include/c++/gnu/javax/imageio -I/usr/lib/gcj-4.2.0_alpha20060909/include/c++/gnu/javax/imageio/bmp -I/usr/lib/gcj-4.2.0_alpha20060909/include/c++/gnu/javax/imageio/gif -I/usr/lib/gcj-4.2.0_alpha20060909/include/c++/gnu/javax/imageio/jpeg -I/usr/lib/gcj-4.2.0_alpha20060909/include/c++/gnu/javax/imageio/png -I/usr/lib/gcj-4.2.0_alpha20060909/include/c++/gnu/javax/net -I/usr/lib/gcj-4.2.0_alpha20060909/include/c++/gnu/javax/net/ssl -I/usr/lib/gcj-4.2.0_alpha20060909/include/c++/gnu/javax/net/ssl/provider -I/usr/lib/gcj-4.2.0_alpha20060909/include/c++/gnu/javax/print -I/usr/lib/gcj-4.2.0_alpha20060909/include/c++/gnu/javax/print/ipp -I/usr/lib/gcj-4.2.0_alpha20060909/include/c++/gnu/javax/print/ipp/attribute -I/usr/lib/gcj-4.2.0_alpha20060909/include/c++/gnu/javax/print/ipp/attribute/defaults -I/usr/lib/gcj-4.2.0_alpha20060909/include/c++/gnu/javax/print/ipp/attribute/job -I/usr/lib/gcj-4.2.0_alpha20060909/include/c++/gnu/javax/print/ipp/attribute/printer -I/usr/lib/gcj-4.2.0_alpha20060909/include/c++/gnu/javax/print/ipp/attribute/supported -I/usr/lib/gcj-4.2.0_alpha20060909/include/c++/gnu/javax/security -I/usr/lib/gcj-4.2.0_alpha20060909/include/c++/gnu/javax/security/auth -I/usr/lib/gcj-4.2.0_alpha20060909/include/c++/gnu/javax/security/auth/callback -I/usr/lib/gcj-4.2.0_alpha20060909/include/c++/gnu/javax/security/auth/login -I/usr/lib/gcj-4.2.0_alpha20060909/include/c++/gnu/javax/sound -I/usr/lib/gcj-4.2.0_alpha20060909/include/c++/gnu/javax/sound/sampled -I/usr/lib/gcj-4.2.0_alpha20060909/include/c++/gnu/javax/sound/sampled/AU -I/usr/lib/gcj-4.2.0_alpha20060909/include/c++/gnu/javax/sound/sampled/WAV -I/usr/lib/gcj-4.2.0_alpha20060909/include/c++/gnu/javax/swing -I/usr/lib/gcj-4.2.0_alpha20060909/include/c++/gnu/javax/swing/plaf -I/usr/lib/gcj-4.2.0_alpha20060909/include/c++/gnu/javax/swing/plaf/gnu -I/usr/lib/gcj-4.2.0_alpha20060909/include/c++/gnu/javax/swing/plaf/metal -I/usr/lib/gcj-4.2.0_alpha20060909/include/c++/gnu/javax/swing/text -I/usr/lib/gcj-4.2.0_alpha20060909/include/c++/gnu/javax/swing/text/html -I/usr/lib/gcj-4.2.0_alpha20060909/include/c++/gnu/javax/swing/text/html/parser -I/usr/lib/gcj-4.2.0_alpha20060909/include/c++/gnu/javax/swing/text/html/parser/models -I/usr/lib/gcj-4.2.0_alpha20060909/include/c++/gnu/javax/swing/text/html/parser/support -I/usr/lib/gcj-4.2.0_alpha20060909/include/c++/gnu/javax/swing/text/html/parser/support/low -I/usr/lib/gcj-4.2.0_alpha20060909/include/c++/gnu/javax/swing/tree -I/usr/lib/gcj-4.2.0_alpha20060909/include/c++/java -I/usr/lib/gcj-4.2.0_alpha20060909/include/c++/java/applet -I/usr/lib/gcj-4.2.0_alpha20060909/include/c++/java/awt -I/usr/lib/gcj-4.2.0_alpha20060909/include/c++/java/awt/color -I/usr/lib/gcj-4.2.0_alpha20060909/include/c++/java/awt/datatransfer -I/usr/lib/gcj-4.2.0_alpha20060909/include/c++/java/awt/dnd -I/usr/lib/gcj-4.2.0_alpha20060909/include/c++/java/awt/dnd/peer -I/usr/lib/gcj-4.2.0_alpha20060909/include/c++/java/awt/event -I/usr/lib/gcj-4.2.0_alpha20060909/include/c++/java/awt/font -I/usr/lib/gcj-4.2.0_alpha20060909/include/c++/java/awt/geom -I/usr/lib/gcj-4.2.0_alpha20060909/include/c++/java/awt/im -I/usr/lib/gcj-4.2.0_alpha20060909/include/c++/java/awt/im/spi -I/usr/lib/gcj-4.2.0_alpha20060909/include/c++/java/awt/image -I/usr/lib/gcj-4.2.0_alpha20060909/include/c++/java/awt/image/renderable -I/usr/lib/gcj-4.2.0_alpha20060909/include/c++/java/awt/peer -I/usr/lib/gcj-4.2.0_alpha20060909/include/c++/java/awt/print -I/usr/lib/gcj-4.2.0_alpha20060909/include/c++/java/beans -I/usr/lib/gcj-4.2.0_alpha20060909/include/c++/java/beans/beancontext -I/usr/lib/gcj-4.2.0_alpha20060909/include/c++/java/io -I/usr/lib/gcj-4.2.0_alpha20060909/include/c++/java/lang -I/usr/lib/gcj-4.2.0_alpha20060909/include/c++/java/lang/annotation -I/usr/lib/gcj-4.2.0_alpha20060909/include/c++/java/lang/instrument -I/usr/lib/gcj-4.2.0_alpha20060909/include/c++/java/lang/management -I/usr/lib/gcj-4.2.0_alpha20060909/include/c++/java/lang/ref -I/usr/lib/gcj-4.2.0_alpha20060909/include/c++/java/lang/reflect -I/usr/lib/gcj-4.2.0_alpha20060909/include/c++/java/math -I/usr/lib/gcj-4.2.0_alpha20060909/include/c++/java/net -I/usr/lib/gcj-4.2.0_alpha20060909/include/c++/java/nio -I/usr/lib/gcj-4.2.0_alpha20060909/include/c++/java/nio/channels -I/usr/lib/gcj-4.2.0_alpha20060909/include/c++/java/nio/channels/spi -I/usr/lib/gcj-4.2.0_alpha20060909/include/c++/java/nio/charset -I/usr/lib/gcj-4.2.0_alpha20060909/include/c++/java/nio/charset/spi -I/usr/lib/gcj-4.2.0_alpha20060909/include/c++/java/rmi -I/usr/lib/gcj-4.2.0_alpha20060909/include/c++/java/rmi/activation -I/usr/lib/gcj-4.2.0_alpha20060909/include/c++/java/rmi/dgc -I/usr/lib/gcj-4.2.0_alpha20060909/include/c++/java/rmi/registry -I/usr/lib/gcj-4.2.0_alpha20060909/include/c++/java/rmi/server -I/usr/lib/gcj-4.2.0_alpha20060909/include/c++/java/security -I/usr/lib/gcj-4.2.0_alpha20060909/include/c++/java/security/acl -I/usr/lib/gcj-4.2.0_alpha20060909/include/c++/java/security/cert -I/usr/lib/gcj-4.2.0_alpha20060909/include/c++/java/security/interfaces -I/usr/lib/gcj-4.2.0_alpha20060909/include/c++/java/security/spec -I/usr/lib/gcj-4.2.0_alpha20060909/include/c++/java/sql -I/usr/lib/gcj-4.2.0_alpha20060909/include/c++/java/text -I/usr/lib/gcj-4.2.0_alpha20060909/include/c++/java/util -I/usr/lib/gcj-4.2.0_alpha20060909/include/c++/java/util/jar -I/usr/lib/gcj-4.2.0_alpha20060909/include/c++/java/util/logging -I/usr/lib/gcj-4.2.0_alpha20060909/include/c++/java/util/prefs -I/usr/lib/gcj-4.2.0_alpha20060909/include/c++/java/util/regex -I/usr/lib/gcj-4.2.0_alpha20060909/include/c++/java/util/zip -I/usr/lib/gcj-4.2.0_alpha20060909/include/c++/javax -I/usr/lib/gcj-4.2.0_alpha20060909/include/c++/javax/accessibility -I/usr/lib/gcj-4.2.0_alpha20060909/include/c++/javax/crypto -I/usr/lib/gcj-4.2.0_alpha20060909/include/c++/javax/crypto/interfaces -I/usr/lib/gcj-4.2.0_alpha20060909/include/c++/javax/crypto/spec -I/usr/lib/gcj-4.2.0_alpha20060909/include/c++/javax/management -I/usr/lib/gcj-4.2.0_alpha20060909/include/c++/javax/management/openmbean -I/usr/lib/gcj-4.2.0_alpha20060909/include/c++/javax/naming -I/usr/lib/gcj-4.2.0_alpha20060909/include/c++/javax/naming/directory -I/usr/lib/gcj-4.2.0_alpha20060909/include/c++/javax/naming/event -I/usr/lib/gcj-4.2.0_alpha20060909/include/c++/javax/naming/ldap -I/usr/lib/gcj-4.2.0_alpha20060909/include/c++/javax/naming/spi -I/usr/lib/gcj-4.2.0_alpha20060909/include/c++/javax/net -I/usr/lib/gcj-4.2.0_alpha20060909/include/c++/javax/net/ssl -I/usr/lib/gcj-4.2.0_alpha20060909/include/c++/javax/print -I/usr/lib/gcj-4.2.0_alpha20060909/include/c++/javax/print/attribute -I/usr/lib/gcj-4.2.0_alpha20060909/include/c++/javax/print/attribute/standard -I/usr/lib/gcj-4.2.0_alpha20060909/include/c++/javax/print/event -I/usr/lib/gcj-4.2.0_alpha20060909/include/c++/javax/security -I/usr/lib/gcj-4.2.0_alpha20060909/include/c++/javax/security/auth -I/usr/lib/gcj-4.2.0_alpha20060909/include/c++/javax/security/auth/callback -I/usr/lib/gcj-4.2.0_alpha20060909/include/c++/javax/security/auth/kerberos -I/usr/lib/gcj-4.2.0_alpha20060909/include/c++/javax/security/auth/login -I/usr/lib/gcj-4.2.0_alpha20060909/include/c++/javax/security/auth/spi -I/usr/lib/gcj-4.2.0_alpha20060909/include/c++/javax/security/auth/x500 -I/usr/lib/gcj-4.2.0_alpha20060909/include/c++/javax/security/cert -I/usr/lib/gcj-4.2.0_alpha20060909/include/c++/javax/security/sasl -I/usr/lib/gcj-4.2.0_alpha20060909/include/c++/javax/sound -I/usr/lib/gcj-4.2.0_alpha20060909/include/c++/javax/sound/midi -I/usr/lib/gcj-4.2.0_alpha20060909/include/c++/javax/sound/midi/spi -I/usr/lib/gcj-4.2.0_alpha20060909/include/c++/javax/sound/sampled -I/usr/lib/gcj-4.2.0_alpha20060909/include/c++/javax/sound/sampled/spi -I/usr/lib/gcj-4.2.0_alpha20060909/include/c++/javax/sql -I/usr/lib/gcj-4.2.0_alpha20060909/include/c++/javax/swing -I/usr/lib/gcj-4.2.0_alpha20060909/include/c++/javax/swing/border -I/usr/lib/gcj-4.2.0_alpha20060909/include/c++/javax/swing/colorchooser -I/usr/lib/gcj-4.2.0_alpha20060909/include/c++/javax/swing/event -I/usr/lib/gcj-4.2.0_alpha20060909/include/c++/javax/swing/filechooser -I/usr/lib/gcj-4.2.0_alpha20060909/include/c++/javax/swing/plaf -I/usr/lib/gcj-4.2.0_alpha20060909/include/c++/javax/swing/plaf/basic -I/usr/lib/gcj-4.2.0_alpha20060909/include/c++/javax/swing/plaf/metal -I/usr/lib/gcj-4.2.0_alpha20060909/include/c++/javax/swing/plaf/multi -I/usr/lib/gcj-4.2.0_alpha20060909/include/c++/javax/swing/plaf/synth -I/usr/lib/gcj-4.2.0_alpha20060909/include/c++/javax/swing/table -I/usr/lib/gcj-4.2.0_alpha20060909/include/c++/javax/swing/text -I/usr/lib/gcj-4.2.0_alpha20060909/include/c++/javax/swing/text/html -I/usr/lib/gcj-4.2.0_alpha20060909/include/c++/javax/swing/text/html/parser -I/usr/lib/gcj-4.2.0_alpha20060909/include/c++/javax/swing/text/rtf -I/usr/lib/gcj-4.2.0_alpha20060909/include/c++/javax/swing/tree -I/usr/lib/gcj-4.2.0_alpha20060909/include/c++/javax/swing/undo -I/usr/lib/gcj-4.2.0_alpha20060909/include/c++/javax/transaction -I/usr/lib/gcj-4.2.0_alpha20060909/include/c++/javax/transaction/xa -I/usr/lib/gcj-4.2.0_alpha20060909/include/c++/org -I/usr/lib/gcj-4.2.0_alpha20060909/include/c++/org/ietf -I/usr/lib/gcj-4.2.0_alpha20060909/include/c++/org/ietf/jgss -I/usr/lib/gcj-4.2.0_alpha20060909/include/gcj -I/var/tmp/portage/subversion-1.4.0/work/subversion-1.4.0/subversion/bindings/java/javahl/include -o subversion/bindings/java/javahl/native/BlameCallback.lo -c /var/tmp/portage/subversion-1.4.0/work/subversion-1.4.0/subversion/bindings/java/javahl/native/BlameCallback.cpp
In file included from /usr/lib/gcj-4.2.0_alpha20060909/include/c++/tr1/stdint.h:37,
from /usr/include/apr-0/apr.h:127,
from /usr/include/apr-0/apr_tables.h:25,
from ./subversion/include/svn_client.h:35,
from /var/tmp/portage/subversion-1.4.0/work/subversion-1.4.0/subversion/bindings/java/javahl/native/BlameCallback.h:29,
from /var/tmp/portage/subversion-1.4.0/work/subversion-1.4.0/subversion/bindings/java/javahl/native/BlameCallback.cpp:22:
/usr/lib/gcj-4.2.0_alpha20060909/include/c++/tr1/cstdint:43:1: warning: "__STDC_CONSTANT_MACROS" redefined
In file included from /usr/include/apr-0/apr_tables.h:25,
from ./subversion/include/svn_client.h:35,
from /var/tmp/portage/subversion-1.4.0/work/subversion-1.4.0/subversion/bindings/java/javahl/native/BlameCallback.h:29,
from /var/tmp/portage/subversion-1.4.0/work/subversion-1.4.0/subversion/bindings/java/javahl/native/BlameCallback.cpp:22:
/usr/include/apr-0/apr.h:123:1: warning: this is the location of the previous definition
/usr/include/apr-0/apr.h:400:2: error: #error no decision has been made on APR_PATH_MAX for your platform
/usr/lib/gcj-4.2.0_alpha20060909/include/c++/i686-pc-linux-gnu/bits/c++config.h:143: error: expected `=' before '__attribute__'
/usr/lib/gcj-4.2.0_alpha20060909/include/c++/i686-pc-linux-gnu/bits/c++config.h:143: error: expected identifier before '__attribute__'
/usr/lib/gcj-4.2.0_alpha20060909/include/c++/i686-pc-linux-gnu/bits/c++config.h:143: error: expected `;' before '__attribute__'
/usr/lib/gcj-4.2.0_alpha20060909/include/c++/i686-pc-linux-gnu/bits/c++config.h:143: error: expected unqualified-id before '{' token
/usr/lib/gcj-4.2.0_alpha20060909/include/c++/cstddef:53: error: expected `=' before '__attribute__'
/usr/lib/gcj-4.2.0_alpha20060909/include/c++/cstddef:53: error: expected identifier before '__attribute__'
/usr/lib/gcj-4.2.0_alpha20060909/include/c++/cstddef:53: error: expected `;' before '__attribute__'
/usr/lib/gcj-4.2.0_alpha20060909/include/c++/cstddef:53: error: expected unqualified-id before '{' token
/usr/lib/gcj-4.2.0_alpha20060909/include/c++/cstdio:98: error: expected `=' before '__attribute__'
/usr/lib/gcj-4.2.0_alpha20060909/include/c++/cstdio:98: error: expected identifier before '__attribute__'
/usr/lib/gcj-4.2.0_alpha20060909/include/c++/cstdio:98: error: expected `;' before '__attribute__'
/usr/lib/gcj-4.2.0_alpha20060909/include/c++/cstdio:98: error: expected unqualified-id before '{' token
/usr/lib/gcj-4.2.0_alpha20060909/include/c++/cstdio:155: error: expected `=' before '__attribute__'
/usr/lib/gcj-4.2.0_alpha20060909/include/c++/cstdio:155: error: expected identifier before '__attribute__'
/usr/lib/gcj-4.2.0_alpha20060909/include/c++/cstdio:155: error: expected `;' before '__attribute__'
/usr/lib/gcj-4.2.0_alpha20060909/include/c++/cstdio:155: error: expected unqualified-id before '{' token
/usr/lib/gcj-4.2.0_alpha20060909/include/c++/cstdio:179: error: expected `=' before '__attribute__'
/usr/lib/gcj-4.2.0_alpha20060909/include/c++/cstdio:179: error: expected identifier before '__attribute__'
/usr/lib/gcj-4.2.0_alpha20060909/include/c++/cstdio:179: error: expected `;' before '__attribute__'
/usr/lib/gcj-4.2.0_alpha20060909/include/c++/cstdio:179: error: expected unqualified-id before '{' token
/usr/lib/gcj-4.2.0_alpha20060909/include/c++/tr1/cstdio:43: error: expected `=' before '__attribute__'
/usr/lib/gcj-4.2.0_alpha20060909/include/c++/tr1/cstdio:43: error: expected identifier before '__attribute__'
/usr/lib/gcj-4.2.0_alpha20060909/include/c++/tr1/cstdio:43: error: expected `;' before '__attribute__'
/usr/lib/gcj-4.2.0_alpha20060909/include/c++/tr1/cstdio:43: error: expected unqualified-id before '{' token
/usr/lib/gcj-4.2.0_alpha20060909/include/c++/cstdarg:58: error: expected `=' before '__attribute__'
/usr/lib/gcj-4.2.0_alpha20060909/include/c++/cstdarg:58: error: expected identifier before '__attribute__'
/usr/lib/gcj-4.2.0_alpha20060909/include/c++/cstdarg:58: error: expected `;' before '__attribute__'
/usr/lib/gcj-4.2.0_alpha20060909/include/c++/cstdarg:58: error: expected unqualified-id before '{' token
/usr/lib/gcj-4.2.0_alpha20060909/include/jni.h:257: error: 'va_list' has not been declared
/usr/lib/gcj-4.2.0_alpha20060909/include/jni.h:268: error: 'va_list' has not been declared
/usr/lib/gcj-4.2.0_alpha20060909/include/jni.h:274: error: 'va_list' has not been declared
/usr/lib/gcj-4.2.0_alpha20060909/include/jni.h:279: error: 'va_list' has not been declared
/usr/lib/gcj-4.2.0_alpha20060909/include/jni.h:284: error: 'va_list' has not been declared
/usr/lib/gcj-4.2.0_alpha20060909/include/jni.h:289: error: 'va_list' has not been declared
/usr/lib/gcj-4.2.0_alpha20060909/include/jni.h:294: error: 'va_list' has not been declared
/usr/lib/gcj-4.2.0_alpha20060909/include/jni.h:299: error: 'va_list' has not been declared
/usr/lib/gcj-4.2.0_alpha20060909/include/jni.h:304: error: 'va_list' has not been declared
/usr/lib/gcj-4.2.0_alpha20060909/include/jni.h:309: error: 'va_list' has not been declared
/usr/lib/gcj-4.2.0_alpha20060909/include/jni.h:314: error: 'va_list' has not been declared
/usr/lib/gcj-4.2.0_alpha20060909/include/jni.h:321: error: 'va_list' has not been declared
/usr/lib/gcj-4.2.0_alpha20060909/include/jni.h:327: error: 'va_list' has not been declared
/usr/lib/gcj-4.2.0_alpha20060909/include/jni.h:333: error: 'va_list' has not been declared
/usr/lib/gcj-4.2.0_alpha20060909/include/jni.h:339: error: 'va_list' has not been declared
/usr/lib/gcj-4.2.0_alpha20060909/include/jni.h:345: error: 'va_list' has not been declared
/usr/lib/gcj-4.2.0_alpha20060909/include/jni.h:351: error: 'va_list' has not been declared
/usr/lib/gcj-4.2.0_alpha20060909/include/jni.h:357: error: 'va_list' has not been declared
/usr/lib/gcj-4.2.0_alpha20060909/include/jni.h:363: error: 'va_list' has not been declared
/usr/lib/gcj-4.2.0_alpha20060909/include/jni.h:369: error: 'va_list' has not been declared
/usr/lib/gcj-4.2.0_alpha20060909/include/jni.h:375: error: 'va_list' has not been declared
/usr/lib/gcj-4.2.0_alpha20060909/include/jni.h:417: error: 'va_list' has not been declared
/usr/lib/gcj-4.2.0_alpha20060909/include/jni.h:423: error: 'va_list' has not been declared
/usr/lib/gcj-4.2.0_alpha20060909/include/jni.h:429: error: 'va_list' has not been declared
/usr/lib/gcj-4.2.0_alpha20060909/include/jni.h:435: error: 'va_list' has not been declared
/usr/lib/gcj-4.2.0_alpha20060909/include/jni.h:441: error: 'va_list' has not been declared
/usr/lib/gcj-4.2.0_alpha20060909/include/jni.h:447: error: 'va_list' has not been declared
/usr/lib/gcj-4.2.0_alpha20060909/include/jni.h:453: error: 'va_list' has not been declared
/usr/lib/gcj-4.2.0_alpha20060909/include/jni.h:459: error: 'va_list' has not been declared
/usr/lib/gcj-4.2.0_alpha20060909/include/jni.h:465: error: 'va_list' has not been declared
/usr/lib/gcj-4.2.0_alpha20060909/include/jni.h:471: error: 'va_list' has not been declared
/usr/lib/gcj-4.2.0_alpha20060909/include/jni.h:727: error: 'va_list' has not been declared
/usr/lib/gcj-4.2.0_alpha20060909/include/jni.h:751: error: 'va_list' has not been declared
/usr/lib/gcj-4.2.0_alpha20060909/include/jni.h:766: error: 'va_list' has not been declared
/usr/lib/gcj-4.2.0_alpha20060909/include/jni.h:781: error: 'va_list' has not been declared
/usr/lib/gcj-4.2.0_alpha20060909/include/jni.h:796: error: 'va_list' has not been declared
/usr/lib/gcj-4.2.0_alpha20060909/include/jni.h:811: error: 'va_list' has not been declared
/usr/lib/gcj-4.2.0_alpha20060909/include/jni.h:826: error: 'va_list' has not been declared
/usr/lib/gcj-4.2.0_alpha20060909/include/jni.h:841: error: 'va_list' has not been declared
/usr/lib/gcj-4.2.0_alpha20060909/include/jni.h:856: error: 'va_list' has not been declared
/usr/lib/gcj-4.2.0_alpha20060909/include/jni.h:871: error: 'va_list' has not been declared
/usr/lib/gcj-4.2.0_alpha20060909/include/jni.h:885: error: 'va_list' has not been declared
/usr/lib/gcj-4.2.0_alpha20060909/include/jni.h:900: error: 'va_list' has not been declared
/usr/lib/gcj-4.2.0_alpha20060909/include/jni.h:915: error: 'va_list' has not been declared
/usr/lib/gcj-4.2.0_alpha20060909/include/jni.h:930: error: 'va_list' has not been declared
/usr/lib/gcj-4.2.0_alpha20060909/include/jni.h:945: error: 'va_list' has not been declared
/usr/lib/gcj-4.2.0_alpha20060909/include/jni.h:960: error: 'va_list' has not been declared
/usr/lib/gcj-4.2.0_alpha20060909/include/jni.h:975: error: 'va_list' has not been declared
/usr/lib/gcj-4.2.0_alpha20060909/include/jni.h:990: error: 'va_list' has not been declared
/usr/lib/gcj-4.2.0_alpha20060909/include/jni.h:1005: error: 'va_list' has not been declared
/usr/lib/gcj-4.2.0_alpha20060909/include/jni.h:1020: error: 'va_list' has not been declared
/usr/lib/gcj-4.2.0_alpha20060909/include/jni.h:1034: error: 'va_list' has not been declared
/usr/lib/gcj-4.2.0_alpha20060909/include/jni.h:1109: error: 'va_list' has not been declared
/usr/lib/gcj-4.2.0_alpha20060909/include/jni.h:1124: error: 'va_list' has not been declared
/usr/lib/gcj-4.2.0_alpha20060909/include/jni.h:1139: error: 'va_list' has not been declared
/usr/lib/gcj-4.2.0_alpha20060909/include/jni.h:1154: error: 'va_list' has not been declared
/usr/lib/gcj-4.2.0_alpha20060909/include/jni.h:1169: error: 'va_list' has not been declared
/usr/lib/gcj-4.2.0_alpha20060909/include/jni.h:1184: error: 'va_list' has not been declared
/usr/lib/gcj-4.2.0_alpha20060909/include/jni.h:1199: error: 'va_list' has not been declared
/usr/lib/gcj-4.2.0_alpha20060909/include/jni.h:1214: error: 'va_list' has not been declared
/usr/lib/gcj-4.2.0_alpha20060909/include/jni.h:1229: error: 'va_list' has not been declared
/usr/lib/gcj-4.2.0_alpha20060909/include/jni.h:1243: error: 'va_list' has not been declared
/usr/lib/gcj-4.2.0_alpha20060909/include/jni.h: In member function '__jobject* _Jv_JNIEnv::NewObject(__jclass*, _jmethodID*, ...)':
/usr/lib/gcj-4.2.0_alpha20060909/include/jni.h:720: error: 'va_list' was not declared in this scope
/usr/lib/gcj-4.2.0_alpha20060909/include/jni.h:720: error: expected `;' before 'args'
/usr/lib/gcj-4.2.0_alpha20060909/include/jni.h:721: error: 'args' was not declared in this scope
/usr/lib/gcj-4.2.0_alpha20060909/include/jni.h:721: error: 'va_start' was not declared in this scope
/usr/lib/gcj-4.2.0_alpha20060909/include/jni.h:723: error: 'va_end' was not declared in this scope
/usr/lib/gcj-4.2.0_alpha20060909/include/jni.h: In member function '__jobject* _Jv_JNIEnv::CallObjectMethod(__jobject*, _jmethodID*, ...)':
/usr/lib/gcj-4.2.0_alpha20060909/include/jni.h:744: error: 'va_list' was not declared in this scope
/usr/lib/gcj-4.2.0_alpha20060909/include/jni.h:744: error: expected `;' before 'args'
/usr/lib/gcj-4.2.0_alpha20060909/include/jni.h:745: error: 'args' was not declared in this scope
/usr/lib/gcj-4.2.0_alpha20060909/include/jni.h:745: error: 'va_start' was not declared in this scope
/usr/lib/gcj-4.2.0_alpha20060909/include/jni.h:747: error: 'va_end' was not declared in this scope
/usr/lib/gcj-4.2.0_alpha20060909/include/jni.h: In member function 'jboolean _Jv_JNIEnv::CallBooleanMethod(__jobject*, _jmethodID*, ...)':
/usr/lib/gcj-4.2.0_alpha20060909/include/jni.h:759: error: 'va_list' was not declared in this scope
/usr/lib/gcj-4.2.0_alpha20060909/include/jni.h:759: error: expected `;' before 'args'
/usr/lib/gcj-4.2.0_alpha20060909/include/jni.h:760: error: 'args' was not declared in this scope
/usr/lib/gcj-4.2.0_alpha20060909/include/jni.h:760: error: 'va_start' was not declared in this scope
/usr/lib/gcj-4.2.0_alpha20060909/include/jni.h:762: error: 'va_end' was not declared in this scope
/usr/lib/gcj-4.2.0_alpha20060909/include/jni.h: In member function 'jbyte _Jv_JNIEnv::CallByteMethod(__jobject*, _jmethodID*, ...)':
/usr/lib/gcj-4.2.0_alpha20060909/include/jni.h:774: error: 'va_list' was not declared in this scope
/usr/lib/gcj-4.2.0_alpha20060909/include/jni.h:774: error: expected `;' before 'args'
/usr/lib/gcj-4.2.0_alpha20060909/include/jni.h:775: error: 'args' was not declared in this scope
/usr/lib/gcj-4.2.0_alpha20060909/include/jni.h:775: error: 'va_start' was not declared in this scope
/usr/lib/gcj-4.2.0_alpha20060909/include/jni.h:777: error: 'va_end' was not declared in this scope
/usr/lib/gcj-4.2.0_alpha20060909/include/jni.h: In member function 'jchar _Jv_JNIEnv::CallCharMethod(__jobject*, _jmethodID*, ...)':
/usr/lib/gcj-4.2.0_alpha20060909/include/jni.h:789: error: 'va_list' was not declared in this scope
/usr/lib/gcj-4.2.0_alpha20060909/include/jni.h:789: error: expected `;' before 'args'
/usr/lib/gcj-4.2.0_alpha20060909/include/jni.h:790: error: 'args' was not declared in this scope
/usr/lib/gcj-4.2.0_alpha20060909/include/jni.h:790: error: 'va_start' was not declared in this scope
/usr/lib/gcj-4.2.0_alpha20060909/include/jni.h:792: error: 'va_end' was not declared in this scope
/usr/lib/gcj-4.2.0_alpha20060909/include/jni.h: In member function 'jshort _Jv_JNIEnv::CallShortMethod(__jobject*, _jmethodID*, ...)':
/usr/lib/gcj-4.2.0_alpha20060909/include/jni.h:804: error: 'va_list' was not declared in this scope
/usr/lib/gcj-4.2.0_alpha20060909/include/jni.h:804: error: expected `;' before 'args'
/usr/lib/gcj-4.2.0_alpha20060909/include/jni.h:805: error: 'args' was not declared in this scope
/usr/lib/gcj-4.2.0_alpha20060909/include/jni.h:805: error: 'va_start' was not declared in this scope
/usr/lib/gcj-4.2.0_alpha20060909/include/jni.h:807: error: 'va_end' was not declared in this scope
/usr/lib/gcj-4.2.0_alpha20060909/include/jni.h: In member function 'jint _Jv_JNIEnv::CallIntMethod(__jobject*, _jmethodID*, ...)':
/usr/lib/gcj-4.2.0_alpha20060909/include/jni.h:819: error: 'va_list' was not declared in this scope
/usr/lib/gcj-4.2.0_alpha20060909/include/jni.h:819: error: expected `;' before 'args'
/usr/lib/gcj-4.2.0_alpha20060909/include/jni.h:820: error: 'args' was not declared in this scope
/usr/lib/gcj-4.2.0_alpha20060909/include/jni.h:820: error: 'va_start' was not declared in this scope
/usr/lib/gcj-4.2.0_alpha20060909/include/jni.h:822: error: 'va_end' was not declared in this scope
/usr/lib/gcj-4.2.0_alpha20060909/include/jni.h: In member function 'jlong _Jv_JNIEnv::CallLongMethod(__jobject*, _jmethodID*, ...)':
/usr/lib/gcj-4.2.0_alpha20060909/include/jni.h:834: error: 'va_list' was not declared in this scope
/usr/lib/gcj-4.2.0_alpha20060909/include/jni.h:834: error: expected `;' before 'args'
/usr/lib/gcj-4.2.0_alpha20060909/include/jni.h:835: error: 'args' was not declared in this scope
/usr/lib/gcj-4.2.0_alpha20060909/include/jni.h:835: error: 'va_start' was not declared in this scope
/usr/lib/gcj-4.2.0_alpha20060909/include/jni.h:837: error: 'va_end' was not declared in this scope
/usr/lib/gcj-4.2.0_alpha20060909/include/jni.h: In member function 'jfloat _Jv_JNIEnv::CallFloatMethod(__jobject*, _jmethodID*, ...)':
/usr/lib/gcj-4.2.0_alpha20060909/include/jni.h:849: error: 'va_list' was not declared in this scope
/usr/lib/gcj-4.2.0_alpha20060909/include/jni.h:849: error: expected `;' before 'args'
/usr/lib/gcj-4.2.0_alpha20060909/include/jni.h:850: error: 'args' was not declared in this scope
/usr/lib/gcj-4.2.0_alpha20060909/include/jni.h:850: error: 'va_start' was not declared in this scope
/usr/lib/gcj-4.2.0_alpha20060909/include/jni.h:852: error: 'va_end' was not declared in this scope
/usr/lib/gcj-4.2.0_alpha20060909/include/jni.h: In member function 'jdouble _Jv_JNIEnv::CallDoubleMethod(__jobject*, _jmethodID*, ...)':
/usr/lib/gcj-4.2.0_alpha20060909/include/jni.h:864: error: 'va_list' was not declared in this scope
/usr/lib/gcj-4.2.0_alpha20060909/include/jni.h:864: error: expected `;' before 'args'
/usr/lib/gcj-4.2.0_alpha20060909/include/jni.h:865: error: 'args' was not declared in this scope
/usr/lib/gcj-4.2.0_alpha20060909/include/jni.h:865: error: 'va_start' was not declared in this scope
/usr/lib/gcj-4.2.0_alpha20060909/include/jni.h:867: error: 'va_end' was not declared in this scope
/usr/lib/gcj-4.2.0_alpha20060909/include/jni.h: In member function 'void _Jv_JNIEnv::CallVoidMethod(__jobject*, _jmethodID*, ...)':
/usr/lib/gcj-4.2.0_alpha20060909/include/jni.h:879: error: 'va_list' was not declared in this scope
/usr/lib/gcj-4.2.0_alpha20060909/include/jni.h:879: error: expected `;' before 'args'
/usr/lib/gcj-4.2.0_alpha20060909/include/jni.h:880: error: 'args' was not declared in this scope
/usr/lib/gcj-4.2.0_alpha20060909/include/jni.h:880: error: 'va_start' was not declared in this scope
/usr/lib/gcj-4.2.0_alpha20060909/include/jni.h:882: error: 'va_end' was not declared in this scope
/usr/lib/gcj-4.2.0_alpha20060909/include/jni.h: In member function '__jobject* _Jv_JNIEnv::CallNonvirtualObjectMethod(__jobject*, __jclass*, _jmethodID*, ...)':
/usr/lib/gcj-4.2.0_alpha20060909/include/jni.h:893: error: 'va_list' was not declared in this scope
/usr/lib/gcj-4.2.0_alpha20060909/include/jni.h:893: error: expected `;' before 'args'
/usr/lib/gcj-4.2.0_alpha20060909/include/jni.h:894: error: 'args' was not declared in this scope
/usr/lib/gcj-4.2.0_alpha20060909/include/jni.h:894: error: 'va_start' was not declared in this scope
/usr/lib/gcj-4.2.0_alpha20060909/include/jni.h:896: error: 'va_end' was not declared in this scope
/usr/lib/gcj-4.2.0_alpha20060909/include/jni.h: In member function 'jboolean _Jv_JNIEnv::CallNonvirtualBooleanMethod(__jobject*, __jclass*, _jmethodID*, ...)':
/usr/lib/gcj-4.2.0_alpha20060909/include/jni.h:908: error: 'va_list' was not declared in this scope
/usr/lib/gcj-4.2.0_alpha20060909/include/jni.h:908: error: expected `;' before 'args'
/usr/lib/gcj-4.2.0_alpha20060909/include/jni.h:909: error: 'args' was not declared in this scope
/usr/lib/gcj-4.2.0_alpha20060909/include/jni.h:909: error: 'va_start' was not declared in this scope
/usr/lib/gcj-4.2.0_alpha20060909/include/jni.h:911: error: 'va_end' was not declared in this scope
/usr/lib/gcj-4.2.0_alpha20060909/include/jni.h: In member function 'jbyte _Jv_JNIEnv::CallNonvirtualByteMethod(__jobject*, __jclass*, _jmethodID*, ...)':
/usr/lib/gcj-4.2.0_alpha20060909/include/jni.h:923: error: 'va_list' was not declared in this scope
/usr/lib/gcj-4.2.0_alpha20060909/include/jni.h:923: error: expected `;' before 'args'
/usr/lib/gcj-4.2.0_alpha20060909/include/jni.h:924: error: 'args' was not declared in this scope
/usr/lib/gcj-4.2.0_alpha20060909/include/jni.h:924: error: 'va_start' was not declared in this scope
/usr/lib/gcj-4.2.0_alpha20060909/include/jni.h:926: error: 'va_end' was not declared in this scope
/usr/lib/gcj-4.2.0_alpha20060909/include/jni.h: In member function 'jchar _Jv_JNIEnv::CallNonvirtualCharMethod(__jobject*, __jclass*, _jmethodID*, ...)':
/usr/lib/gcj-4.2.0_alpha20060909/include/jni.h:938: error: 'va_list' was not declared in this scope
/usr/lib/gcj-4.2.0_alpha20060909/include/jni.h:938: error: expected `;' before 'args'
/usr/lib/gcj-4.2.0_alpha20060909/include/jni.h:939: error: 'args' was not declared in this scope
/usr/lib/gcj-4.2.0_alpha20060909/include/jni.h:939: error: 'va_start' was not declared in this scope
/usr/lib/gcj-4.2.0_alpha20060909/include/jni.h:941: error: 'va_end' was not declared in this scope
/usr/lib/gcj-4.2.0_alpha20060909/include/jni.h: In member function 'jshort _Jv_JNIEnv::CallNonvirtualShortMethod(__jobject*, __jclass*, _jmethodID*, ...)':
/usr/lib/gcj-4.2.0_alpha20060909/include/jni.h:953: error: 'va_list' was not declared in this scope
/usr/lib/gcj-4.2.0_alpha20060909/include/jni.h:953: error: expected `;' before 'args'
/usr/lib/gcj-4.2.0_alpha20060909/include/jni.h:954: error: 'args' was not declared in this scope
/usr/lib/gcj-4.2.0_alpha20060909/include/jni.h:954: error: 'va_start' was not declared in this scope
/usr/lib/gcj-4.2.0_alpha20060909/include/jni.h:956: error: 'va_end' was not declared in this scope
/usr/lib/gcj-4.2.0_alpha20060909/include/jni.h: In member function 'jint _Jv_JNIEnv::CallNonvirtualIntMethod(__jobject*, __jclass*, _jmethodID*, ...)':
/usr/lib/gcj-4.2.0_alpha20060909/include/jni.h:968: error: 'va_list' was not declared in this scope
/usr/lib/gcj-4.2.0_alpha20060909/include/jni.h:968: error: expected `;' before 'args'
/usr/lib/gcj-4.2.0_alpha20060909/include/jni.h:969: error: 'args' was not declared in this scope
/usr/lib/gcj-4.2.0_alpha20060909/include/jni.h:969: error: 'va_start' was not declared in this scope
/usr/lib/gcj-4.2.0_alpha20060909/include/jni.h:971: error: 'va_end' was not declared in this scope
/usr/lib/gcj-4.2.0_alpha20060909/include/jni.h: In member function 'jlong _Jv_JNIEnv::CallNonvirtualLongMethod(__jobject*, __jclass*, _jmethodID*, ...)':
/usr/lib/gcj-4.2.0_alpha20060909/include/jni.h:983: error: 'va_list' was not declared in this scope
/usr/lib/gcj-4.2.0_alpha20060909/include/jni.h:983: error: expected `;' before 'args'
/usr/lib/gcj-4.2.0_alpha20060909/include/jni.h:984: error: 'args' was not declared in this scope
/usr/lib/gcj-4.2.0_alpha20060909/include/jni.h:984: error: 'va_start' was not declared in this scope
/usr/lib/gcj-4.2.0_alpha20060909/include/jni.h:986: error: 'va_end' was not declared in this scope
/usr/lib/gcj-4.2.0_alpha20060909/include/jni.h: In member function 'jfloat _Jv_JNIEnv::CallNonvirtualFloatMethod(__jobject*, __jclass*, _jmethodID*, ...)':
/usr/lib/gcj-4.2.0_alpha20060909/include/jni.h:998: error: 'va_list' was not declared in this scope
/usr/lib/gcj-4.2.0_alpha20060909/include/jni.h:998: error: expected `;' before 'args'
/usr/lib/gcj-4.2.0_alpha20060909/include/jni.h:999: error: 'args' was not declared in this scope
/usr/lib/gcj-4.2.0_alpha20060909/include/jni.h:999: error: 'va_start' was not declared in this scope
/usr/lib/gcj-4.2.0_alpha20060909/include/jni.h:1001: error: 'va_end' was not declared in this scope
/usr/lib/gcj-4.2.0_alpha20060909/include/jni.h: In member function 'jdouble _Jv_JNIEnv::CallNonvirtualDoubleMethod(__jobject*, __jclass*, _jmethodID*, ...)':
/usr/lib/gcj-4.2.0_alpha20060909/include/jni.h:1013: error: 'va_list' was not declared in this scope
/usr/lib/gcj-4.2.0_alpha20060909/include/jni.h:1013: error: expected `;' before 'args'
/usr/lib/gcj-4.2.0_alpha20060909/include/jni.h:1014: error: 'args' was not declared in this scope
/usr/lib/gcj-4.2.0_alpha20060909/include/jni.h:1014: error: 'va_start' was not declared in this scope
/usr/lib/gcj-4.2.0_alpha20060909/include/jni.h:1016: error: 'va_end' was not declared in this scope
/usr/lib/gcj-4.2.0_alpha20060909/include/jni.h: In member function 'void _Jv_JNIEnv::CallNonvirtualVoidMethod(__jobject*, __jclass*, _jmethodID*, ...)':
/usr/lib/gcj-4.2.0_alpha20060909/include/jni.h:1028: error: 'va_list' was not declared in this scope
/usr/lib/gcj-4.2.0_alpha20060909/include/jni.h:1028: error: expected `;' before 'args'
/usr/lib/gcj-4.2.0_alpha20060909/include/jni.h:1029: error: 'args' was not declared in this scope
/usr/lib/gcj-4.2.0_alpha20060909/include/jni.h:1029: error: 'va_start' was not declared in this scope
/usr/lib/gcj-4.2.0_alpha20060909/include/jni.h:1031: error: 'va_end' was not declared in this scope
/usr/lib/gcj-4.2.0_alpha20060909/include/jni.h: In member function '__jobject* _Jv_JNIEnv::CallStaticObjectMethod(__jclass*, _jmethodID*, ...)':
/usr/lib/gcj-4.2.0_alpha20060909/include/jni.h:1102: error: 'va_list' was not declared in this scope
/usr/lib/gcj-4.2.0_alpha20060909/include/jni.h:1102: error: expected `;' before 'args'
/usr/lib/gcj-4.2.0_alpha20060909/include/jni.h:1103: error: 'args' was not declared in this scope
/usr/lib/gcj-4.2.0_alpha20060909/include/jni.h:1103: error: 'va_start' was not declared in this scope
/usr/lib/gcj-4.2.0_alpha20060909/include/jni.h:1105: error: 'va_end' was not declared in this scope
/usr/lib/gcj-4.2.0_alpha20060909/include/jni.h: In member function 'jboolean _Jv_JNIEnv::CallStaticBooleanMethod(__jclass*, _jmethodID*, ...)':
/usr/lib/gcj-4.2.0_alpha20060909/include/jni.h:1117: error: 'va_list' was not declared in this scope
/usr/lib/gcj-4.2.0_alpha20060909/include/jni.h:1117: error: expected `;' before 'args'
/usr/lib/gcj-4.2.0_alpha20060909/include/jni.h:1118: error: 'args' was not declared in this scope
/usr/lib/gcj-4.2.0_alpha20060909/include/jni.h:1118: error: 'va_start' was not declared in this scope
/usr/lib/gcj-4.2.0_alpha20060909/include/jni.h:1120: error: 'va_end' was not declared in this scope
/usr/lib/gcj-4.2.0_alpha20060909/include/jni.h: In member function 'jbyte _Jv_JNIEnv::CallStaticByteMethod(__jclass*, _jmethodID*, ...)':
/usr/lib/gcj-4.2.0_alpha20060909/include/jni.h:1132: error: 'va_list' was not declared in this scope
/usr/lib/gcj-4.2.0_alpha20060909/include/jni.h:1132: error: expected `;' before 'args'
/usr/lib/gcj-4.2.0_alpha20060909/include/jni.h:1133: error: 'args' was not declared in this scope
/usr/lib/gcj-4.2.0_alpha20060909/include/jni.h:1133: error: 'va_start' was not declared in this scope
/usr/lib/gcj-4.2.0_alpha20060909/include/jni.h:1135: error: 'va_end' was not declared in this scope
/usr/lib/gcj-4.2.0_alpha20060909/include/jni.h: In member function 'jchar _Jv_JNIEnv::CallStaticCharMethod(__jclass*, _jmethodID*, ...)':
/usr/lib/gcj-4.2.0_alpha20060909/include/jni.h:1147: error: 'va_list' was not declared in this scope
/usr/lib/gcj-4.2.0_alpha20060909/include/jni.h:1147: error: expected `;' before 'args'
/usr/lib/gcj-4.2.0_alpha20060909/include/jni.h:1148: error: 'args' was not declared in this scope
/usr/lib/gcj-4.2.0_alpha20060909/include/jni.h:1148: error: 'va_start' was not declared in this scope
/usr/lib/gcj-4.2.0_alpha20060909/include/jni.h:1150: error: 'va_end' was not declared in this scope
/usr/lib/gcj-4.2.0_alpha20060909/include/jni.h: In member function 'jshort _Jv_JNIEnv::CallStaticShortMethod(__jclass*, _jmethodID*, ...)':
/usr/lib/gcj-4.2.0_alpha20060909/include/jni.h:1162: error: 'va_list' was not declared in this scope
/usr/lib/gcj-4.2.0_alpha20060909/include/jni.h:1162: error: expected `;' before 'args'
/usr/lib/gcj-4.2.0_alpha20060909/include/jni.h:1163: error: 'args' was not declared in this scope
/usr/lib/gcj-4.2.0_alpha20060909/include/jni.h:1163: error: 'va_start' was not declared in this scope
/usr/lib/gcj-4.2.0_alpha20060909/include/jni.h:1165: error: 'va_end' was not declared in this scope
/usr/lib/gcj-4.2.0_alpha20060909/include/jni.h: In member function 'jint _Jv_JNIEnv::CallStaticIntMethod(__jclass*, _jmethodID*, ...)':
/usr/lib/gcj-4.2.0_alpha20060909/include/jni.h:1177: error: 'va_list' was not declared in this scope
/usr/lib/gcj-4.2.0_alpha20060909/include/jni.h:1177: error: expected `;' before 'args'
/usr/lib/gcj-4.2.0_alpha20060909/include/jni.h:1178: error: 'args' was not declared in this scope
/usr/lib/gcj-4.2.0_alpha20060909/include/jni.h:1178: error: 'va_start' was not declared in this scope
/usr/lib/gcj-4.2.0_alpha20060909/include/jni.h:1180: error: 'va_end' was not declared in this scope
/usr/lib/gcj-4.2.0_alpha20060909/include/jni.h: In member function 'jlong _Jv_JNIEnv::CallStaticLongMethod(__jclass*, _jmethodID*, ...)':
/usr/lib/gcj-4.2.0_alpha20060909/include/jni.h:1192: error: 'va_list' was not declared in this scope
/usr/lib/gcj-4.2.0_alpha20060909/include/jni.h:1192: error: expected `;' before 'args'
/usr/lib/gcj-4.2.0_alpha20060909/include/jni.h:1193: error: 'args' was not declared in this scope
/usr/lib/gcj-4.2.0_alpha20060909/include/jni.h:1193: error: 'va_start' was not declared in this scope
/usr/lib/gcj-4.2.0_alpha20060909/include/jni.h:1195: error: 'va_end' was not declared in this scope
/usr/lib/gcj-4.2.0_alpha20060909/include/jni.h: In member function 'jfloat _Jv_JNIEnv::CallStaticFloatMethod(__jclass*, _jmethodID*, ...)':
/usr/lib/gcj-4.2.0_alpha20060909/include/jni.h:1207: error: 'va_list' was not declared in this scope
/usr/lib/gcj-4.2.0_alpha20060909/include/jni.h:1207: error: expected `;' before 'args'
/usr/lib/gcj-4.2.0_alpha20060909/include/jni.h:1208: error: 'args' was not declared in this scope
/usr/lib/gcj-4.2.0_alpha20060909/include/jni.h:1208: error: 'va_start' was not declared in this scope
/usr/lib/gcj-4.2.0_alpha20060909/include/jni.h:1210: error: 'va_end' was not declared in this scope
/usr/lib/gcj-4.2.0_alpha20060909/include/jni.h: In member function 'jdouble _Jv_JNIEnv::CallStaticDoubleMethod(__jclass*, _jmethodID*, ...)':
/usr/lib/gcj-4.2.0_alpha20060909/include/jni.h:1222: error: 'va_list' was not declared in this scope
/usr/lib/gcj-4.2.0_alpha20060909/include/jni.h:1222: error: expected `;' before 'args'
/usr/lib/gcj-4.2.0_alpha20060909/include/jni.h:1223: error: 'args' was not declared in this scope
/usr/lib/gcj-4.2.0_alpha20060909/include/jni.h:1223: error: 'va_start' was not declared in this scope
/usr/lib/gcj-4.2.0_alpha20060909/include/jni.h:1225: error: 'va_end' was not declared in this scope
/usr/lib/gcj-4.2.0_alpha20060909/include/jni.h: In member function 'void _Jv_JNIEnv::CallStaticVoidMethod(__jclass*, _jmethodID*, ...)':
/usr/lib/gcj-4.2.0_alpha20060909/include/jni.h:1237: error: 'va_list' was not declared in this scope
/usr/lib/gcj-4.2.0_alpha20060909/include/jni.h:1237: error: expected `;' before 'args'
/usr/lib/gcj-4.2.0_alpha20060909/include/jni.h:1238: error: 'args' was not declared in this scope
/usr/lib/gcj-4.2.0_alpha20060909/include/jni.h:1238: error: 'va_start' was not declared in this scope
/usr/lib/gcj-4.2.0_alpha20060909/include/jni.h:1240: error: 'va_end' was not declared in this scope
/usr/lib/gcj-4.2.0_alpha20060909/include/jni.h: At global scope:
/usr/lib/gcj-4.2.0_alpha20060909/include/jni.h:1607: error: 'FILE' has not been declared
/usr/lib/gcj-4.2.0_alpha20060909/include/jni.h:1607: error: 'va_list' has not been declared
/usr/lib/gcj-4.2.0_alpha20060909/include/c++/tr1/cstdint:49: error: expected `=' before '__attribute__'
/usr/lib/gcj-4.2.0_alpha20060909/include/c++/tr1/cstdint:49: error: expected identifier before '__attribute__'
/usr/lib/gcj-4.2.0_alpha20060909/include/c++/tr1/cstdint:49: error: expected `;' before '__attribute__'
/usr/lib/gcj-4.2.0_alpha20060909/include/c++/tr1/cstdint:49: error: expected unqualified-id before '{' token
/usr/include/apr-0/apr_tables.h:360: error: 'va_list' has not been declared
/usr/lib/gcj-4.2.0_alpha20060909/include/c++/cstdlib:104: error: expected `=' before '__attribute__'
/usr/lib/gcj-4.2.0_alpha20060909/include/c++/cstdlib:104: error: expected identifier before '__attribute__'
/usr/lib/gcj-4.2.0_alpha20060909/include/c++/cstdlib:104: error: expected `;' before '__attribute__'
/usr/lib/gcj-4.2.0_alpha20060909/include/c++/cstdlib:104: error: expected unqualified-id before '{' token
/usr/lib/gcj-4.2.0_alpha20060909/include/c++/cstdlib:161: error: expected `=' before '__attribute__'
/usr/lib/gcj-4.2.0_alpha20060909/include/c++/cstdlib:161: error: expected identifier before '__attribute__'
/usr/lib/gcj-4.2.0_alpha20060909/include/c++/cstdlib:161: error: expected `;' before '__attribute__'
/usr/lib/gcj-4.2.0_alpha20060909/include/c++/cstdlib:161: error: expected unqualified-id before '{' token
/usr/lib/gcj-4.2.0_alpha20060909/include/c++/cstdlib:203: error: expected `=' before '__attribute__'
/usr/lib/gcj-4.2.0_alpha20060909/include/c++/cstdlib:203: error: expected identifier before '__attribute__'
/usr/lib/gcj-4.2.0_alpha20060909/include/c++/cstdlib:203: error: expected `;' before '__attribute__'
/usr/lib/gcj-4.2.0_alpha20060909/include/c++/cstdlib:203: error: expected unqualified-id before '{' token
/usr/lib/gcj-4.2.0_alpha20060909/include/c++/tr1/cstdlib:46: error: expected `=' before '__attribute__'
/usr/lib/gcj-4.2.0_alpha20060909/include/c++/tr1/cstdlib:46: error: expected identifier before '__attribute__'
/usr/lib/gcj-4.2.0_alpha20060909/include/c++/tr1/cstdlib:46: error: expected `;' before '__attribute__'
/usr/lib/gcj-4.2.0_alpha20060909/include/c++/tr1/cstdlib:46: error: expected unqualified-id before '{' token
/usr/lib/gcj-4.2.0_alpha20060909/include/c++/tr1/stdlib.h:43: error: 'std::tr1' has not been declared
/usr/lib/gcj-4.2.0_alpha20060909/include/c++/tr1/stdlib.h:44: error: 'std::tr1' has not been declared
/usr/lib/gcj-4.2.0_alpha20060909/include/c++/tr1/stdlib.h:45: error: 'std::tr1' has not been declared
/usr/lib/gcj-4.2.0_alpha20060909/include/c++/tr1/stdlib.h:47: error: 'std::tr1' has not been declared
/usr/lib/gcj-4.2.0_alpha20060909/include/c++/tr1/stdlib.h:49: error: 'std::tr1' has not been declared
/usr/include/apr-0/apr_strings.h:158: error: 'va_list' has not been declared
/usr/include/apr-0/apr_strings.h:268: error: 'va_list' has not been declared
./subversion/include/svn_string.h:143: error: 'va_list' has not been declared
./subversion/include/svn_string.h:203: error: 'va_list' has not been declared
./subversion/include/svn_error.h:182: error: 'FILE' has not been declared
./subversion/include/svn_error.h:191: error: 'FILE' has not been declared
./subversion/include/svn_error.h:201: error: variable or field 'svn_handle_warning2' declared void
./subversion/include/svn_error.h:201: error: 'FILE' was not declared in this scope
./subversion/include/svn_error.h:201: error: 'stream' was not declared in this scope
./subversion/include/svn_error.h:201: error: expected primary-expression before '*' token
./subversion/include/svn_error.h:201: error: 'error' was not declared in this scope
./subversion/include/svn_error.h:201: error: expected primary-expression before 'const'
./subversion/include/svn_error.h:201: error: initializer expression list treated as compound expression
./subversion/include/svn_error.h:205: error: variable or field 'svn_handle_warning' declared void
./subversion/include/svn_error.h:205: error: 'FILE' was not declared in this scope
./subversion/include/svn_error.h:205: error: 'stream' was not declared in this scope
./subversion/include/svn_error.h:205: error: expected primary-expression before '*' token
./subversion/include/svn_error.h:205: error: 'error' was not declared in this scope
./subversion/include/svn_error.h:205: error: initializer expression list treated as compound expression
./subversion/include/svn_opt.h:227: error: 'FILE' has not been declared
./subversion/include/svn_opt.h:241: error: 'FILE' has not been declared
/usr/lib/gcj-4.2.0_alpha20060909/include/c++/bits/functexcept.h:44: error: expected `=' before '__attribute__'
/usr/lib/gcj-4.2.0_alpha20060909/include/c++/bits/functexcept.h:44: error: expected identifier before '__attribute__'
/usr/lib/gcj-4.2.0_alpha20060909/include/c++/bits/functexcept.h:44: error: expected `;' before '__attribute__'
/usr/lib/gcj-4.2.0_alpha20060909/include/c++/bits/functexcept.h:44: error: expected unqualified-id before '{' token
/usr/lib/gcj-4.2.0_alpha20060909/include/c++/cstring:78: error: expected `=' before '__attribute__'
/usr/lib/gcj-4.2.0_alpha20060909/include/c++/cstring:78: error: expected identifier before '__attribute__'
/usr/lib/gcj-4.2.0_alpha20060909/include/c++/cstring:78: error: expected `;' before '__attribute__'
/usr/lib/gcj-4.2.0_alpha20060909/include/c++/cstring:78: error: expected unqualified-id before '{' token
/usr/lib/gcj-4.2.0_alpha20060909/include/c++/clocale:57: error: expected `=' before '__attribute__'
/usr/lib/gcj-4.2.0_alpha20060909/include/c++/clocale:57: error: expected identifier before '__attribute__'
/usr/lib/gcj-4.2.0_alpha20060909/include/c++/clocale:57: error: expected `;' before '__attribute__'
/usr/lib/gcj-4.2.0_alpha20060909/include/c++/clocale:57: error: expected unqualified-id before '{' token
/usr/lib/gcj-4.2.0_alpha20060909/include/c++/i686-pc-linux-gnu/bits/c++locale.h:55: error: expected `=' before '__attribute__'
/usr/lib/gcj-4.2.0_alpha20060909/include/c++/i686-pc-linux-gnu/bits/c++locale.h:55: error: expected identifier before '__attribute__'
/usr/lib/gcj-4.2.0_alpha20060909/include/c++/i686-pc-linux-gnu/bits/c++locale.h:55: error: expected `;' before '__attribute__'
/usr/lib/gcj-4.2.0_alpha20060909/include/c++/i686-pc-linux-gnu/bits/c++locale.h:55: error: expected unqualified-id before '{' token
/usr/lib/gcj-4.2.0_alpha20060909/include/c++/i686-pc-linux-gnu/bits/c++locale.h:62: error: expected `=' before '__attribute__'
/usr/lib/gcj-4.2.0_alpha20060909/include/c++/i686-pc-linux-gnu/bits/c++locale.h:62: error: expected identifier before '__attribute__'
/usr/lib/gcj-4.2.0_alpha20060909/include/c++/i686-pc-linux-gnu/bits/c++locale.h:62: error: expected `;' before '__attribute__'
/usr/lib/gcj-4.2.0_alpha20060909/include/c++/i686-pc-linux-gnu/bits/c++locale.h:62: error: expected unqualified-id before '{' token
/usr/lib/gcj-4.2.0_alpha20060909/include/c++/i686-pc-linux-gnu/bits/gthr-default.h:88: error: weak declaration of 'int __gthrw_pthread_once(pthread_once_t*, void (*)())' must be public
/usr/lib/gcj-4.2.0_alpha20060909/include/c++/i686-pc-linux-gnu/bits/gthr-default.h:89: error: weak declaration of 'void* __gthrw_pthread_getspecific(pthread_key_t)' must be public
/usr/lib/gcj-4.2.0_alpha20060909/include/c++/i686-pc-linux-gnu/bits/gthr-default.h:90: error: weak declaration of 'int __gthrw_pthread_setspecific(pthread_key_t, const void*)' must be public
/usr/lib/gcj-4.2.0_alpha20060909/include/c++/i686-pc-linux-gnu/bits/gthr-default.h:91: error: weak declaration of 'int __gthrw_pthread_create(pthread_t*, const pthread_attr_t*, void* (*)(void*), void*)' must be public
/usr/lib/gcj-4.2.0_alpha20060909/include/c++/i686-pc-linux-gnu/bits/gthr-default.h:92: error: weak declaration of 'int __gthrw_pthread_cancel(pthread_t)' must be public
/usr/lib/gcj-4.2.0_alpha20060909/include/c++/i686-pc-linux-gnu/bits/gthr-default.h:93: error: weak declaration of 'int __gthrw_pthread_mutex_lock(pthread_mutex_t*)' must be public
/usr/lib/gcj-4.2.0_alpha20060909/include/c++/i686-pc-linux-gnu/bits/gthr-default.h:94: error: weak declaration of 'int __gthrw_pthread_mutex_trylock(pthread_mutex_t*)' must be public
/usr/lib/gcj-4.2.0_alpha20060909/include/c++/i686-pc-linux-gnu/bits/gthr-default.h:95: error: weak declaration of 'int __gthrw_pthread_mutex_unlock(pthread_mutex_t*)' must be public
/usr/lib/gcj-4.2.0_alpha20060909/include/c++/i686-pc-linux-gnu/bits/gthr-default.h:96: error: weak declaration of 'int __gthrw_pthread_mutex_init(pthread_mutex_t*, const pthread_mutexattr_t*)' must be public
/usr/lib/gcj-4.2.0_alpha20060909/include/c++/i686-pc-linux-gnu/bits/gthr-default.h:99: error: weak declaration of 'int __gthrw_pthread_key_create(pthread_key_t*, void (*)(void*))' must be public
/usr/lib/gcj-4.2.0_alpha20060909/include/c++/i686-pc-linux-gnu/bits/gthr-default.h:100: error: weak declaration of 'int __gthrw_pthread_key_delete(pthread_key_t)' must be public
/usr/lib/gcj-4.2.0_alpha20060909/include/c++/i686-pc-linux-gnu/bits/gthr-default.h:101: error: weak declaration of 'int __gthrw_pthread_mutexattr_init(pthread_mutexattr_t*)' must be public
/usr/lib/gcj-4.2.0_alpha20060909/include/c++/i686-pc-linux-gnu/bits/gthr-default.h:102: error: weak declaration of 'int __gthrw_pthread_mutexattr_settype(pthread_mutexattr_t*, int)' must be public
/usr/lib/gcj-4.2.0_alpha20060909/include/c++/i686-pc-linux-gnu/bits/gthr-default.h:103: error: weak declaration of 'int __gthrw_pthread_mutexattr_destroy(pthread_mutexattr_t*)' must be public
/usr/lib/gcj-4.2.0_alpha20060909/include/c++/i686-pc-linux-gnu/bits/c++io.h:40: error: expected `=' before '__attribute__'
/usr/lib/gcj-4.2.0_alpha20060909/include/c++/i686-pc-linux-gnu/bits/c++io.h:40: error: expected identifier before '__attribute__'
/usr/lib/gcj-4.2.0_alpha20060909/include/c++/i686-pc-linux-gnu/bits/c++io.h:40: error: expected `;' before '__attribute__'
/usr/lib/gcj-4.2.0_alpha20060909/include/c++/i686-pc-linux-gnu/bits/c++io.h:40: error: expected unqualified-id before '{' token
/usr/lib/gcj-4.2.0_alpha20060909/include/c++/tr1/cctype:47: error: expected `=' before '__attribute__'
/usr/lib/gcj-4.2.0_alpha20060909/include/c++/tr1/cctype:47: error: expected identifier before '__attribute__'
/usr/lib/gcj-4.2.0_alpha20060909/include/c++/tr1/cctype:47: error: expected `;' before '__attribute__'
/usr/lib/gcj-4.2.0_alpha20060909/include/c++/tr1/cctype:47: error: expected unqualified-id before '{' token
/usr/lib/gcj-4.2.0_alpha20060909/include/c++/cctype:68: error: expected `=' before '__attribute__'
/usr/lib/gcj-4.2.0_alpha20060909/include/c++/cctype:68: error: expected identifier before '__attribute__'
/usr/lib/gcj-4.2.0_alpha20060909/include/c++/cctype:68: error: expected `;' before '__attribute__'
/usr/lib/gcj-4.2.0_alpha20060909/include/c++/cctype:68: error: expected unqualified-id before '{' token
/usr/lib/gcj-4.2.0_alpha20060909/include/c++/bits/stringfwd.h:46: error: expected `=' before '__attribute__'
/usr/lib/gcj-4.2.0_alpha20060909/include/c++/bits/stringfwd.h:46: error: expected identifier before '__attribute__'
/usr/lib/gcj-4.2.0_alpha20060909/include/c++/bits/stringfwd.h:46: error: expected `;' before '__attribute__'
/usr/lib/gcj-4.2.0_alpha20060909/include/c++/bits/stringfwd.h:46: error: expected unqualified-id before '{' token
/usr/lib/gcj-4.2.0_alpha20060909/include/c++/ctime:64: error: expected `=' before '__attribute__'
/usr/lib/gcj-4.2.0_alpha20060909/include/c++/ctime:64: error: expected identifier before '__attribute__'
/usr/lib/gcj-4.2.0_alpha20060909/include/c++/ctime:64: error: expected `;' before '__attribute__'
/usr/lib/gcj-4.2.0_alpha20060909/include/c++/ctime:64: error: expected unqualified-id before '{' token
/usr/lib/gcj-4.2.0_alpha20060909/include/c++/tr1/cwchar:46: error: expected `=' before '__attribute__'
/usr/lib/gcj-4.2.0_alpha20060909/include/c++/tr1/cwchar:46: error: expected identifier before '__attribute__'
/usr/lib/gcj-4.2.0_alpha20060909/include/c++/tr1/cwchar:46: error: expected `;' before '__attribute__'
/usr/lib/gcj-4.2.0_alpha20060909/include/c++/tr1/cwchar:46: error: expected unqualified-id before '{' token
/usr/lib/gcj-4.2.0_alpha20060909/include/c++/cwchar:70: error: expected `=' before '__attribute__'
/usr/lib/gcj-4.2.0_alpha20060909/include/c++/cwchar:70: error: expected identifier before '__attribute__'
/usr/lib/gcj-4.2.0_alpha20060909/include/c++/cwchar:70: error: expected `;' before '__attribute__'
/usr/lib/gcj-4.2.0_alpha20060909/include/c++/cwchar:70: error: expected unqualified-id before '{' token
/usr/lib/gcj-4.2.0_alpha20060909/include/c++/cwchar:144: error: expected `=' before '__attribute__'
/usr/lib/gcj-4.2.0_alpha20060909/include/c++/cwchar:144: error: expected identifier before '__attribute__'
/usr/lib/gcj-4.2.0_alpha20060909/include/c++/cwchar:144: error: expected `;' before '__attribute__'
/usr/lib/gcj-4.2.0_alpha20060909/include/c++/cwchar:144: error: expected unqualified-id before '{' token
/usr/lib/gcj-4.2.0_alpha20060909/include/c++/cwchar:246: error: expected `=' before '__attribute__'
/usr/lib/gcj-4.2.0_alpha20060909/include/c++/cwchar:246: error: expected identifier before '__attribute__'
/usr/lib/gcj-4.2.0_alpha20060909/include/c++/cwchar:246: error: expected `;' before '__attribute__'
/usr/lib/gcj-4.2.0_alpha20060909/include/c++/cwchar:246: error: expected unqualified-id before '{' token
/usr/lib/gcj-4.2.0_alpha20060909/include/c++/cwchar:268: error: expected `=' before '__attribute__'
/usr/lib/gcj-4.2.0_alpha20060909/include/c++/cwchar:268: error: expected identifier before '__attribute__'
/usr/lib/gcj-4.2.0_alpha20060909/include/c++/cwchar:268: error: expected `;' before '__attribute__'
/usr/lib/gcj-4.2.0_alpha20060909/include/c++/cwchar:268: error: expected unqualified-id before '{' token
/usr/lib/gcj-4.2.0_alpha20060909/include/c++/bits/postypes.h:52: error: expected `=' before '__attribute__'
/usr/lib/gcj-4.2.0_alpha20060909/include/c++/bits/postypes.h:52: error: expected identifier before '__attribute__'
/usr/lib/gcj-4.2.0_alpha20060909/include/c++/bits/postypes.h:52: error: expected `;' before '__attribute__'
/usr/lib/gcj-4.2.0_alpha20060909/include/c++/bits/postypes.h:52: error: expected unqualified-id before '{' token
/usr/lib/gcj-4.2.0_alpha20060909/include/c++/iosfwd:52: error: expected `=' before '__attribute__'
/usr/lib/gcj-4.2.0_alpha20060909/include/c++/iosfwd:52: error: expected identifier before '__attribute__'
/usr/lib/gcj-4.2.0_alpha20060909/include/c++/iosfwd:52: error: expected `;' before '__attribute__'
/usr/lib/gcj-4.2.0_alpha20060909/include/c++/iosfwd:52: error: expected unqualified-id before '{' token
/usr/lib/gcj-4.2.0_alpha20060909/include/c++/bits/stl_pair.h:64: error: expected `=' before '__attribute__'
/usr/lib/gcj-4.2.0_alpha20060909/include/c++/bits/stl_pair.h:64: error: expected identifier before '__attribute__'
/usr/lib/gcj-4.2.0_alpha20060909/include/c++/bits/stl_pair.h:64: error: expected `;' before '__attribute__'
/usr/lib/gcj-4.2.0_alpha20060909/include/c++/bits/stl_pair.h:64: error: expected unqualified-id before '{' token
/usr/lib/gcj-4.2.0_alpha20060909/include/c++/bits/cpp_type_traits.h:74: error: expected `=' before '__attribute__'
/usr/lib/gcj-4.2.0_alpha20060909/include/c++/bits/cpp_type_traits.h:74: error: expected identifier before '__attribute__'
/usr/lib/gcj-4.2.0_alpha20060909/include/c++/bits/cpp_type_traits.h:74: error: expected `;' before '__attribute__'
/usr/lib/gcj-4.2.0_alpha20060909/include/c++/bits/cpp_type_traits.h:74: error: expected unqualified-id before '{' token
/usr/lib/gcj-4.2.0_alpha20060909/include/c++/bits/cpp_type_traits.h:84: error: expected `=' before '__attribute__'
/usr/lib/gcj-4.2.0_alpha20060909/include/c++/bits/cpp_type_traits.h:84: error: expected identifier before '__attribute__'
/usr/lib/gcj-4.2.0_alpha20060909/include/c++/bits/cpp_type_traits.h:84: error: expected `;' before '__attribute__'
/usr/lib/gcj-4.2.0_alpha20060909/include/c++/bits/cpp_type_traits.h:84: error: expected unqualified-id before '{' token
/usr/lib/gcj-4.2.0_alpha20060909/include/c++/bits/stl_iterator_base_types.h:69: error: expected `=' before '__attribute__'
/usr/lib/gcj-4.2.0_alpha20060909/include/c++/bits/stl_iterator_base_types.h:69: error: expected identifier before '__attribute__'
/usr/lib/gcj-4.2.0_alpha20060909/include/c++/bits/stl_iterator_base_types.h:69: error: expected `;' before '__attribute__'
/usr/lib/gcj-4.2.0_alpha20060909/include/c++/bits/stl_iterator_base_types.h:69: error: expected unqualified-id before '{' token
/usr/lib/gcj-4.2.0_alpha20060909/include/c++/bits/stl_iterator_base_funcs.h:70: error: expected `=' before '__attribute__'
/usr/lib/gcj-4.2.0_alpha20060909/include/c++/bits/stl_iterator_base_funcs.h:70: error: expected identifier before '__attribute__'
/usr/lib/gcj-4.2.0_alpha20060909/include/c++/bits/stl_iterator_base_funcs.h:70: error: expected `;' before '__attribute__'
/usr/lib/gcj-4.2.0_alpha20060909/include/c++/bits/stl_iterator_base_funcs.h:70: error: expected unqualified-id before '{' token
/usr/lib/gcj-4.2.0_alpha20060909/include/c++/bits/stl_iterator.h:70: error: expected `=' before '__attribute__'
/usr/lib/gcj-4.2.0_alpha20060909/include/c++/bits/stl_iterator.h:70: error: expected identifier before '__attribute__'
/usr/lib/gcj-4.2.0_alpha20060909/include/c++/bits/stl_iterator.h:70: error: expected `;' before '__attribute__'
/usr/lib/gcj-4.2.0_alpha20060909/include/c++/bits/stl_iterator.h:70: error: expected unqualified-id before '{' token
/usr/lib/gcj-4.2.0_alpha20060909/include/c++/bits/stl_iterator.h:622: error: expected `=' before '__attribute__'
/usr/lib/gcj-4.2.0_alpha20060909/include/c++/bits/stl_iterator.h:622: error: expected identifier before '__attribute__'
/usr/lib/gcj-4.2.0_alpha20060909/include/c++/bits/stl_iterator.h:622: error: expected `;' before '__attribute__'
/usr/lib/gcj-4.2.0_alpha20060909/include/c++/bits/stl_iterator.h:622: error: expected unqualified-id before '{' token
/usr/lib/gcj-4.2.0_alpha20060909/include/c++/bits/stl_algobase.h:79: error: expected `=' before '__attribute__'
/usr/lib/gcj-4.2.0_alpha20060909/include/c++/bits/stl_algobase.h:79: error: expected identifier before '__attribute__'
/usr/lib/gcj-4.2.0_alpha20060909/include/c++/bits/stl_algobase.h:79: error: expected `;' before '__attribute__'
/usr/lib/gcj-4.2.0_alpha20060909/include/c++/bits/stl_algobase.h:79: error: expected unqualified-id before '{' token
/usr/lib/gcj-4.2.0_alpha20060909/include/c++/exception:107: error: expected `=' before '__attribute__'
/usr/lib/gcj-4.2.0_alpha20060909/include/c++/exception:107: error: expected identifier before '__attribute__'
/usr/lib/gcj-4.2.0_alpha20060909/include/c++/exception:107: error: expected `;' before '__attribute__'
/usr/lib/gcj-4.2.0_alpha20060909/include/c++/exception:107: error: expected unqualified-id before '{' token
/usr/lib/gcj-4.2.0_alpha20060909/include/c++/new:84: error: declaration of 'operator new' as non-function
/usr/lib/gcj-4.2.0_alpha20060909/include/c++/new:84: error: 'size_t' is not a member of 'std'
/usr/lib/gcj-4.2.0_alpha20060909/include/c++/new:85: error: declaration of 'operator new []' as non-function
/usr/lib/gcj-4.2.0_alpha20060909/include/c++/new:85: error: 'size_t' is not a member of 'std'
/usr/lib/gcj-4.2.0_alpha20060909/include/c++/new:88: error: declaration of 'operator new' as non-function
/usr/lib/gcj-4.2.0_alpha20060909/include/c++/new:88: error: 'size_t' is not a member of 'std'
/usr/lib/gcj-4.2.0_alpha20060909/include/c++/new:88: error: expected primary-expression before 'const'
/usr/lib/gcj-4.2.0_alpha20060909/include/c++/new:89: error: declaration of 'operator new []' as non-function
/usr/lib/gcj-4.2.0_alpha20060909/include/c++/new:89: error: 'size_t' is not a member of 'std'
/usr/lib/gcj-4.2.0_alpha20060909/include/c++/new:89: error: expected primary-expression before 'const'
/usr/lib/gcj-4.2.0_alpha20060909/include/c++/new:94: error: declaration of 'operator new' as non-function
/usr/lib/gcj-4.2.0_alpha20060909/include/c++/new:94: error: 'size_t' is not a member of 'std'
/usr/lib/gcj-4.2.0_alpha20060909/include/c++/new:94: error: expected primary-expression before 'void'
/usr/lib/gcj-4.2.0_alpha20060909/include/c++/new:95: error: declaration of 'operator new []' as non-function
/usr/lib/gcj-4.2.0_alpha20060909/include/c++/new:95: error: 'size_t' is not a member of 'std'
/usr/lib/gcj-4.2.0_alpha20060909/include/c++/new:95: error: expected primary-expression before 'void'
/usr/lib/gcj-4.2.0_alpha20060909/include/c++/ext/new_allocator.h:40: error: expected `=' before '__attribute__'
/usr/lib/gcj-4.2.0_alpha20060909/include/c++/ext/new_allocator.h:40: error: expected identifier before '__attribute__'
/usr/lib/gcj-4.2.0_alpha20060909/include/c++/ext/new_allocator.h:40: error: expected `;' before '__attribute__'
/usr/lib/gcj-4.2.0_alpha20060909/include/c++/ext/new_allocator.h:40: error: expected unqualified-id before '{' token
/usr/lib/gcj-4.2.0_alpha20060909/include/c++/bits/allocator.h:57: error: expected `=' before '__attribute__'
/usr/lib/gcj-4.2.0_alpha20060909/include/c++/bits/allocator.h:57: error: expected identifier before '__attribute__'
/usr/lib/gcj-4.2.0_alpha20060909/include/c++/bits/allocator.h:57: error: expected `;' before '__attribute__'
/usr/lib/gcj-4.2.0_alpha20060909/include/c++/bits/allocator.h:57: error: expected unqualified-id before '{' token
/usr/lib/gcj-4.2.0_alpha20060909/include/c++/bits/stl_construct.h:67: error: expected `=' before '__attribute__'
/usr/lib/gcj-4.2.0_alpha20060909/include/c++/bits/stl_construct.h:67: error: expected identifier before '__attribute__'
/usr/lib/gcj-4.2.0_alpha20060909/include/c++/bits/stl_construct.h:67: error: expected `;' before '__attribute__'
/usr/lib/gcj-4.2.0_alpha20060909/include/c++/bits/stl_construct.h:67: error: expected unqualified-id before '{' token
/usr/lib/gcj-4.2.0_alpha20060909/include/c++/bits/stl_uninitialized.h:66: error: expected `=' before '__attribute__'
/usr/lib/gcj-4.2.0_alpha20060909/include/c++/bits/stl_uninitialized.h:66: error: expected identifier before '__attribute__'
/usr/lib/gcj-4.2.0_alpha20060909/include/c++/bits/stl_uninitialized.h:66: error: expected `;' before '__attribute__'
/usr/lib/gcj-4.2.0_alpha20060909/include/c++/bits/stl_uninitialized.h:66: error: expected unqualified-id before '{' token
/usr/lib/gcj-4.2.0_alpha20060909/include/c++/bits/stl_list.h:67: error: expected `=' before '__attribute__'
/usr/lib/gcj-4.2.0_alpha20060909/include/c++/bits/stl_list.h:67: error: expected identifier before '__attribute__'
/usr/lib/gcj-4.2.0_alpha20060909/include/c++/bits/stl_list.h:67: error: expected `;' before '__attribute__'
/usr/lib/gcj-4.2.0_alpha20060909/include/c++/bits/stl_list.h:67: error: expected unqualified-id before '{' token
/usr/lib/gcj-4.2.0_alpha20060909/include/c++/bits/list.tcc:65: error: expected `=' before '__attribute__'
/usr/lib/gcj-4.2.0_alpha20060909/include/c++/bits/list.tcc:65: error: expected identifier before '__attribute__'
/usr/lib/gcj-4.2.0_alpha20060909/include/c++/bits/list.tcc:65: error: expected `;' before '__attribute__'
/usr/lib/gcj-4.2.0_alpha20060909/include/c++/bits/list.tcc:65: error: expected unqualified-id before '{' token
/usr/lib/gcj-4.2.0_alpha20060909/include/c++/bits/char_traits.h:49: error: expected `=' before '__attribute__'
/usr/lib/gcj-4.2.0_alpha20060909/include/c++/bits/char_traits.h:49: error: expected identifier before '__attribute__'
/usr/lib/gcj-4.2.0_alpha20060909/include/c++/bits/char_traits.h:49: error: expected `;' before '__attribute__'
/usr/lib/gcj-4.2.0_alpha20060909/include/c++/bits/char_traits.h:49: error: expected unqualified-id before '{' token
/usr/lib/gcj-4.2.0_alpha20060909/include/c++/bits/char_traits.h:210: error: expected `=' before '__attribute__'
/usr/lib/gcj-4.2.0_alpha20060909/include/c++/bits/char_traits.h:210: error: expected identifier before '__attribute__'
/usr/lib/gcj-4.2.0_alpha20060909/include/c++/bits/char_traits.h:210: error: expected `;' before '__attribute__'
/usr/lib/gcj-4.2.0_alpha20060909/include/c++/bits/char_traits.h:210: error: expected unqualified-id before '{' token
/usr/lib/gcj-4.2.0_alpha20060909/include/c++/bits/localefwd.h:50: error: expected `=' before '__attribute__'
/usr/lib/gcj-4.2.0_alpha20060909/include/c++/bits/localefwd.h:50: error: expected identifier before '__attribute__'
/usr/lib/gcj-4.2.0_alpha20060909/include/c++/bits/localefwd.h:50: error: expected `;' before '__attribute__'
/usr/lib/gcj-4.2.0_alpha20060909/include/c++/bits/localefwd.h:50: error: expected unqualified-id before '{' token
/usr/lib/gcj-4.2.0_alpha20060909/include/c++/bits/atomicity.h:42: error: expected `=' before '__attribute__'
/usr/lib/gcj-4.2.0_alpha20060909/include/c++/bits/atomicity.h:42: error: expected identifier before '__attribute__'
/usr/lib/gcj-4.2.0_alpha20060909/include/c++/bits/atomicity.h:42: error: expected `;' before '__attribute__'
/usr/lib/gcj-4.2.0_alpha20060909/include/c++/bits/atomicity.h:42: error: expected unqualified-id before '{' token
/usr/lib/gcj-4.2.0_alpha20060909/include/c++/bits/stl_raw_storage_iter.h:64: error: expected `=' before '__attribute__'
/usr/lib/gcj-4.2.0_alpha20060909/include/c++/bits/stl_raw_storage_iter.h:64: error: expected identifier before '__attribute__'
/usr/lib/gcj-4.2.0_alpha20060909/include/c++/bits/stl_raw_storage_iter.h:64: error: expected `;' before '__attribute__'
/usr/lib/gcj-4.2.0_alpha20060909/include/c++/bits/stl_raw_storage_iter.h:64: error: expected unqualified-id before '{' token
/usr/lib/gcj-4.2.0_alpha20060909/include/c++/limits:150: error: expected `=' before '__attribute__'
/usr/lib/gcj-4.2.0_alpha20060909/include/c++/limits:150: error: expected identifier before '__attribute__'
/usr/lib/gcj-4.2.0_alpha20060909/include/c++/limits:150: error: expected `;' before '__attribute__'
/usr/lib/gcj-4.2.0_alpha20060909/include/c++/limits:150: error: expected unqualified-id before '{' token
/usr/lib/gcj-4.2.0_alpha20060909/include/c++/memory:62: error: expected `=' before '__attribute__'
/usr/lib/gcj-4.2.0_alpha20060909/include/c++/memory:62: error: expected identifier before '__attribute__'
/usr/lib/gcj-4.2.0_alpha20060909/include/c++/memory:62: error: expected `;' before '__attribute__'
/usr/lib/gcj-4.2.0_alpha20060909/include/c++/memory:62: error: expected unqualified-id before '{' token
/usr/lib/gcj-4.2.0_alpha20060909/include/c++/bits/stl_function.h:64: error: expected `=' before '__attribute__'
/usr/lib/gcj-4.2.0_alpha20060909/include/c++/bits/stl_function.h:64: error: expected identifier before '__attribute__'
/usr/lib/gcj-4.2.0_alpha20060909/include/c++/bits/stl_function.h:64: error: expected `;' before '__attribute__'
/usr/lib/gcj-4.2.0_alpha20060909/include/c++/bits/stl_function.h:64: error: expected unqualified-id before '{' token
/usr/lib/gcj-4.2.0_alpha20060909/include/c++/bits/basic_string.h:48: error: expected `=' before '__attribute__'
/usr/lib/gcj-4.2.0_alpha20060909/include/c++/bits/basic_string.h:48: error: expected identifier before '__attribute__'
/usr/lib/gcj-4.2.0_alpha20060909/include/c++/bits/basic_string.h:48: error: expected `;' before '__attribute__'
/usr/lib/gcj-4.2.0_alpha20060909/include/c++/bits/basic_string.h:48: error: expected unqualified-id before '{' token
/usr/lib/gcj-4.2.0_alpha20060909/include/c++/bits/stl_heap.h:65: error: expected `=' before '__attribute__'
/usr/lib/gcj-4.2.0_alpha20060909/include/c++/bits/stl_heap.h:65: error: expected identifier before '__attribute__'
/usr/lib/gcj-4.2.0_alpha20060909/include/c++/bits/stl_heap.h:65: error: expected `;' before '__attribute__'
/usr/lib/gcj-4.2.0_alpha20060909/include/c++/bits/stl_heap.h:65: error: expected unqualified-id before '{' token
/usr/lib/gcj-4.2.0_alpha20060909/include/c++/bits/stl_tempbuf.h:67: error: expected `=' before '__attribute__'
/usr/lib/gcj-4.2.0_alpha20060909/include/c++/bits/stl_tempbuf.h:67: error: expected identifier before '__attribute__'
/usr/lib/gcj-4.2.0_alpha20060909/include/c++/bits/stl_tempbuf.h:67: error: expected `;' before '__attribute__'
/usr/lib/gcj-4.2.0_alpha20060909/include/c++/bits/stl_tempbuf.h:67: error: expected unqualified-id before '{' token
/usr/lib/gcj-4.2.0_alpha20060909/include/c++/bits/stl_algo.h:71: error: expected `=' before '__attribute__'
/usr/lib/gcj-4.2.0_alpha20060909/include/c++/bits/stl_algo.h:71: error: expected identifier before '__attribute__'
/usr/lib/gcj-4.2.0_alpha20060909/include/c++/bits/stl_algo.h:71: error: expected `;' before '__attribute__'
/usr/lib/gcj-4.2.0_alpha20060909/include/c++/bits/stl_algo.h:71: error: expected unqualified-id before '{' token
/usr/lib/gcj-4.2.0_alpha20060909/include/c++/bits/basic_string.tcc:48: error: expected `=' before '__attribute__'
/usr/lib/gcj-4.2.0_alpha20060909/include/c++/bits/basic_string.tcc:48: error: expected identifier before '__attribute__'
/usr/lib/gcj-4.2.0_alpha20060909/include/c++/bits/basic_string.tcc:48: error: expected `;' before '__attribute__'
/usr/lib/gcj-4.2.0_alpha20060909/include/c++/bits/basic_string.tcc:48: error: expected unqualified-id before '{' token
/usr/lib/gcj-4.2.0_alpha20060909/include/c++/bits/locale_classes.h:51: error: expected `=' before '__attribute__'
/usr/lib/gcj-4.2.0_alpha20060909/include/c++/bits/locale_classes.h:51: error: expected identifier before '__attribute__'
/usr/lib/gcj-4.2.0_alpha20060909/include/c++/bits/locale_classes.h:51: error: expected `;' before '__attribute__'
/usr/lib/gcj-4.2.0_alpha20060909/include/c++/bits/locale_classes.h:51: error: expected unqualified-id before '{' token
/usr/lib/gcj-4.2.0_alpha20060909/include/c++/bits/ios_base.h:49: error: expected `=' before '__attribute__'
/usr/lib/gcj-4.2.0_alpha20060909/include/c++/bits/ios_base.h:49: error: expected identifier before '__attribute__'
/usr/lib/gcj-4.2.0_alpha20060909/include/c++/bits/ios_base.h:49: error: expected `;' before '__attribute__'
/usr/lib/gcj-4.2.0_alpha20060909/include/c++/bits/ios_base.h:49: error: expected unqualified-id before '{' token
/usr/lib/gcj-4.2.0_alpha20060909/include/c++/streambuf:50: error: expected `=' before '__attribute__'
/usr/lib/gcj-4.2.0_alpha20060909/include/c++/streambuf:50: error: expected identifier before '__attribute__'
/usr/lib/gcj-4.2.0_alpha20060909/include/c++/streambuf:50: error: expected `;' before '__attribute__'
/usr/lib/gcj-4.2.0_alpha20060909/include/c++/streambuf:50: error: expected unqualified-id before '{' token
/usr/lib/gcj-4.2.0_alpha20060909/include/c++/bits/streambuf.tcc:45: error: expected `=' before '__attribute__'
/usr/lib/gcj-4.2.0_alpha20060909/include/c++/bits/streambuf.tcc:45: error: expected identifier before '__attribute__'
/usr/lib/gcj-4.2.0_alpha20060909/include/c++/bits/streambuf.tcc:45: error: expected `;' before '__attribute__'
/usr/lib/gcj-4.2.0_alpha20060909/include/c++/bits/streambuf.tcc:45: error: expected unqualified-id before '{' token
/usr/lib/gcj-4.2.0_alpha20060909/include/c++/bits/streambuf_iterator.h:44: error: expected `=' before '__attribute__'
/usr/lib/gcj-4.2.0_alpha20060909/include/c++/bits/streambuf_iterator.h:44: error: expected identifier before '__attribute__'
/usr/lib/gcj-4.2.0_alpha20060909/include/c++/bits/streambuf_iterator.h:44: error: expected `;' before '__attribute__'
/usr/lib/gcj-4.2.0_alpha20060909/include/c++/bits/streambuf_iterator.h:44: error: expected unqualified-id before '{' token
/usr/lib/gcj-4.2.0_alpha20060909/include/c++/tr1/cwctype:46: error: expected `=' before '__attribute__'
/usr/lib/gcj-4.2.0_alpha20060909/include/c++/tr1/cwctype:46: error: expected identifier before '__attribute__'
/usr/lib/gcj-4.2.0_alpha20060909/include/c++/tr1/cwctype:46: error: expected `;' before '__attribute__'
/usr/lib/gcj-4.2.0_alpha20060909/include/c++/tr1/cwctype:46: error: expected unqualified-id before '{' token
/usr/lib/gcj-4.2.0_alpha20060909/include/c++/cwctype:80: error: expected `=' before '__attribute__'
/usr/lib/gcj-4.2.0_alpha20060909/include/c++/cwctype:80: error: expected identifier before '__attribute__'
/usr/lib/gcj-4.2.0_alpha20060909/include/c++/cwctype:80: error: expected `;' before '__attribute__'
/usr/lib/gcj-4.2.0_alpha20060909/include/c++/cwctype:80: error: expected unqualified-id before '{' token
/usr/lib/gcj-4.2.0_alpha20060909/include/c++/bits/locale_facets.h:52: error: expected `=' before '__attribute__'
/usr/lib/gcj-4.2.0_alpha20060909/include/c++/bits/locale_facets.h:52: error: expected identifier before '__attribute__'
/usr/lib/gcj-4.2.0_alpha20060909/include/c++/bits/locale_facets.h:52: error: expected `;' before '__attribute__'
/usr/lib/gcj-4.2.0_alpha20060909/include/c++/bits/locale_facets.h:52: error: expected unqualified-id before '{' token
/usr/lib/gcj-4.2.0_alpha20060909/include/c++/bits/basic_ios.h:46: error: expected `=' before '__attribute__'
/usr/lib/gcj-4.2.0_alpha20060909/include/c++/bits/basic_ios.h:46: error: expected identifier before '__attribute__'
/usr/lib/gcj-4.2.0_alpha20060909/include/c++/bits/basic_ios.h:46: error: expected `;' before '__attribute__'
/usr/lib/gcj-4.2.0_alpha20060909/include/c++/bits/basic_ios.h:46: error: expected unqualified-id before '{' token
/usr/lib/gcj-4.2.0_alpha20060909/include/c++/bits/basic_ios.tcc:41: error: expected `=' before '__attribute__'
/usr/lib/gcj-4.2.0_alpha20060909/include/c++/bits/basic_ios.tcc:41: error: expected identifier before '__attribute__'
/usr/lib/gcj-4.2.0_alpha20060909/include/c++/bits/basic_ios.tcc:41: error: expected `;' before '__attribute__'
/usr/lib/gcj-4.2.0_alpha20060909/include/c++/bits/basic_ios.tcc:41: error: expected unqualified-id before '{' token
/usr/lib/gcj-4.2.0_alpha20060909/include/c++/istream:47: error: expected `=' before '__attribute__'
/usr/lib/gcj-4.2.0_alpha20060909/include/c++/istream:47: error: expected identifier before '__attribute__'
/usr/lib/gcj-4.2.0_alpha20060909/include/c++/istream:47: error: expected `;' before '__attribute__'
/usr/lib/gcj-4.2.0_alpha20060909/include/c++/istream:47: error: expected unqualified-id before '{' token
/usr/lib/gcj-4.2.0_alpha20060909/include/c++/bits/locale_facets.tcc:45: error: expected `=' before '__attribute__'
/usr/lib/gcj-4.2.0_alpha20060909/include/c++/bits/locale_facets.tcc:45: error: expected identifier before '__attribute__'
/usr/lib/gcj-4.2.0_alpha20060909/include/c++/bits/locale_facets.tcc:45: error: expected `;' before '__attribute__'
/usr/lib/gcj-4.2.0_alpha20060909/include/c++/bits/locale_facets.tcc:45: error: expected unqualified-id before '{' token
/usr/lib/gcj-4.2.0_alpha20060909/include/c++/ostream:46: error: expected `=' before '__attribute__'
/usr/lib/gcj-4.2.0_alpha20060909/include/c++/ostream:46: error: expected identifier before '__attribute__'
/usr/lib/gcj-4.2.0_alpha20060909/include/c++/ostream:46: error: expected `;' before '__attribute__'
/usr/lib/gcj-4.2.0_alpha20060909/include/c++/ostream:46: error: expected unqualified-id before '{' token
/usr/lib/gcj-4.2.0_alpha20060909/include/c++/bits/ostream.tcc:47: error: expected `=' before '__attribute__'
/usr/lib/gcj-4.2.0_alpha20060909/include/c++/bits/ostream.tcc:47: error: expected identifier before '__attribute__'
/usr/lib/gcj-4.2.0_alpha20060909/include/c++/bits/ostream.tcc:47: error: expected `;' before '__attribute__'
/usr/lib/gcj-4.2.0_alpha20060909/include/c++/bits/ostream.tcc:47: error: expected unqualified-id before '{' token
/usr/lib/gcj-4.2.0_alpha20060909/include/c++/bits/istream.tcc:48: error: expected `=' before '__attribute__'
/usr/lib/gcj-4.2.0_alpha20060909/include/c++/bits/istream.tcc:48: error: expected identifier before '__attribute__'
/usr/lib/gcj-4.2.0_alpha20060909/include/c++/bits/istream.tcc:48: error: expected `;' before '__attribute__'
/usr/lib/gcj-4.2.0_alpha20060909/include/c++/bits/istream.tcc:48: error: expected unqualified-id before '{' token
/usr/lib/gcj-4.2.0_alpha20060909/include/c++/i686-pc-linux-gnu/bits/basic_file.h:48: error: expected `=' before '__attribute__'
/usr/lib/gcj-4.2.0_alpha20060909/include/c++/i686-pc-linux-gnu/bits/basic_file.h:48: error: expected identifier before '__attribute__'
/usr/lib/gcj-4.2.0_alpha20060909/include/c++/i686-pc-linux-gnu/bits/basic_file.h:48: error: expected `;' before '__attribute__'
/usr/lib/gcj-4.2.0_alpha20060909/include/c++/i686-pc-linux-gnu/bits/basic_file.h:48: error: expected unqualified-id before '{' token
/usr/lib/gcj-4.2.0_alpha20060909/include/c++/fstream:51: error: expected `=' before '__attribute__'
/usr/lib/gcj-4.2.0_alpha20060909/include/c++/fstream:51: error: expected identifier before '__attribute__'
/usr/lib/gcj-4.2.0_alpha20060909/include/c++/fstream:51: error: expected `;' before '__attribute__'
/usr/lib/gcj-4.2.0_alpha20060909/include/c++/fstream:51: error: expected unqualified-id before '{' token
/usr/lib/gcj-4.2.0_alpha20060909/include/c++/bits/fstream.tcc:45: error: expected `=' before '__attribute__'
/usr/lib/gcj-4.2.0_alpha20060909/include/c++/bits/fstream.tcc:45: error: expected identifier before '__attribute__'
/usr/lib/gcj-4.2.0_alpha20060909/include/c++/bits/fstream.tcc:45: error: expected `;' before '__attribute__'
/usr/lib/gcj-4.2.0_alpha20060909/include/c++/bits/fstream.tcc:45: error: expected unqualified-id before '{' token
/var/tmp/portage/subversion-1.4.0/work/subversion-1.4.0/subversion/bindings/java/javahl/native/JNIUtil.h:115: error: 'std::string' has not been declared
/var/tmp/portage/subversion-1.4.0/work/subversion-1.4.0/subversion/bindings/java/javahl/native/JNIUtil.h:128: error: ISO C++ forbids declaration of 'list' with no type
/var/tmp/portage/subversion-1.4.0/work/subversion-1.4.0/subversion/bindings/java/javahl/native/JNIUtil.h:128: error: invalid use of '::'
/var/tmp/portage/subversion-1.4.0/work/subversion-1.4.0/subversion/bindings/java/javahl/native/JNIUtil.h:128: error: expected ';' before '<' token
/var/tmp/portage/subversion-1.4.0/work/subversion-1.4.0/subversion/bindings/java/javahl/native/JNIUtil.h:157: error: 'ofstream' in namespace 'std' does not name a type
make: *** [subversion/bindings/java/javahl/native/BlameCallback.lo] Error 1
!!! ERROR: dev-util/subversion-1.4.0 failed.
Call stack:
ebuild.sh, line 1546: Called dyn_compile
ebuild.sh, line 937: Called src_compile
subversion-1.4.0.ebuild, line 138: Called die
!!! Compilation failed
!!! If you need support, post the topmost build error, and the call stack if relevant.
!!! When you file a bug report, please include the following information:
GENTOO_VM=gcj-jdk-4.2 CLASSPATH="" JAVA_HOME="/usr/lib/gcj-4.2.0_alpha20060909"
JAVACFLAGS="-source 1.4 -target 1.4" COMPILER=""
and of course, the output of emerge --info