All pastes #17546 Raw Edit

Something

public text v1 · immutable
#17546 ·published 2005-07-12 15:22 UTC
rendered paste body
include/linux/elf.h:294: error: syntax error before "p_flags"
include/linux/elf.h:294: warning: type defaults to `int' in declaration of `p_flags'
include/linux/elf.h:294: warning: data definition has no type or storage class
include/linux/elf.h:295: error: syntax error before "p_align"
include/linux/elf.h:295: warning: type defaults to `int' in declaration of `p_align'
include/linux/elf.h:295: warning: data definition has no type or storage class
include/linux/elf.h:296: warning: type defaults to `int' in declaration of `Elf32_Phdr'
include/linux/elf.h:296: warning: data definition has no type or storage class
include/linux/elf.h:299: error: syntax error before "Elf64_Word"
include/linux/elf.h:299: warning: no semicolon at end of struct or union
include/linux/elf.h:300: warning: type defaults to `int' in declaration of `p_flags'
include/linux/elf.h:300: warning: data definition has no type or storage class
include/linux/elf.h:301: error: syntax error before "p_offset"
include/linux/elf.h:301: warning: type defaults to `int' in declaration of `p_offset'
include/linux/elf.h:301: warning: data definition has no type or storage class
include/linux/elf.h:302: error: syntax error before "p_vaddr"
include/linux/elf.h:302: warning: type defaults to `int' in declaration of `p_vaddr'
include/linux/elf.h:302: warning: data definition has no type or storage class
include/linux/elf.h:303: error: syntax error before "p_paddr"
include/linux/elf.h:303: warning: type defaults to `int' in declaration of `p_paddr'
include/linux/elf.h:303: warning: data definition has no type or storage class
include/linux/elf.h:304: error: syntax error before "p_filesz"
include/linux/elf.h:304: warning: type defaults to `int' in declaration of `p_filesz'
include/linux/elf.h:304: warning: data definition has no type or storage class
include/linux/elf.h:305: error: syntax error before "p_memsz"
include/linux/elf.h:305: warning: type defaults to `int' in declaration of `p_memsz'
include/linux/elf.h:305: warning: data definition has no type or storage class
include/linux/elf.h:306: error: syntax error before "p_align"
include/linux/elf.h:306: warning: type defaults to `int' in declaration of `p_align'
include/linux/elf.h:306: warning: data definition has no type or storage class
include/linux/elf.h:307: warning: type defaults to `int' in declaration of `Elf64_Phdr'
include/linux/elf.h:307: warning: data definition has no type or storage class
include/linux/elf.h:344: error: syntax error before "Elf32_Word"
include/linux/elf.h:344: warning: no semicolon at end of struct or union
include/linux/elf.h:345: warning: type defaults to `int' in declaration of `sh_type'
include/linux/elf.h:345: warning: data definition has no type or storage class
include/linux/elf.h:346: error: syntax error before "sh_flags"
include/linux/elf.h:346: warning: type defaults to `int' in declaration of `sh_flags'
include/linux/elf.h:346: warning: data definition has no type or storage class
include/linux/elf.h:347: error: syntax error before "sh_addr"
include/linux/elf.h:347: warning: type defaults to `int' in declaration of `sh_addr'
include/linux/elf.h:347: warning: data definition has no type or storage class
include/linux/elf.h:348: error: syntax error before "sh_offset"
include/linux/elf.h:348: warning: type defaults to `int' in declaration of `sh_offset'
include/linux/elf.h:348: warning: data definition has no type or storage class
include/linux/elf.h:349: error: syntax error before "sh_size"
include/linux/elf.h:349: warning: type defaults to `int' in declaration of `sh_size'
include/linux/elf.h:349: warning: data definition has no type or storage class
include/linux/elf.h:350: error: syntax error before "sh_link"
include/linux/elf.h:350: warning: type defaults to `int' in declaration of `sh_link'
include/linux/elf.h:350: warning: data definition has no type or storage class
include/linux/elf.h:351: error: syntax error before "sh_info"
include/linux/elf.h:351: warning: type defaults to `int' in declaration of `sh_info'
include/linux/elf.h:351: warning: data definition has no type or storage class
include/linux/elf.h:352: error: syntax error before "sh_addralign"
include/linux/elf.h:352: warning: type defaults to `int' in declaration of `sh_addralign'
include/linux/elf.h:352: warning: data definition has no type or storage class
include/linux/elf.h:353: error: syntax error before "sh_entsize"
include/linux/elf.h:353: warning: type defaults to `int' in declaration of `sh_entsize'
include/linux/elf.h:353: warning: data definition has no type or storage class
include/linux/elf.h:354: warning: type defaults to `int' in declaration of `Elf32_Shdr'
include/linux/elf.h:354: warning: data definition has no type or storage class
include/linux/elf.h:357: error: syntax error before "Elf64_Word"
include/linux/elf.h:357: warning: no semicolon at end of struct or union
include/linux/elf.h:358: warning: type defaults to `int' in declaration of `sh_type'
include/linux/elf.h:358: warning: data definition has no type or storage class
include/linux/elf.h:359: error: syntax error before "sh_flags"
include/linux/elf.h:359: warning: type defaults to `int' in declaration of `sh_flags'
include/linux/elf.h:359: warning: data definition has no type or storage class
include/linux/elf.h:360: error: syntax error before "sh_addr"
include/linux/elf.h:360: warning: type defaults to `int' in declaration of `sh_addr'
include/linux/elf.h:360: warning: data definition has no type or storage class
include/linux/elf.h:361: error: syntax error before "sh_offset"
include/linux/elf.h:361: warning: type defaults to `int' in declaration of `sh_offset'
include/linux/elf.h:361: warning: data definition has no type or storage class
include/linux/elf.h:362: error: syntax error before "sh_size"
include/linux/elf.h:362: warning: type defaults to `int' in declaration of `sh_size'
include/linux/elf.h:362: warning: data definition has no type or storage class
include/linux/elf.h:363: error: syntax error before "sh_link"
include/linux/elf.h:363: warning: type defaults to `int' in declaration of `sh_link'
include/linux/elf.h:363: warning: data definition has no type or storage class
include/linux/elf.h:364: error: syntax error before "sh_info"
include/linux/elf.h:364: warning: type defaults to `int' in declaration of `sh_info'
include/linux/elf.h:364: warning: data definition has no type or storage class
include/linux/elf.h:365: error: syntax error before "sh_addralign"
include/linux/elf.h:365: warning: type defaults to `int' in declaration of `sh_addralign'
include/linux/elf.h:365: warning: data definition has no type or storage class
include/linux/elf.h:366: error: syntax error before "sh_entsize"
include/linux/elf.h:366: warning: type defaults to `int' in declaration of `sh_entsize'
include/linux/elf.h:366: warning: data definition has no type or storage class
include/linux/elf.h:367: warning: type defaults to `int' in declaration of `Elf64_Shdr'
include/linux/elf.h:367: warning: data definition has no type or storage class
include/linux/elf.h:417: error: syntax error before "Elf32_Word"
include/linux/elf.h:417: warning: no semicolon at end of struct or union
include/linux/elf.h:418: warning: type defaults to `int' in declaration of `n_descsz'
include/linux/elf.h:418: warning: data definition has no type or storage class
include/linux/elf.h:419: error: syntax error before "n_type"
include/linux/elf.h:419: warning: type defaults to `int' in declaration of `n_type'
include/linux/elf.h:419: warning: data definition has no type or storage class
include/linux/elf.h:420: warning: type defaults to `int' in declaration of `Elf32_Nhdr'
include/linux/elf.h:420: warning: data definition has no type or storage class
include/linux/elf.h:424: error: syntax error before "Elf64_Word"
include/linux/elf.h:424: warning: no semicolon at end of struct or union
include/linux/elf.h:425: warning: type defaults to `int' in declaration of `n_descsz'
include/linux/elf.h:425: warning: data definition has no type or storage class
include/linux/elf.h:426: error: syntax error before "n_type"
include/linux/elf.h:426: warning: type defaults to `int' in declaration of `n_type'
include/linux/elf.h:426: warning: data definition has no type or storage class
include/linux/elf.h:427: warning: type defaults to `int' in declaration of `Elf64_Nhdr'
include/linux/elf.h:427: warning: data definition has no type or storage class
include/linux/elf.h:438: error: syntax error before "_DYNAMIC"
include/linux/elf.h:438: warning: type defaults to `int' in declaration of `_DYNAMIC'
include/linux/elf.h:438: warning: data definition has no type or storage class
In file included from include/linux/kobject.h:22,
                 from include/linux/module.h:19,
                 from /usr/src/ivtv-0.3.6y/driver/msp3400.c:38:
include/linux/sysfs.h:12:24: asm/atomic.h: No such file or directory
In file included from include/linux/kobject.h:22,
                 from include/linux/module.h:19,
                 from /usr/src/ivtv-0.3.6y/driver/msp3400.c:38:
include/linux/sysfs.h:20: error: syntax error before "mode_t"
include/linux/sysfs.h:20: warning: no semicolon at end of struct or union
include/linux/sysfs.h:51: error: field `attr' has incomplete type
include/linux/sysfs.h:52: error: syntax error before "size_t"
include/linux/sysfs.h:52: warning: no semicolon at end of struct or union
include/linux/sysfs.h:53: error: syntax error before '*' token
include/linux/sysfs.h:53: error: syntax error before "loff_t"
include/linux/sysfs.h:53: warning: type defaults to `int' in declaration of `ssize_t'
include/linux/sysfs.h:53: warning: function declaration isn't a prototype
include/linux/sysfs.h:53: error: `ssize_t' declared as function returning a function
include/linux/sysfs.h:53: warning: function declaration isn't a prototype
include/linux/sysfs.h:53: error: `ssize_t' redeclared as different kind of symbol
include/linux/types.h:69: error: previous declaration of `ssize_t'
include/linux/sysfs.h:53: warning: data definition has no type or storage class
include/linux/sysfs.h:54: error: syntax error before '*' token
include/linux/sysfs.h:54: error: syntax error before "loff_t"
include/linux/sysfs.h:54: warning: type defaults to `int' in declaration of `ssize_t'
include/linux/sysfs.h:54: warning: function declaration isn't a prototype
include/linux/sysfs.h:54: error: `ssize_t' declared as function returning a function
include/linux/sysfs.h:54: warning: function declaration isn't a prototype
include/linux/sysfs.h:54: warning: data definition has no type or storage class
include/linux/sysfs.h:58: error: syntax error before "ssize_t"
include/linux/sysfs.h:58: warning: no semicolon at end of struct or union
include/linux/sysfs.h:59: error: syntax error before '*' token
include/linux/sysfs.h:59: error: syntax error before "size_t"
include/linux/sysfs.h:59: warning: type defaults to `int' in declaration of `ssize_t'
include/linux/sysfs.h:59: warning: function declaration isn't a prototype
include/linux/sysfs.h:59: error: `ssize_t' declared as function returning a function
include/linux/sysfs.h:59: warning: function declaration isn't a prototype
include/linux/sysfs.h:59: warning: data definition has no type or storage class
include/linux/sysfs.h:63: error: syntax error before "atomic_t"
include/linux/sysfs.h:63: warning: no semicolon at end of struct or union
include/linux/sysfs.h:68: error: syntax error before "s_mode"
include/linux/sysfs.h:68: warning: type defaults to `int' in declaration of `s_mode'
include/linux/sysfs.h:68: warning: data definition has no type or storage class
include/linux/sysfs.h:70: error: syntax error before '}' token
In file included from include/linux/kobject.h:23,
                 from include/linux/module.h:19,
                 from /usr/src/ivtv-0.3.6y/driver/msp3400.c:38:
include/linux/rwsem.h:19:24: asm/system.h: No such file or directory
include/linux/rwsem.h:20:24: asm/atomic.h: No such file or directory
In file included from include/linux/rwsem.h:25,
                 from include/linux/kobject.h:23,
                 from include/linux/module.h:19,
                 from /usr/src/ivtv-0.3.6y/driver/msp3400.c:38:
include/linux/rwsem-spinlock.h:32: error: syntax error before "__s32"
include/linux/rwsem-spinlock.h:32: warning: no semicolon at end of struct or union
include/linux/rwsem-spinlock.h:38: error: syntax error before '}' token
In file included from include/linux/kobject.h:24,
                 from include/linux/module.h:19,
                 from /usr/src/ivtv-0.3.6y/driver/msp3400.c:38:
include/linux/kref.h:21:24: asm/atomic.h: No such file or directory
In file included from include/linux/kobject.h:24,
                 from include/linux/module.h:19,
                 from /usr/src/ivtv-0.3.6y/driver/msp3400.c:38:
include/linux/kref.h:24: error: syntax error before "atomic_t"
include/linux/kref.h:24: warning: no semicolon at end of struct or union
In file included from include/linux/module.h:19,
                 from /usr/src/ivtv-0.3.6y/driver/msp3400.c:38:
include/linux/kobject.h:26:24: asm/atomic.h: No such file or directory
In file included from include/linux/module.h:19,
                 from /usr/src/ivtv-0.3.6y/driver/msp3400.c:38:
include/linux/kobject.h:31: error: syntax error before "hotplug_seqnum"
include/linux/kobject.h:31: warning: type defaults to `int' in declaration of `hotplug_seqnum'
include/linux/kobject.h:31: warning: data definition has no type or storage class
include/linux/kobject.h:36: error: field `kref' has incomplete type
include/linux/kobject.h: In function `to_kset':
include/linux/kobject.h:116: error: invalid operands to binary &
include/linux/kobject.h: At top level:
include/linux/kobject.h:150: error: field `rwsem' has incomplete type
include/linux/kobject.h: In function `subsys_get':
include/linux/kobject.h:222: error: invalid operands to binary &
include/linux/kobject.h: At top level:
include/linux/kobject.h:231: error: field `attr' has incomplete type
include/linux/kobject.h:232: error: syntax error before "ssize_t"
include/linux/kobject.h:232: warning: no semicolon at end of struct or union
include/linux/kobject.h:233: error: syntax error before '*' token
include/linux/kobject.h:233: error: syntax error before "size_t"
include/linux/kobject.h:233: warning: type defaults to `int' in declaration of `ssize_t'
include/linux/kobject.h:233: warning: function declaration isn't a prototype
include/linux/kobject.h:233: error: `ssize_t' declared as function returning a function
include/linux/kobject.h:233: warning: function declaration isn't a prototype
include/linux/kobject.h:233: warning: data definition has no type or storage class
In file included from /usr/src/ivtv-0.3.6y/driver/msp3400.c:38:
include/linux/module.h:21:23: asm/local.h: No such file or directory
include/linux/module.h:23:24: asm/module.h: No such file or directory
In file included from /usr/src/ivtv-0.3.6y/driver/msp3400.c:38:
include/linux/module.h:50: error: field `attr' has incomplete type
include/linux/module.h:51: error: syntax error before "ssize_t"
include/linux/module.h:51: warning: no semicolon at end of struct or union
include/linux/module.h:52: error: syntax error before '*' token
include/linux/module.h:52: error: syntax error before "size_t"
include/linux/module.h:52: warning: type defaults to `int' in declaration of `ssize_t'
include/linux/module.h:52: warning: function declaration isn't a prototype
include/linux/module.h:52: error: `ssize_t' declared as function returning a function
include/linux/module.h:52: warning: function declaration isn't a prototype
include/linux/module.h:52: warning: data definition has no type or storage classinclude/linux/module.h:215: error: syntax error before "local_t"
include/linux/module.h:215: warning: no semicolon at end of struct or union
include/linux/module.h:216: warning: empty declaration
include/linux/module.h:229: error: field `attr' has incomplete type
include/linux/module.h:286: error: field `arch' has incomplete type
include/linux/module.h:296: error: field `ref' has incomplete type
include/linux/module.h:310: error: syntax error before "Elf_Sym"
include/linux/module.h:310: warning: no semicolon at end of struct or union
include/linux/module.h:324: error: syntax error before '}' token
include/linux/module.h: In function `module_is_live':
include/linux/module.h:331: error: dereferencing pointer to incomplete type
include/linux/module.h: In function `__module_get':
include/linux/module.h:365: warning: implicit declaration of function `BUG_ON'
include/linux/module.h:366: warning: implicit declaration of function `local_inc'
include/linux/module.h:366: error: dereferencing pointer to incomplete type
include/linux/module.h:366: error: invalid type argument of `->'
include/linux/module.h:367: error: invalid type argument of `->'
include/linux/module.h:367: error: `TIF_NEED_RESCHED' undeclared (first use in this function)
include/linux/module.h: In function `try_module_get':
include/linux/module.h:376: error: invalid type argument of `->'
include/linux/module.h:378: error: dereferencing pointer to incomplete type
include/linux/module.h:381: error: invalid type argument of `->'
include/linux/module.h:381: error: `TIF_NEED_RESCHED' undeclared (first use in this function)
include/linux/module.h: In function `module_put':
include/linux/module.h:389: error: invalid type argument of `->'
include/linux/module.h:390: warning: implicit declaration of function `local_dec'
include/linux/module.h:390: error: dereferencing pointer to incomplete type
include/linux/module.h:393: error: dereferencing pointer to incomplete type
include/linux/module.h:394: error: invalid type argument of `->'
include/linux/module.h:394: error: `TIF_NEED_RESCHED' undeclared (first use in this function)
In file included from /usr/src/ivtv-0.3.6y/driver/msp3400.c:43:
include/linux/delay.h:12:23: asm/delay.h: No such file or directory
In file included from include/linux/device.h:21,
                 from include/linux/i2c.h:34,
                 from /usr/src/ivtv-0.3.6y/driver/msp3400.c:45:
include/linux/pm.h:28:24: asm/atomic.h: No such file or directory
In file included from include/linux/device.h:21,
                 from include/linux/i2c.h:34,
                 from /usr/src/ivtv-0.3.6y/driver/msp3400.c:45:
include/linux/pm.h: At top level:
include/linux/pm.h:227: error: syntax error before "u32"
include/linux/pm.h:227: warning: no semicolon at end of struct or union
include/linux/pm.h:229: warning: type defaults to `int' in declaration of `prev_state'
include/linux/pm.h:229: warning: data definition has no type or storage class
include/linux/pm.h:230: error: syntax error before '*' token
include/linux/pm.h:230: warning: type defaults to `int' in declaration of `saved_state'
include/linux/pm.h:230: warning: data definition has no type or storage class
include/linux/pm.h:231: error: syntax error before "pm_users"
include/linux/pm.h:231: warning: type defaults to `int' in declaration of `pm_users'
include/linux/pm.h:231: warning: data definition has no type or storage class
include/linux/pm.h:235: error: syntax error before '}' token
include/linux/pm.h:239: error: syntax error before "state"
include/linux/pm.h:239: warning: function declaration isn't a prototype
include/linux/pm.h:240: error: syntax error before "state"
include/linux/pm.h:240: warning: function declaration isn't a prototype
In file included from include/linux/i2c.h:34,
                 from /usr/src/ivtv-0.3.6y/driver/msp3400.c:45:
include/linux/device.h:22:27: asm/semaphore.h: No such file or directory
include/linux/device.h:23:24: asm/atomic.h: No such file or directory
In file included from include/linux/i2c.h:34,
                 from /usr/src/ivtv-0.3.6y/driver/msp3400.c:45:
include/linux/device.h:64: error: syntax error before "u32"
include/linux/device.h:64: warning: function declaration isn't a prototype
include/linux/device.h:90: error: field `attr' has incomplete type
include/linux/device.h:91: error: syntax error before "ssize_t"
include/linux/device.h:91: warning: no semicolon at end of struct or union
include/linux/device.h:92: error: syntax error before '*' token
include/linux/device.h:92: error: syntax error before "size_t"
include/linux/device.h:92: warning: type defaults to `int' in declaration of `ssize_t'
include/linux/device.h:92: warning: function declaration isn't a prototype
include/linux/device.h:92: error: `ssize_t' declared as function returning a function
include/linux/device.h:92: warning: function declaration isn't a prototype
include/linux/device.h:92: warning: data definition has no type or storage classinclude/linux/device.h:105: error: field `unload_sem' has incomplete type
include/linux/device.h:114: error: syntax error before "u32"
include/linux/device.h:114: warning: function declaration isn't a prototype
include/linux/device.h:115: error: syntax error before "u32"
include/linux/device.h:115: warning: function declaration isn't a prototype
include/linux/device.h:130: error: field `attr' has incomplete type
include/linux/device.h:131: error: syntax error before "ssize_t"
include/linux/device.h:131: warning: no semicolon at end of struct or union
include/linux/device.h:132: error: syntax error before '*' token
include/linux/device.h:132: error: syntax error before "size_t"
include/linux/device.h:132: warning: type defaults to `int' in declaration of `ssize_t'
include/linux/device.h:132: warning: function declaration isn't a prototype
include/linux/device.h:132: error: `ssize_t' declared as function returning a function
include/linux/device.h:132: warning: function declaration isn't a prototype
include/linux/device.h:132: warning: data definition has no type or storage class
include/linux/device.h:170: error: field `attr' has incomplete type
include/linux/device.h:171: error: syntax error before "ssize_t"
include/linux/device.h:171: warning: no semicolon at end of struct or union
include/linux/device.h:172: error: syntax error before '*' token
include/linux/device.h:172: error: syntax error before "size_t"
include/linux/device.h:172: warning: type defaults to `int' in declaration of `ssize_t'
include/linux/device.h:172: warning: function declaration isn't a prototype
include/linux/device.h:172: error: `ssize_t' declared as function returning a function
include/linux/device.h:172: warning: function declaration isn't a prototype
include/linux/device.h:172: warning: data definition has no type or storage class
include/linux/device.h:218: error: field `attr' has incomplete type
include/linux/device.h:219: error: syntax error before "ssize_t"
include/linux/device.h:219: warning: no semicolon at end of struct or union
include/linux/device.h:220: error: syntax error before '*' token
include/linux/device.h:220: error: syntax error before "size_t"
include/linux/device.h:220: warning: type defaults to `int' in declaration of `ssize_t'
include/linux/device.h:220: warning: function declaration isn't a prototype
include/linux/device.h:220: error: `ssize_t' declared as function returning a function
include/linux/device.h:220: warning: function declaration isn't a prototype
include/linux/device.h:220: warning: data definition has no type or storage class
include/linux/device.h:247: error: syntax error before "dev_t"
include/linux/device.h:248: warning: function declaration isn't a prototype
include/linux/device.h:251: error: syntax error before "dev"
include/linux/device.h:251: warning: function declaration isn't a prototype
include/linux/device.h:270: error: field `power' has incomplete type
include/linux/device.h:272: error: syntax error before "u32"
include/linux/device.h:272: warning: no semicolon at end of struct or union
include/linux/device.h:275: warning: type defaults to `int' in declaration of `dma_mask'
include/linux/device.h:275: warning: data definition has no type or storage class
include/linux/device.h:276: error: syntax error before "coherent_dma_mask"
include/linux/device.h:276: warning: type defaults to `int' in declaration of `coherent_dma_mask'
include/linux/device.h:276: warning: data definition has no type or storage class
include/linux/device.h:288: error: syntax error before '}' token
include/linux/device.h: In function `list_to_dev':
include/linux/device.h:293: error: dereferencing pointer to incomplete type
include/linux/device.h:293: warning: type defaults to `int' in declaration of `__mptr'
include/linux/device.h:293: warning: initialization from incompatible pointer type
include/linux/device.h:293: error: dereferencing pointer to incomplete type
include/linux/device.h: In function `dev_get_drvdata':
include/linux/device.h:299: error: dereferencing pointer to incomplete type
include/linux/device.h: In function `dev_set_drvdata':
include/linux/device.h:305: error: dereferencing pointer to incomplete type
include/linux/device.h: At top level:
include/linux/device.h:333: error: field `attr' has incomplete type
include/linux/device.h:334: error: syntax error before "ssize_t"
include/linux/device.h:334: warning: no semicolon at end of struct or union
include/linux/device.h:335: error: syntax error before '*' token
include/linux/device.h:335: error: syntax error before "size_t"
include/linux/device.h:335: warning: type defaults to `int' in declaration of `ssize_t'
include/linux/device.h:335: warning: function declaration isn't a prototype
include/linux/device.h:335: error: `ssize_t' declared as function returning a function
include/linux/device.h:335: warning: function declaration isn't a prototype
include/linux/device.h:335: warning: data definition has no type or storage class
include/linux/device.h:369: error: syntax error before "u32"
include/linux/device.h:369: warning: no semicolon at end of struct or union
include/linux/device.h:371: error: syntax error before "num_resources"
include/linux/device.h:371: warning: type defaults to `int' in declaration of `num_resources'
include/linux/device.h:371: warning: data definition has no type or storage class
include/linux/device.h:373: error: syntax error before '}' token
In file included from /usr/src/ivtv-0.3.6y/driver/msp3400.c:45:
include/linux/i2c.h:35:27: asm/semaphore.h: No such file or directory
In file included from /usr/src/ivtv-0.3.6y/driver/msp3400.c:45:
include/linux/i2c.h:74: error: syntax error before "i2c_smbus_xfer"
include/linux/i2c.h:74: error: syntax error before "u16"
include/linux/i2c.h:77: warning: type defaults to `int' in declaration of `i2c_smbus_xfer'
include/linux/i2c.h:77: warning: function declaration isn't a prototype
include/linux/i2c.h:77: warning: data definition has no type or storage class
include/linux/i2c.h:82: error: syntax error before "i2c_smbus_write_quick"
include/linux/i2c.h:82: error: syntax error before "u8"
include/linux/i2c.h:82: warning: type defaults to `int' in declaration of `i2c_smbus_write_quick'
include/linux/i2c.h:82: warning: function declaration isn't a prototype
include/linux/i2c.h:82: warning: data definition has no type or storage class
include/linux/i2c.h:83: error: syntax error before "i2c_smbus_read_byte"
include/linux/i2c.h:83: warning: type defaults to `int' in declaration of `i2c_smbus_read_byte'
include/linux/i2c.h:83: warning: data definition has no type or storage class
include/linux/i2c.h:84: error: syntax error before "i2c_smbus_write_byte"
include/linux/i2c.h:84: error: syntax error before "u8"
include/linux/i2c.h:84: warning: type defaults to `int' in declaration of `i2c_smbus_write_byte'
include/linux/i2c.h:84: warning: function declaration isn't a prototype
include/linux/i2c.h:84: warning: data definition has no type or storage class
include/linux/i2c.h:85: error: syntax error before "i2c_smbus_read_byte_data"
include/linux/i2c.h:85: error: syntax error before "u8"
include/linux/i2c.h:85: warning: type defaults to `int' in declaration of `i2c_smbus_read_byte_data'
include/linux/i2c.h:85: warning: function declaration isn't a prototype
include/linux/i2c.h:85: warning: data definition has no type or storage class
include/linux/i2c.h:86: error: syntax error before "i2c_smbus_write_byte_data"
include/linux/i2c.h:87: error: syntax error before "u8"
include/linux/i2c.h:87: warning: type defaults to `int' in declaration of `i2c_smbus_write_byte_data'
include/linux/i2c.h:87: warning: function declaration isn't a prototype
include/linux/i2c.h:87: warning: data definition has no type or storage class
include/linux/i2c.h:88: error: syntax error before "i2c_smbus_read_word_data"
include/linux/i2c.h:88: error: syntax error before "u8"
include/linux/i2c.h:88: warning: type defaults to `int' in declaration of `i2c_smbus_read_word_data'
include/linux/i2c.h:88: warning: function declaration isn't a prototype
include/linux/i2c.h:88: warning: data definition has no type or storage class
include/linux/i2c.h:89: error: syntax error before "i2c_smbus_write_word_data"
include/linux/i2c.h:90: error: syntax error before "u8"
include/linux/i2c.h:90: warning: type defaults to `int' in declaration of `i2c_smbus_write_word_data'make[2]: *** [/usr/src/ivtv-0.3.6y/driver/msp3400.o] Interrupt
make[1]: *** [_module_/usr/src/ivtv-0.3.6y/driver] Interrupt
make: *** [all] Interrupt