All pastes #175404 Raw Edit

Something

public text v1 · immutable
·published 2006-09-18 19:35 UTC
rendered paste body
| gcc -c ./../common/run.c -DHAVE_CONFIG_H     -DPROFILE=1 -DWITH_PROFILE=-1          -DDEFAULT_INLINE=0           -DMODET -DNEED_UI_LOOP_HOOK -DSIM_TARGET_SWITCHES   -I. -I. -I../common -I./../common -I../../include -I./../../include -I../../bfd -I./../../bfd -I../../opcodes -I./../../opcodes -I../../intl -I./../../intl -isystem/build/biobank/biobank/oe/biobank/tmp/staging/x86_64-linux/include -O2
| iwmmxt.c: In function 'WMAC':
| iwmmxt.c:2117: error: invalid lvalue in assignment
| iwmmxt.c:2133: error: invalid lvalue in assignment
| iwmmxt.c: In function 'WMADD':
| iwmmxt.c:2169: error: invalid lvalue in assignment
| iwmmxt.c:2177: error: invalid lvalue in assignment
| iwmmxt.c:2186: error: invalid lvalue in assignment
| iwmmxt.c:2191: error: invalid lvalue in assignment
| iwmmxt.c: In function 'Fetch_Iwmmxt_Register':
| iwmmxt.c:3707: warning: incompatible implicit declaration of built-in function 'memcpy'
| iwmmxt.c:3712: warning: incompatible implicit declaration of built-in function 'memcpy'
| iwmmxt.c: In function 'Store_Iwmmxt_Register':
| iwmmxt.c:3722: warning: incompatible implicit declaration of built-in function 'memcpy'
| iwmmxt.c:3727: warning: incompatible implicit declaration of built-in function 'memcpy'
| rm -f tmp-tvals.h tmp-tmap.c
| ./gentmap -h >tmp-tvals.h
| /bin/sh ./../../move-if-change tmp-tvals.h targ-vals.h
| make[2]: *** [iwmmxt.o] Error 1
| make[2]: *** Waiting for unfinished jobs....
| ./gentmap -c >tmp-tmap.c
| /bin/sh ./../../move-if-change tmp-tmap.c targ-map.c
| touch stamp-tvals
| make[2]: Leaving directory `/build/biobank/biobank/oe/biobank/tmp/work/gdb-cross-6.3-r0/gdb-6.3/sim/arm'
| make[1]: *** [all] Error 2
| make[1]: Leaving directory `/build/biobank/biobank/oe/biobank/tmp/work/gdb-cross-6.3-r0/gdb-6.3/sim'
| make: *** [all-sim] Error 2
| FATAL: oe_runmake failed
NOTE: Task failed: /build/biobank/biobank/oe/biobank/tmp/work/gdb-cross-6.3-r0/temp/log.do_compile.25821
NOTE: package gdb-cross-6.3-r0: task do_compile: failed
ERROR: TaskFailed event exception, aborting
NOTE: package gdb-cross-6.3: failed
ERROR: Couldn't build 'gdb-cross'
BB>>