myhost:/opt/perl-5.8.8/.cpan/build/DBD-Oracle-1.18# make test
rm -f blib/arch/auto/DBD/Oracle/Oracle.sl
/usr/bin/ld +b "/vol1/oracle/app/oracle/product/9.2.3/lib32" -b +vnocompatwarnings -L/usr/local/lib Oracle.o dbdimp.o oci8.o -o blib/arch/auto/DBD/Oracle/Oracle.sl \
-L/vol1/oracle/app/oracle/product/9.2.3/lib32 -lclntsh -lrt -lpthread \
chmod 755 blib/arch/auto/DBD/Oracle/Oracle.sl
cp Oracle.bs blib/arch/auto/DBD/Oracle/Oracle.bs
chmod 644 blib/arch/auto/DBD/Oracle/Oracle.bs
PERL_DL_NONLAZY=1 /opt/perl-5.8.8/bin/perl "-MExtUtils::Command::MM" "-e" "test_harness(0, 'blib/lib', 'blib/arch')" t/*.t
t/01base................ok
t/10general.............ok
t/15nls.................ok
t/20select..............ok
t/21nchar............... Database and client versions and character sets:
Database 9.2.0.5.0 CHAR set is WE8ISO8859P1 (Non-Unicode), NCHAR set is AL16UTF16 (Unicode)
Client 9.2.0.5 NLS_LANG is 'FRENCH_CANADA.WE8ISO8859P1', NLS_NCHAR is '<unset>'
t/21nchar...............ok
t/22nchar_al32utf8......ok
t/22nchar_utf8..........ok
t/23wide_db.............skipped
all skipped: Database character set is not Unicode
t/23wide_db_8bit........skipped
all skipped: Database character set is not Unicode
t/23wide_db_al32utf8....skipped
all skipped: Database character set is not Unicode
t/24implicit_utf8.......NOK 33
# Failed test 'byte_string test of row 4: column: nch (uft8) smiley face'
# in t/nchar_test_lib.pl at line 341.
# got: '38|58'
# expected: '226|152|186'
# Failed test 'nice_string test of row 4: column: nch (uft8) smiley face'
# in t/nchar_test_lib.pl at line 344.
# got: '&:'
# expected: '\x{263A}'
t/24implicit_utf8.......NOK 34# row 4: DUMP(nch) = Typ=1 Len=4: 0,38,0,58
# Failed test 'byte_string test of row 4: column: nch (uft8) smiley face'
t/24implicit_utf8.......NOK 70# in t/nchar_test_lib.pl at line 341.
# got: '38|58'
# expected: '226|152|186'
# Failed test 'nice_string test of row 4: column: nch (uft8) smiley face'
# in t/nchar_test_lib.pl at line 344.
t/24implicit_utf8.......NOK 71# got: '&:'
# expected: '\x{263A}'
# row 4: DUMP(nch) = Typ=1 Len=4: 0,38,0,58
# Looks like you failed 4 tests of 74.
t/24implicit_utf8.......dubious
Test returned status 4 (wstat 1024, 0x400)
DIED. FAILED tests 33-34, 70-71
Failed 4/74 tests, 94.59% okay
t/25plsql...............ok
t/26exe_array...........ok 1/13DBD::Oracle::st execute_array warning: ORA-24381: error(s) in array DML (DBD SUCCESS_WITH_INFO: error possibly near <*> indicator at char 66 in 'INSERT INTO dbd_ora__drop_me ( row_1, row_2, row_3) VALUES (:p1,:<*>p2,:p3)') [for Statement "INSERT INTO dbd_ora__drop_me ( row_1, row_2, row_3) VALUES (?,?,?)"] at t/26exe_array.t line 77.
t/26exe_array...........ok
t/30long................ok
122/470 skipped: various reasons
t/31lob.................ok 1/9DBD::Oracle::db selectrow_array failed: ORA-00942: table or view does not exist (DBD ERROR: error possibly near <*> indicator at char 103 in '
SELECT cache_lobs + nocache_lobs AS temp_lob_count
FROM v$temporary_lobs templob,
<*>v$session sess
WHERE sess.sid = templob.sid
AND sess.audsid = userenv('sessionid') ') [for Statement "
SELECT cache_lobs + nocache_lobs AS temp_lob_count
FROM v$temporary_lobs templob,
v$session sess
WHERE sess.sid = templob.sid
AND sess.audsid = userenv('sessionid') "] at t/31lob.t line 58.
# Failed test 'no temp lobs left'
t/31lob.................NOK 9# in t/31lob.t at line 166.
# got: undef
# expected: '0'
# Looks like you failed 1 test of 9.
t/31lob.................dubious
Test returned status 1 (wstat 256, 0x100)
DIED. FAILED test 9
Failed 1/9 tests, 88.89% okay
t/40ph_type.............ok 1/19 Placeholder behaviour for ora_type=1 (the default) varies with Oracle version.
Oracle 7 didn't strip trailing spaces, Oracle 8 did, until 9.2.x
Your system doesn't. If that seems odd, let us know.
t/40ph_type.............ok
t/50cursor..............ok
t/55nested..............ok
t/60reauth..............ORACLE_USERID_2 not defined. Tests skipped.
skipped
all skipped: no reason given
t/70meta................ok
Failed Test Stat Wstat Total Fail List of Failed
-----------------------------------------------------------------------------------------------------------------------------------
t/24implicit_utf8.t 4 1024 74 4 33-34 70-71
t/31lob.t 1 256 9 1 9
4 tests and 122 subtests skipped.
Failed 2/20 test scripts. 5/1924 subtests failed.
Files=20, Tests=1924, 51 wallclock secs (40.06 cusr + 5.63 csys = 45.69 CPU)
Failed 2/20 test programs. 5/1924 subtests failed.
*** Error exit code 255
Stop.
myhost:/opt/perl-5.8.8/.cpan/build/DBD-Oracle-1.18#