rendered paste body/bin/install -c -m 644 'stock_zoom-object.png' '/var/tmp/portage/gnome-icon-theme-2.14.2/image//usr/share/icons/gnome/16x16/stock/navigation/stock_zoom-object.png'
/bin/install -c -m 644 'stock_zoom-optimal.png' '/var/tmp/portage/gnome-icon-theme-2.14.2/image//usr/share/icons/gnome/16x16/stock/navigation/stock_zoom-optimal.png'
/bin/install -c -m 644 'stock_zoom-out.png' '/var/tmp/portage/gnome-icon-theme-2.14.2/image//usr/share/icons/gnome/16x16/stock/navigation/stock_zoom-out.png'
/bin/install -c -m 644 'stock_zoom-page.png' '/var/tmp/portage/gnome-icon-theme-2.14.2/image//usr/share/icons/gnome/16x16/stock/navigation/stock_zoom-page.png'
/bin/install -c -m 644 'stock_zoom-page-width.png' '/var/tmp/portage/gnome-icon-theme-2.14.2/image//usr/share/icons/gnome/16x16/stock/navigation/stock_zoom-page-width.png'
/bin/install -c -m 644 'stock_zoom.png' '/var/tmp/portage/gnome-icon-theme-2.14.2/image//usr/share/icons/gnome/16x16/stock/navigation/stock_zoom.png'
/bin/install -c -m 644 'stock_zoom-previous.png' '/var/tmp/portage/gnome-icon-theme-2.14.2/image//usr/share/icons/gnome/16x16/stock/navigation/stock_zoom-previous.png'
/bin/install -c -m 644 'stock_zoom-shift.png' '/var/tmp/portage/gnome-icon-theme-2.14.2/image//usr/share/icons/gnome/16x16/stock/navigation/stock_zoom-shift.png'
make[4]: Leaving directory `/var/tmp/portage/gnome-icon-theme-2.14.2/work/gnome-icon-theme-2.14.2/16x16/stock/navigation'
make[3]: Leaving directory `/var/tmp/portage/gnome-icon-theme-2.14.2/work/gnome-icon-theme-2.14.2/16x16/stock/navigation'
Making install in net
make[3]: Entering directory `/var/tmp/portage/gnome-icon-theme-2.14.2/work/gnome-icon-theme-2.14.2/16x16/stock/net'
make[4]: Entering directory `/var/tmp/portage/gnome-icon-theme-2.14.2/work/gnome-icon-theme-2.14.2/16x16/stock/net'
make[4]: Nothing to be done for `install-exec-am'.
/bin/sh ../../../mkinstalldirs /var/tmp/portage/gnome-icon-theme-2.14.2/image//usr/share/icons/gnome/16x16/stock/net/../../filesystems
mkdir -p -- /var/tmp/portage/gnome-icon-theme-2.14.2/image//usr/share/icons/gnome/16x16/stock/net/../../filesystems
mkdir: cannot create directory `/var/tmp/portage/gnome-icon-theme-2.14.2/image//usr/share/icons/gnome/16x16/stock/net/../../filesystems': File exists
make[4]: *** [install-data-local] Error 1
make[4]: Leaving directory `/var/tmp/portage/gnome-icon-theme-2.14.2/work/gnome-icon-theme-2.14.2/16x16/stock/net'
make[3]: *** [install-am] Error 2
make[3]: Leaving directory `/var/tmp/portage/gnome-icon-theme-2.14.2/work/gnome-icon-theme-2.14.2/16x16/stock/net'
make[2]: *** [install-recursive] Error 1
make[2]: Leaving directory `/var/tmp/portage/gnome-icon-theme-2.14.2/work/gnome-icon-theme-2.14.2/16x16/stock'
make[1]: *** [install-recursive] Error 1
make[1]: Leaving directory `/var/tmp/portage/gnome-icon-theme-2.14.2/work/gnome-icon-theme-2.14.2/16x16'
make: *** [install-recursive] Error 1
!!! ERROR: x11-themes/gnome-icon-theme-2.14.2 failed.
Call stack:
ebuild.sh, line 1546: Called dyn_install
ebuild.sh, line 1020: Called src_install
ebuild.sh, line 1255: Called gnome2_src_install
gnome2.eclass, line 77: Called die
!!! install failed
!!! If you need support, post the topmost build error, and the call stack if relevant.