slax orinoco-0.13-dragorn-2.6.17 # make
make -C /usr/src/linux-2.6.15.6 M=/usr/src/orinoco-0.13-dragorn-2.6.17 modules
make[1]: Entering directory `/usr/src/linux-2.6.15.6'
CC [M] /usr/src/orinoco-0.13-dragorn-2.6.17/hermes.o
CC [M] /usr/src/orinoco-0.13-dragorn-2.6.17/orinoco.o
/usr/src/orinoco-0.13-dragorn-2.6.17/orinoco.c: In function `orinoco_debug_dump_recs':
/usr/src/orinoco-0.13-dragorn-2.6.17/orinoco.c:4317: warning: unused variable `hdr80211'
/usr/src/orinoco-0.13-dragorn-2.6.17/orinoco.c: In function `free_orinocodev':
/usr/src/orinoco-0.13-dragorn-2.6.17/orinoco.c:4633: warning: unused variable `priv'
CC [M] /usr/src/orinoco-0.13-dragorn-2.6.17/orinoco_pci.o
/usr/src/orinoco-0.13-dragorn-2.6.17/orinoco_pci.c: In function `orinoco_pci_init_one':
/usr/src/orinoco-0.13-dragorn-2.6.17/orinoco_pci.c:234: warning: passing arg 2 of `hermes_struct_init' makes pointer from integer without a cast
/usr/src/orinoco-0.13-dragorn-2.6.17/orinoco_pci.c: At top level:
/usr/src/orinoco-0.13-dragorn-2.6.17/orinoco_pci.c:381: warning: initialization from incompatible pointer type
CC [M] /usr/src/orinoco-0.13-dragorn-2.6.17/orinoco_plx.o
/usr/src/orinoco-0.13-dragorn-2.6.17/orinoco_plx.c: In function `orinoco_plx_init_one':
/usr/src/orinoco-0.13-dragorn-2.6.17/orinoco_plx.c:251: warning: passing arg 2 of `hermes_struct_init' makes pointer from integer without a cast
CC [M] /usr/src/orinoco-0.13-dragorn-2.6.17/orinoco_tmd.o
/usr/src/orinoco-0.13-dragorn-2.6.17/orinoco_tmd.c: In function `orinoco_tmd_init_one':
/usr/src/orinoco-0.13-dragorn-2.6.17/orinoco_tmd.c:134: warning: passing arg 2 of `hermes_struct_init' makes pointer from integer without a cast
CC [M] /usr/src/orinoco-0.13-dragorn-2.6.17/orinoco_cs.o
In file included from /usr/src/orinoco-0.13-dragorn-2.6.17/orinoco.h:18,
from /usr/src/orinoco-0.13-dragorn-2.6.17/orinoco_cs.c:27:
/usr/src/orinoco-0.13-dragorn-2.6.17/hermes.h: In function `hermes_present':
/usr/src/orinoco-0.13-dragorn-2.6.17/hermes.h:461: warning: implicit declaration of function `ioread16'
/usr/src/orinoco-0.13-dragorn-2.6.17/hermes.h: In function `hermes_set_irqmask':
/usr/src/orinoco-0.13-dragorn-2.6.17/hermes.h:467: warning: implicit declaration of function `iowrite16'
/usr/src/orinoco-0.13-dragorn-2.6.17/hermes.h: In function `hermes_read_words':
/usr/src/orinoco-0.13-dragorn-2.6.17/hermes.h:556: warning: implicit declaration of function `ioread16_rep'
/usr/src/orinoco-0.13-dragorn-2.6.17/hermes.h: In function `hermes_write_words':
/usr/src/orinoco-0.13-dragorn-2.6.17/hermes.h:562: warning: implicit declaration of function `iowrite16_rep'
/usr/src/orinoco-0.13-dragorn-2.6.17/orinoco_cs.c: In function `orinoco_cs_probe':
/usr/src/orinoco-0.13-dragorn-2.6.17/orinoco_cs.c:121: error: structure has no member named `priv'
/usr/src/orinoco-0.13-dragorn-2.6.17/orinoco_cs.c:124: error: structure has no member named `irq'
/usr/src/orinoco-0.13-dragorn-2.6.17/orinoco_cs.c:125: error: structure has no member named `irq'
/usr/src/orinoco-0.13-dragorn-2.6.17/orinoco_cs.c:126: error: structure has no member named `irq'
/usr/src/orinoco-0.13-dragorn-2.6.17/orinoco_cs.c:127: error: structure has no member named `irq'
/usr/src/orinoco-0.13-dragorn-2.6.17/orinoco_cs.c:134: error: structure has no member named `conf'
/usr/src/orinoco-0.13-dragorn-2.6.17/orinoco_cs.c:135: error: structure has no member named `conf'
/usr/src/orinoco-0.13-dragorn-2.6.17/orinoco_cs.c: In function `orinoco_cs_detach':
/usr/src/orinoco-0.13-dragorn-2.6.17/orinoco_cs.c:148: error: structure has no member named `priv'
/usr/src/orinoco-0.13-dragorn-2.6.17/orinoco_cs.c:153: error: structure has no member named `dev_node'
/usr/src/orinoco-0.13-dragorn-2.6.17/orinoco_cs.c:158: warning: implicit declaration of function `free_orinocodev'
/usr/src/orinoco-0.13-dragorn-2.6.17/orinoco_cs.c: In function `orinoco_cs_config':
/usr/src/orinoco-0.13-dragorn-2.6.17/orinoco_cs.c:174: error: structure has no member named `priv'
/usr/src/orinoco-0.13-dragorn-2.6.17/orinoco_cs.c:200: error: structure has no member named `conf'
/usr/src/orinoco-0.13-dragorn-2.6.17/orinoco_cs.c:201: error: structure has no member named `conf'
/usr/src/orinoco-0.13-dragorn-2.6.17/orinoco_cs.c:235: error: structure has no member named `conf'
/usr/src/orinoco-0.13-dragorn-2.6.17/orinoco_cs.c:239: error: structure has no member named `conf'
/usr/src/orinoco-0.13-dragorn-2.6.17/orinoco_cs.c:240: error: structure has no member named `conf'
/usr/src/orinoco-0.13-dragorn-2.6.17/orinoco_cs.c:260: error: structure has no member named `conf'
/usr/src/orinoco-0.13-dragorn-2.6.17/orinoco_cs.c:263: error: structure has no member named `conf'
/usr/src/orinoco-0.13-dragorn-2.6.17/orinoco_cs.c:267: error: structure has no member named `conf'
/usr/src/orinoco-0.13-dragorn-2.6.17/orinoco_cs.c:270: error: structure has no member named `io'
/usr/src/orinoco-0.13-dragorn-2.6.17/orinoco_cs.c:270: error: structure has no member named `io'
/usr/src/orinoco-0.13-dragorn-2.6.17/orinoco_cs.c:274: error: structure has no member named `io'
/usr/src/orinoco-0.13-dragorn-2.6.17/orinoco_cs.c:276: error: structure has no member named `io'
/usr/src/orinoco-0.13-dragorn-2.6.17/orinoco_cs.c:279: error: structure has no member named `io'
/usr/src/orinoco-0.13-dragorn-2.6.17/orinoco_cs.c:281: error: structure has no member named `io'
/usr/src/orinoco-0.13-dragorn-2.6.17/orinoco_cs.c:283: error: structure has no member named `io'
/usr/src/orinoco-0.13-dragorn-2.6.17/orinoco_cs.c:284: error: structure has no member named `io'
/usr/src/orinoco-0.13-dragorn-2.6.17/orinoco_cs.c:286: error: structure has no member named `io'
/usr/src/orinoco-0.13-dragorn-2.6.17/orinoco_cs.c:287: error: structure has no member named `io'
/usr/src/orinoco-0.13-dragorn-2.6.17/orinoco_cs.c:288: error: structure has no member named `io'
/usr/src/orinoco-0.13-dragorn-2.6.17/orinoco_cs.c:289: error: structure has no member named `io'
/usr/src/orinoco-0.13-dragorn-2.6.17/orinoco_cs.c:293: error: structure has no member named `io'
/usr/src/orinoco-0.13-dragorn-2.6.17/orinoco_cs.c:303: warning: implicit declaration of function `pcmcia_disable_device'
/usr/src/orinoco-0.13-dragorn-2.6.17/orinoco_cs.c:318: error: structure has no member named `irq'
/usr/src/orinoco-0.13-dragorn-2.6.17/orinoco_cs.c:323: warning: implicit declaration of function `ioport_map'
/usr/src/orinoco-0.13-dragorn-2.6.17/orinoco_cs.c:323: error: structure has no member named `io'
/usr/src/orinoco-0.13-dragorn-2.6.17/orinoco_cs.c:323: error: structure has no member named `io'
/usr/src/orinoco-0.13-dragorn-2.6.17/orinoco_cs.c:323: warning: assignment makes pointer from integer without a cast
/usr/src/orinoco-0.13-dragorn-2.6.17/orinoco_cs.c:334: error: structure has no member named `conf'
/usr/src/orinoco-0.13-dragorn-2.6.17/orinoco_cs.c:338: error: structure has no member named `io'
/usr/src/orinoco-0.13-dragorn-2.6.17/orinoco_cs.c:339: error: structure has no member named `irq'
/usr/src/orinoco-0.13-dragorn-2.6.17/orinoco_cs.c:353: error: structure has no member named `dev_node'
/usr/src/orinoco-0.13-dragorn-2.6.17/orinoco_cs.c:359: error: structure has no member named `conf'
/usr/src/orinoco-0.13-dragorn-2.6.17/orinoco_cs.c:360: error: structure has no member named `conf'
/usr/src/orinoco-0.13-dragorn-2.6.17/orinoco_cs.c:361: error: structure has no member named `conf'
/usr/src/orinoco-0.13-dragorn-2.6.17/orinoco_cs.c:362: error: structure has no member named `conf'
/usr/src/orinoco-0.13-dragorn-2.6.17/orinoco_cs.c:363: error: structure has no member named `irq'
/usr/src/orinoco-0.13-dragorn-2.6.17/orinoco_cs.c:364: error: structure has no member named `io'
/usr/src/orinoco-0.13-dragorn-2.6.17/orinoco_cs.c:365: error: structure has no member named `io'
/usr/src/orinoco-0.13-dragorn-2.6.17/orinoco_cs.c:366: error: structure has no member named `io'
/usr/src/orinoco-0.13-dragorn-2.6.17/orinoco_cs.c:366: error: structure has no member named `io'
/usr/src/orinoco-0.13-dragorn-2.6.17/orinoco_cs.c:367: error: structure has no member named `io'
/usr/src/orinoco-0.13-dragorn-2.6.17/orinoco_cs.c:368: error: structure has no member named `io'
/usr/src/orinoco-0.13-dragorn-2.6.17/orinoco_cs.c:369: error: structure has no member named `io'
/usr/src/orinoco-0.13-dragorn-2.6.17/orinoco_cs.c:369: error: structure has no member named `io'
/usr/src/orinoco-0.13-dragorn-2.6.17/orinoco_cs.c: In function `orinoco_cs_release':
/usr/src/orinoco-0.13-dragorn-2.6.17/orinoco_cs.c:390: error: structure has no member named `priv'
/usr/src/orinoco-0.13-dragorn-2.6.17/orinoco_cs.c:402: warning: implicit declaration of function `ioport_unmap'
/usr/src/orinoco-0.13-dragorn-2.6.17/orinoco_cs.c: In function `orinoco_cs_suspend':
/usr/src/orinoco-0.13-dragorn-2.6.17/orinoco_cs.c:407: error: structure has no member named `priv'
/usr/src/orinoco-0.13-dragorn-2.6.17/orinoco_cs.c: In function `orinoco_cs_resume':
/usr/src/orinoco-0.13-dragorn-2.6.17/orinoco_cs.c:435: error: structure has no member named `priv'
/usr/src/orinoco-0.13-dragorn-2.6.17/orinoco_cs.c: At top level:
/usr/src/orinoco-0.13-dragorn-2.6.17/orinoco_cs.c:568: error: unknown field `probe' specified in initializer
/usr/src/orinoco-0.13-dragorn-2.6.17/orinoco_cs.c:568: warning: excess elements in struct initializer
/usr/src/orinoco-0.13-dragorn-2.6.17/orinoco_cs.c:568: warning: (near initialization for `orinoco_driver')
/usr/src/orinoco-0.13-dragorn-2.6.17/orinoco_cs.c:569: error: unknown field `remove' specified in initializer
/usr/src/orinoco-0.13-dragorn-2.6.17/orinoco_cs.c:569: warning: excess elements in struct initializer
/usr/src/orinoco-0.13-dragorn-2.6.17/orinoco_cs.c:569: warning: (near initialization for `orinoco_driver')
/usr/src/orinoco-0.13-dragorn-2.6.17/orinoco_cs.c:571: error: unknown field `suspend' specified in initializer
/usr/src/orinoco-0.13-dragorn-2.6.17/orinoco_cs.c:571: warning: missing braces around initializer
/usr/src/orinoco-0.13-dragorn-2.6.17/orinoco_cs.c:571: warning: (near initialization for `orinoco_driver.drv')
/usr/src/orinoco-0.13-dragorn-2.6.17/orinoco_cs.c:571: warning: initialization from incompatible pointer type
/usr/src/orinoco-0.13-dragorn-2.6.17/orinoco_cs.c:572: error: unknown field `resume' specified in initializer
/usr/src/orinoco-0.13-dragorn-2.6.17/orinoco_cs.c:572: warning: excess elements in struct initializer
/usr/src/orinoco-0.13-dragorn-2.6.17/orinoco_cs.c:572: warning: (near initialization for `orinoco_driver')
make[2]: *** [/usr/src/orinoco-0.13-dragorn-2.6.17/orinoco_cs.o] Error 1
make[1]: *** [_module_/usr/src/orinoco-0.13-dragorn-2.6.17] Error 2
make[1]: Leaving directory `/usr/src/linux-2.6.15.6'
make: *** [modules] Error 2
slax orinoco-0.13-dragorn-2.6.17 #