All pastes #173874 Raw Edit

Stuff

public text v1 · immutable
·published 2006-09-17 09:53 UTC
rendered paste body
make[1]: Entering directory `/home/nyty/install_ispconfig/compile_aps/cronolog-1.6.2/src'
gcc -DPACKAGE=\"cronolog\" -DVERSION=\"1.6.2\" -DSTDC_HEADERS=1 -DTIME_WITH_SYS_TIME=1 -DHAVE_TM_ZONE=1 -DHAVE_FCNTL_H=1 -DHAVE_LIMITS_H=1 -DHAVE_UNISTD_H=1 -DHAVE_STRFTIME=1 -DHAVE_VPRINTF=1 -DHAVE_MKDIR=1 -DHAVE_MKTIME=1 -DHAVE_PUTENV=1 -DHAVE_STRPTIME=1 -DHAVE_LOCALTIME_R=1  -I. -I.  -I../lib    -g -O2 -c cronotest.c
gcc -DPACKAGE=\"cronolog\" -DVERSION=\"1.6.2\" -DSTDC_HEADERS=1 -DTIME_WITH_SYS_TIME=1 -DHAVE_TM_ZONE=1 -DHAVE_FCNTL_H=1 -DHAVE_LIMITS_H=1 -DHAVE_UNISTD_H=1 -DHAVE_STRFTIME=1 -DHAVE_VPRINTF=1 -DHAVE_MKDIR=1 -DHAVE_MKTIME=1 -DHAVE_PUTENV=1 -DHAVE_STRPTIME=1 -DHAVE_LOCALTIME_R=1  -I. -I.  -I../lib    -g -O2 -c cronoutils.c
gcc  -g -O2  -o cronotest  cronotest.o cronoutils.o ../lib/libutil.a
gcc -DPACKAGE=\"cronolog\" -DVERSION=\"1.6.2\" -DSTDC_HEADERS=1 -DTIME_WITH_SYS_TIME=1 -DHAVE_TM_ZONE=1 -DHAVE_FCNTL_H=1 -DHAVE_LIMITS_H=1 -DHAVE_UNISTD_H=1 -DHAVE_STRFTIME=1 -DHAVE_VPRINTF=1 -DHAVE_MKDIR=1 -DHAVE_MKTIME=1 -DHAVE_PUTENV=1 -DHAVE_STRPTIME=1 -DHAVE_LOCALTIME_R=1  -I. -I.  -I../lib    -g -O2 -c cronolog.c
gcc  -g -O2  -o cronolog  cronolog.o cronoutils.o ../lib/libutil.a
make[1]: Leaving directory `/home/nyty/install_ispconfig/compile_aps/cronolog-1.6.2/src'
Making all in doc
make[1]: Entering directory `/home/nyty/install_ispconfig/compile_aps/cronolog-1.6.2/doc'
make[1]: Nothing to be done for `all'.
make[1]: Leaving directory `/home/nyty/install_ispconfig/compile_aps/cronolog-1.6.2/doc'
Making all in testsuite
make[1]: Entering directory `/home/nyty/install_ispconfig/compile_aps/cronolog-1.6.2/testsuite'
make[1]: Nothing to be done for `all'.
make[1]: Leaving directory `/home/nyty/install_ispconfig/compile_aps/cronolog-1.6.2/testsuite'
make[1]: Entering directory `/home/nyty/install_ispconfig/compile_aps/cronolog-1.6.2'
make[1]: Nothing to be done for `all-am'.
make[1]: Leaving directory `/home/nyty/install_ispconfig/compile_aps/cronolog-1.6.2'
sh unix/configure "cc" "-O2 -I. -DUNIX "
Check for the C preprocessor
Check if we can use asm code
Check if compiler generates underlines
Check for ANSI options
Check for prototypes
Check the handling of const
Check for time_t
Check for size_t
Check for rmdir
Check for strchr
Check for strrchr
Check for rename
Check for mktemp
Check for mktime
Check for memset
Check for errno declaration
Check for directory libraries
Check for readlink
Check for directory include file
Check for non existent include files
Check for term I/O include file
Check for valloc
Check for /usr/local/bin and /usr/local/man
Checking for OS specialties
Check for symbolic links
eval make -f unix/Makefile zips `cat flags`
make[1]: Entering directory `/home/nyty/install_ispconfig/compile_aps/zip-2.3'
cc -c -O2 -I. -DUNIX -DASMV -DASM_CRC -DNO_STRCHR -DNO_STRRCHR -DNO_STDLIB_H -DNO_STDDEF_H -DNO_UNISTD_H -DNO_FCNTL_H -DNO_STRING_H -DHAVE_TERMIOS_H zip.c
zip.c: In function `version_info':
zip.c:613: warning: assignment makes pointer from integer without a cast
zip.c: In function `zipstdout':
zip.c:634: warning: assignment makes pointer from integer without a cast
zip.c: In function `main':
zip.c:1436: warning: assignment makes pointer from integer without a cast
zip.c:1472: warning: assignment makes pointer from integer without a cast
zip.c:1627: warning: assignment makes pointer from integer without a cast
zip.c:1807: warning: assignment makes pointer from integer without a cast
zip.c:2062: warning: assignment makes pointer from integer without a cast
zip.c:2095: warning: assignment makes pointer from integer without a cast
zip.c:2130: warning: assignment makes pointer from integer without a cast
zip.c:2141: warning: assignment makes pointer from integer without a cast
zip.c:2168: warning: assignment makes pointer from integer without a cast
cc -c -O2 -I. -DUNIX -DASMV -DASM_CRC -DNO_STRCHR -DNO_STRRCHR -DNO_STDLIB_H -DNO_STDDEF_H -DNO_UNISTD_H -DNO_FCNTL_H -DNO_STRING_H -DHAVE_TERMIOS_H zipfile.c
zipfile.c: In function `ziptyp':
zipfile.c:190: warning: assignment makes pointer from integer without a cast
zipfile.c: In function `scanzipf_fix':
zipfile.c:518: warning: assignment makes pointer from integer without a cast
zipfile.c:519: warning: assignment makes pointer from integer without a cast
zipfile.c: In function `scanzipf_reg':
zipfile.c:657: warning: assignment makes pointer from integer without a cast
zipfile.c:749: warning: assignment makes pointer from integer without a cast
zipfile.c:816: warning: assignment makes pointer from integer without a cast
zipfile.c:817: warning: assignment makes pointer from integer without a cast
zipfile.c:818: warning: assignment makes pointer from integer without a cast
zipfile.c:860: warning: assignment makes pointer from integer without a cast
zipfile.c:879: warning: assignment makes pointer from integer without a cast
cc -c -O2 -I. -DUNIX -DASMV -DASM_CRC -DNO_STRCHR -DNO_STRRCHR -DNO_STDLIB_H -DNO_STDDEF_H -DNO_UNISTD_H -DNO_FCNTL_H -DNO_STRING_H -DHAVE_TERMIOS_H zipup.c
zipup.c: In function `zipup':
zipup.c:558: warning: assignment makes pointer from integer without a cast
cc -c -O2 -I. -DUNIX -DASMV -DASM_CRC -DNO_STRCHR -DNO_STRRCHR -DNO_STDLIB_H -DNO_STDDEF_H -DNO_UNISTD_H -DNO_FCNTL_H -DNO_STRING_H -DHAVE_TERMIOS_H fileio.c
fileio.c: In function `newname':
fileio.c:383: warning: assignment makes pointer from integer without a cast
fileio.c:452: warning: assignment makes pointer from integer without a cast
fileio.c: In function `tempname':
fileio.c:814: warning: assignment makes pointer from integer without a cast
fileio.c:850: warning: assignment makes pointer from integer without a cast
fileio.c: In function `fcopy':
fileio.c:879: warning: assignment makes pointer from integer without a cast
cc -c -O2 -I. -DUNIX -DASMV -DASM_CRC -DNO_STRCHR -DNO_STRRCHR -DNO_STDLIB_H -DNO_STDDEF_H -DNO_UNISTD_H -DNO_FCNTL_H -DNO_STRING_H -DHAVE_TERMIOS_H util.c
util.c: In function `envargs':
util.c:492: warning: assignment makes pointer from integer without a cast
cc -c -O2 -I. -DUNIX -DASMV -DASM_CRC -DNO_STRCHR -DNO_STRRCHR -DNO_STDLIB_H -DNO_STDDEF_H -DNO_UNISTD_H -DNO_FCNTL_H -DNO_STRING_H -DHAVE_TERMIOS_H globals.c
cc -c -O2 -I. -DUNIX -DASMV -DASM_CRC -DNO_STRCHR -DNO_STRRCHR -DNO_STDLIB_H -DNO_STDDEF_H -DNO_UNISTD_H -DNO_FCNTL_H -DNO_STRING_H -DHAVE_TERMIOS_H crypt.c
cc -c -O2 -I. -DUNIX -DASMV -DASM_CRC -DNO_STRCHR -DNO_STRRCHR -DNO_STDLIB_H -DNO_STDDEF_H -DNO_UNISTD_H -DNO_FCNTL_H -DNO_STRING_H -DHAVE_TERMIOS_H ttyio.c
cc -c -O2 -I. -DUNIX -DASMV -DASM_CRC -DNO_STRCHR -DNO_STRRCHR -DNO_STDLIB_H -DNO_STDDEF_H -DNO_UNISTD_H -DNO_FCNTL_H -DNO_STRING_H -DHAVE_TERMIOS_H unix/unix.c
unix/unix.c:60: error: syntax error before '*' token
unix/unix.c:95: error: syntax error before "DIR"
unix/unix.c:95: warning: data definition has no type or storage class
unix/unix.c:98: error: syntax error before '{' token
unix/unix.c:101: error: initializer element is not constant
unix/unix.c:101: warning: data definition has no type or storage class
unix/unix.c:102: error: syntax error before "return"
unix/unix.c: In function `procname':
unix/unix.c:112: error: `DIR' undeclared (first use in this function)
unix/unix.c:112: error: (Each undeclared identifier is reported only once
unix/unix.c:112: error: for each function it appears in.)
unix/unix.c:159: warning: assignment makes pointer from integer without a cast
unix/unix.c:174: warning: assignment makes pointer from integer without a cast
unix/unix.c:179: warning: assignment makes pointer from integer without a cast
unix/unix.c: In function `ex2in':
unix/unix.c:243: warning: assignment makes pointer from integer without a cast
unix/unix.c: In function `in2ex':
unix/unix.c:269: warning: assignment makes pointer from integer without a cast
make[1]: *** [unix.o] Error 1
make[1]: Leaving directory `/home/nyty/install_ispconfig/compile_aps/zip-2.3'
make: *** [generic] Error 2
ERROR: Could not make zip
cd: could not get current directory: getcwd: cannot access parent directories: No such file or directory
cd: could not get current directory: getcwd: cannot access parent directories: No such file or directory
job-working-directory: could not get current directory: getcwd: cannot access parent directories: No such file or directory
mv: cannot stat `binaries/aps.tar.gz': No such file or directory
mv: cannot stat `binaries/spamassassin.tar.gz': No such file or directory
job-working-directory: could not get current directory: getcwd: cannot access parent directories: No such file or directory
mv: cannot stat `binaries/uudeview.tar.gz': No such file or directory
job-working-directory: could not get current directory: getcwd: cannot access parent directories: No such file or directory
mv: cannot stat `binaries/clamav.tar.gz': No such file or directory
job-working-directory: could not get current directory: getcwd: cannot access parent directories: No such file or directory
mv: cannot stat `binaries/cronolog': No such file or directory
job-working-directory: could not get current directory: getcwd: cannot access parent directories: No such file or directory
mv: cannot stat `binaries/cronosplit': No such file or directory
job-working-directory: could not get current directory: getcwd: cannot access parent directories: No such file or directory
mv: cannot stat `binaries/ispconfig_tcpserver': No such file or directory
job-working-directory: could not get current directory: getcwd: cannot access parent directories: No such file or directory
mv: cannot stat `binaries/zip': No such file or directory
job-working-directory: could not get current directory: getcwd: cannot access parent directories: No such file or directory
mv: cannot stat `binaries/unzip': No such file or directory
job-working-directory: could not get current directory: getcwd: cannot access parent directories: No such file or directory
tar: spamassassin.tar.gz: Cannot open: No such file or directory
tar: Error is not recoverable: exiting now
tar: Child returned status 2
tar: Error exit delayed from previous errors
job-working-directory: could not get current directory: getcwd: cannot access parent directories: No such file or directory
mv: cannot stat `spamassassin': No such file or directory
job-working-directory: could not get current directory: getcwd: cannot access parent directories: No such file or directory
tar: uudeview.tar.gz: Cannot open: No such file or directory
tar: Error is not recoverable: exiting now
tar: Child returned status 2
tar: Error exit delayed from previous errors
job-working-directory: could not get current directory: getcwd: cannot access parent directories: No such file or directory
mv: cannot stat `uudeview': No such file or directory
job-working-directory: could not get current directory: getcwd: cannot access parent directories: No such file or directory
tar: clamav.tar.gz: Cannot open: No such file or directory
tar: Error is not recoverable: exiting now
tar: Child returned status 2
tar: Error exit delayed from previous errors
job-working-directory: could not get current directory: getcwd: cannot access parent directories: No such file or directory
mv: cannot stat `clamav': No such file or directory
PHP binary .. with ISPConfig does not work properly on your system! The installation routine stops here!