All pastes #17375 Raw Edit

RT2500-Error

public text v1 · immutable
#17375 ·published 2005-07-10 15:06 UTC
rendered paste body
cc -D__KERNEL__ -I/usr/src/linux-2.6.11/include -O2 -fomit-frame-pointer -fno-strict-aliasing -fno-common -pipe -mpreferred-stack-boundary=2 -march=i686 -DMODULE -DMODVERSIONS -include /usr/src/linux-2.6.11/include/linux/modversions.h -Wall -Wstrict-prototypes -Wno-trigraphs   -c -o rtmp_main.o rtmp_main.c
<command line>:138471657:59696: /usr/src/linux-2.6.11/include/linux/modversions.h: No such file or directory
In file included from /usr/include/asm/system.h:5,
                 from /usr/include/asm/processor.h:18,
                 from /usr/include/asm/thread_info.h:17,
                 from /usr/src/linux-2.6.11/include/linux/thread_info.h:21,
                 from /usr/src/linux-2.6.11/include/linux/spinlock.h:12,
                 from /usr/src/linux-2.6.11/include/linux/capability.h:45,
                 from /usr/src/linux-2.6.11/include/linux/sched.h:7,
                 from /usr/src/linux-2.6.11/include/linux/module.h:10,
                 from rt_config.h:54,
                 from rtmp_main.c:38:
/usr/src/linux-2.6.11/include/linux/kernel.h:85: error: parse error before "size_t"
/usr/src/linux-2.6.11/include/linux/kernel.h:87: error: parse error before "size_t"
/usr/src/linux-2.6.11/include/linux/kernel.h:88: error: parse error before "size_t"
/usr/src/linux-2.6.11/include/linux/kernel.h:90: error: parse error before "size_t"
In file included from /usr/src/linux-2.6.11/include/linux/timex.h:58,
                 from /usr/src/linux-2.6.11/include/linux/sched.h:11,
                 from /usr/src/linux-2.6.11/include/linux/module.h:10,
                 from rt_config.h:54,
                 from rtmp_main.c:38:
/usr/src/linux-2.6.11/include/linux/time.h:13: error: parse error before "time_t"
/usr/src/linux-2.6.11/include/linux/time.h:13: warning: no semicolon at end of struct or union
/usr/src/linux-2.6.11/include/linux/time.h:15: error: parse error before '}' token
/usr/src/linux-2.6.11/include/linux/time.h:19: error: parse error before "time_t"
/usr/src/linux-2.6.11/include/linux/time.h:19: warning: no semicolon at end of struct or union
/usr/src/linux-2.6.11/include/linux/time.h:20: warning: type defaults to `int' in declaration of `tv_usec'
/usr/src/linux-2.6.11/include/linux/time.h:20: warning: data definition has no type or storage class
/usr/src/linux-2.6.11/include/linux/time.h: In function `timespec_equal':
/usr/src/linux-2.6.11/include/linux/time.h:45: error: dereferencing pointer to incomplete type
/usr/src/linux-2.6.11/include/linux/time.h:45: error: dereferencing pointer to incomplete type
/usr/src/linux-2.6.11/include/linux/time.h:45: error: dereferencing pointer to incomplete type
/usr/src/linux-2.6.11/include/linux/time.h:45: error: dereferencing pointer to incomplete type
/usr/src/linux-2.6.11/include/linux/time.h: In function `get_seconds':
/usr/src/linux-2.6.11/include/linux/time.h:87: error: invalid use of undefined type `struct timespec'
/usr/src/linux-2.6.11/include/linux/time.h: At top level:
/usr/src/linux-2.6.11/include/linux/time.h:107: warning: parameter has incomplete type
/usr/src/linux-2.6.11/include/linux/time.h:110: error: parse error before "time_t"
/usr/src/linux-2.6.11/include/linux/time.h:111: warning: function declaration isn't a prototype
/usr/src/linux-2.6.11/include/linux/time.h: In function `set_normalized_timespec':
/usr/src/linux-2.6.11/include/linux/time.h:112: error: `nsec' undeclared (first use in this function)
/usr/src/linux-2.6.11/include/linux/time.h:112: error: (Each undeclared identifier is reported only once
/usr/src/linux-2.6.11/include/linux/time.h:112: error: for each function it appears in.)
/usr/src/linux-2.6.11/include/linux/time.h:114: error: `sec' undeclared (first use in this function)
/usr/src/linux-2.6.11/include/linux/time.h:120: error: `ts' undeclared (first use in this function)
/usr/src/linux-2.6.11/include/linux/time.h: At top level:
/usr/src/linux-2.6.11/include/linux/time.h:143: error: field `it_interval' has incomplete type
/usr/src/linux-2.6.11/include/linux/time.h:144: error: field `it_value' has incomplete type
/usr/src/linux-2.6.11/include/linux/time.h:148: error: field `it_interval' has incomplete type
/usr/src/linux-2.6.11/include/linux/time.h:149: error: field `it_value' has incomplete type
In file included from /usr/src/linux-2.6.11/include/linux/sched.h:11,
                 from /usr/src/linux-2.6.11/include/linux/module.h:10,
                 from rt_config.h:54,
                 from rtmp_main.c:38:
/usr/src/linux-2.6.11/include/linux/timex.h:147: error: field `time' has incomplete type
In file included from /usr/src/linux-2.6.11/include/linux/sched.h:12,
                 from /usr/src/linux-2.6.11/include/linux/module.h:10,
                 from rt_config.h:54,
                 from rtmp_main.c:38:
/usr/src/linux-2.6.11/include/linux/jiffies.h: In function `timespec_to_jiffies':
/usr/src/linux-2.6.11/include/linux/jiffies.h:317: error: dereferencing pointer to incomplete type
/usr/src/linux-2.6.11/include/linux/jiffies.h:318: error: dereferencing pointer to incomplete type
/usr/src/linux-2.6.11/include/linux/jiffies.h: In function `jiffies_to_timespec':
/usr/src/linux-2.6.11/include/linux/jiffies.h:338: error: dereferencing pointer to incomplete type
/usr/src/linux-2.6.11/include/linux/jiffies.h:338: error: dereferencing pointer to incomplete type
/usr/src/linux-2.6.11/include/linux/jiffies.h: In function `timeval_to_jiffies':
/usr/src/linux-2.6.11/include/linux/jiffies.h:356: error: dereferencing pointer to incomplete type
/usr/src/linux-2.6.11/include/linux/jiffies.h:357: error: dereferencing pointer to incomplete type
/usr/src/linux-2.6.11/include/linux/jiffies.h: In function `jiffies_to_timeval':
/usr/src/linux-2.6.11/include/linux/jiffies.h:376: error: dereferencing pointer to incomplete type
/usr/src/linux-2.6.11/include/linux/jiffies.h:376: error: dereferencing pointer to incomplete type
/usr/src/linux-2.6.11/include/linux/jiffies.h:377: error: dereferencing pointer to incomplete type
/usr/src/linux-2.6.11/include/linux/jiffies.h: At top level:
/usr/src/linux-2.6.11/include/linux/jiffies.h:383: error: parse error before "jiffies_to_clock_t"
/usr/src/linux-2.6.11/include/linux/jiffies.h:384: warning: return type defaults to `int'
In file included from /usr/src/linux-2.6.11/include/linux/string.h:24,
                 from /usr/src/linux-2.6.11/include/linux/bitmap.h:8,
                 from /usr/src/linux-2.6.11/include/linux/cpumask.h:78,
                 from /usr/src/linux-2.6.11/include/linux/sched.h:15,
                 from /usr/src/linux-2.6.11/include/linux/module.h:10,
                 from rt_config.h:54,
                 from rtmp_main.c:38:
/usr/include/asm/string.h:44: error: parse error before "size_t"
/usr/include/asm/string.h: In function `strncpy':
/usr/include/asm/string.h:58: error: `src' undeclared (first use in this function)
/usr/include/asm/string.h:58: error: `dest' undeclared (first use in this function)
/usr/include/asm/string.h:58: error: `count' undeclared (first use in this function)
/usr/include/asm/string.h: At top level:
/usr/include/asm/string.h:80: error: parse error before "size_t"
/usr/include/asm/string.h: In function `strncat':
/usr/include/asm/string.h:97: error: `src' undeclared (first use in this function)
/usr/include/asm/string.h:97: error: `dest' undeclared (first use in this function)
/usr/include/asm/string.h:97: error: `count' undeclared (first use in this function)
/usr/include/asm/string.h: At top level:
/usr/include/asm/string.h:124: error: parse error before "size_t"
/usr/include/asm/string.h: In function `strncmp':
/usr/include/asm/string.h:142: error: `cs' undeclared (first use in this function)
/usr/include/asm/string.h:142: error: `ct' undeclared (first use in this function)
/usr/include/asm/string.h:142: error: `count' undeclared (first use in this function)
/usr/include/asm/string.h: At top level:
/usr/include/asm/string.h:183: error: parse error before "strlen"
/usr/include/asm/string.h:196: error: parse error before "size_t"
/usr/include/asm/string.h: In function `__memcpy':
/usr/include/asm/string.h:209: error: `n' undeclared (first use in this function)
/usr/include/asm/string.h:209: error: `to' undeclared (first use in this function)
/usr/include/asm/string.h:209: error: `from' undeclared (first use in this function)
/usr/include/asm/string.h: At top level:
/usr/include/asm/string.h:218: error: parse error before "size_t"
/usr/include/asm/string.h: In function `__constant_memcpy':
/usr/include/asm/string.h:220: error: `n' undeclared (first use in this function)
/usr/include/asm/string.h:221: error: `to' undeclared (first use in this function)
/usr/include/asm/string.h:221: error: `from' undeclared (first use in this function)
/usr/include/asm/string.h: At top level:
/usr/include/asm/string.h:286: error: parse error before "size_t"
/usr/include/asm/string.h:291: error: parse error before "size_t"
/usr/include/asm/string.h: In function `memchr':
/usr/include/asm/string.h:295: error: `count' undeclared (first use in this function)
/usr/include/asm/string.h:303: error: `c' undeclared (first use in this function)
/usr/include/asm/string.h:303: error: `cs' undeclared (first use in this function)
/usr/include/asm/string.h: At top level:
/usr/include/asm/string.h:307: error: parse error before "size_t"
/usr/include/asm/string.h: In function `__memset_generic':
/usr/include/asm/string.h:314: error: `c' undeclared (first use in this function)
/usr/include/asm/string.h:314: error: `s' undeclared (first use in this function)
/usr/include/asm/string.h:314: error: `count' undeclared (first use in this function)
/usr/include/asm/string.h: At top level:
/usr/include/asm/string.h:327: error: parse error before "size_t"
/usr/include/asm/string.h: In function `__constant_c_memset':
/usr/include/asm/string.h:340: error: `c' undeclared (first use in this function)
/usr/include/asm/string.h:340: error: `count' undeclared (first use in this function)
/usr/include/asm/string.h:340: error: `s' undeclared (first use in this function)
/usr/include/asm/string.h: At top level:
/usr/include/asm/string.h:347: error: parse error before "strnlen"
/usr/include/asm/string.h:347: error: parse error before "size_t"
/usr/include/asm/string.h: In function `strnlen':
/usr/include/asm/string.h:362: error: `s' undeclared (first use in this function)
/usr/include/asm/string.h:362: error: `count' undeclared (first use in this function)
/usr/include/asm/string.h: At top level:
/usr/include/asm/string.h:375: error: parse error before "size_t"
/usr/include/asm/string.h: In function `__constant_c_and_count_memset':
/usr/include/asm/string.h:377: error: `count' undeclared (first use in this function)
/usr/include/asm/string.h:379: error: `s' undeclared (first use in this function)
/usr/include/asm/string.h:381: error: `pattern' undeclared (first use in this function)
/usr/include/asm/string.h: At top level:
/usr/include/asm/string.h:434: error: parse error before "size_t"
/usr/include/asm/string.h: In function `memscan':
/usr/include/asm/string.h:436: error: `size' undeclared (first use in this function)
/usr/include/asm/string.h:437: error: `addr' undeclared (first use in this function)
/usr/include/asm/string.h:443: error: `c' undeclared (first use in this function)
In file included from /usr/src/linux-2.6.11/include/linux/bitmap.h:8,
                 from /usr/src/linux-2.6.11/include/linux/cpumask.h:78,
                 from /usr/src/linux-2.6.11/include/linux/sched.h:15,
                 from /usr/src/linux-2.6.11/include/linux/module.h:10,
                 from rt_config.h:54,
                 from rtmp_main.c:38:
/usr/src/linux-2.6.11/include/linux/string.h: At top level:
/usr/src/linux-2.6.11/include/linux/string.h:33: error: parse error before "strlcpy"
/usr/src/linux-2.6.11/include/linux/string.h:33: error: parse error before "size_t"
/usr/src/linux-2.6.11/include/linux/string.h:33: warning: type defaults to `int' in declaration of `strlcpy'
/usr/src/linux-2.6.11/include/linux/string.h:33: warning: function declaration isn't a prototype
/usr/src/linux-2.6.11/include/linux/string.h:33: warning: data definition has no type or storage class
/usr/src/linux-2.6.11/include/linux/string.h:42: error: parse error before "strlcat"
/usr/src/linux-2.6.11/include/linux/string.h:42: warning: type defaults to `int' in declaration of `strlcat'
/usr/src/linux-2.6.11/include/linux/string.h:42: warning: data definition has no type or storage class
/usr/src/linux-2.6.11/include/linux/string.h:57: error: parse error before "size_t"
/usr/src/linux-2.6.11/include/linux/string.h:57: warning: function declaration isn't a prototype
In file included from /usr/src/linux-2.6.11/include/linux/cpumask.h:78,
                 from /usr/src/linux-2.6.11/include/linux/sched.h:15,
                 from /usr/src/linux-2.6.11/include/linux/module.h:10,
                 from rt_config.h:54,
                 from rtmp_main.c:38:
/usr/src/linux-2.6.11/include/linux/bitmap.h: In function `bitmap_fill':
/usr/src/linux-2.6.11/include/linux/bitmap.h:123: error: `size_t' undeclared (first use in this function)
/usr/src/linux-2.6.11/include/linux/bitmap.h:123: error: parse error before "nlongs"
/usr/src/linux-2.6.11/include/linux/bitmap.h:124: error: `nlongs' undeclared (first use in this function)
In file included from /usr/src/linux-2.6.11/include/linux/list.h:7,
                 from /usr/src/linux-2.6.11/include/linux/wait.h:23,
                 from /usr/include/asm/semaphore.h:41,
                 from /usr/src/linux-2.6.11/include/linux/sched.h:19,
                 from /usr/src/linux-2.6.11/include/linux/module.h:10,
                 from rt_config.h:54,
                 from rtmp_main.c:38:
/usr/src/linux-2.6.11/include/linux/prefetch.h: At top level:
/usr/src/linux-2.6.11/include/linux/prefetch.h:58: error: parse error before "size_t"
/usr/src/linux-2.6.11/include/linux/prefetch.h: In function `prefetch_range':
/usr/src/linux-2.6.11/include/linux/prefetch.h:62: error: `addr' undeclared (first use in this function)
/usr/src/linux-2.6.11/include/linux/prefetch.h:62: error: `len' undeclared (first use in this function)
In file included from /usr/src/linux-2.6.11/include/linux/sem.h:4,
                 from /usr/src/linux-2.6.11/include/linux/sched.h:26,
                 from /usr/src/linux-2.6.11/include/linux/module.h:10,
                 from rt_config.h:54,
                 from rtmp_main.c:38:
/usr/src/linux-2.6.11/include/linux/ipc.h: At top level:
/usr/src/linux-2.6.11/include/linux/ipc.h:61: error: parse error before "key_t"
/usr/src/linux-2.6.11/include/linux/ipc.h:61: warning: no semicolon at end of struct or union
/usr/src/linux-2.6.11/include/linux/ipc.h:62: warning: type defaults to `int' in declaration of `uid'
/usr/src/linux-2.6.11/include/linux/ipc.h:62: warning: data definition has no type or storage class
/usr/src/linux-2.6.11/include/linux/ipc.h:63: error: parse error before "gid"
/usr/src/linux-2.6.11/include/linux/ipc.h:63: warning: type defaults to `int' in declaration of `gid'
/usr/src/linux-2.6.11/include/linux/ipc.h:63: warning: data definition has no type or storage class
/usr/src/linux-2.6.11/include/linux/ipc.h:64: error: parse error before "cuid"
/usr/src/linux-2.6.11/include/linux/ipc.h:64: warning: type defaults to `int' in declaration of `cuid'
/usr/src/linux-2.6.11/include/linux/ipc.h:64: warning: data definition has no type or storage class
/usr/src/linux-2.6.11/include/linux/ipc.h:65: error: parse error before "cgid"
/usr/src/linux-2.6.11/include/linux/ipc.h:65: warning: type defaults to `int' in declaration of `cgid'
/usr/src/linux-2.6.11/include/linux/ipc.h:65: warning: data definition has no type or storage class
/usr/src/linux-2.6.11/include/linux/ipc.h:66: error: parse error before "mode"
/usr/src/linux-2.6.11/include/linux/ipc.h:66: warning: type defaults to `int' in declaration of `mode'
/usr/src/linux-2.6.11/include/linux/ipc.h:66: warning: data definition has no type or storage class
/usr/src/linux-2.6.11/include/linux/ipc.h:69: error: parse error before '}' token
In file included from /usr/src/linux-2.6.11/include/linux/sched.h:26,
                 from /usr/src/linux-2.6.11/include/linux/module.h:10,
                 from rt_config.h:54,
                 from rtmp_main.c:38:
/usr/src/linux-2.6.11/include/linux/sem.h:90: error: field `sem_perm' has incomplete type
/usr/src/linux-2.6.11/include/linux/sem.h:91: error: parse error before "time_t"
/usr/src/linux-2.6.11/include/linux/sem.h:91: warning: no semicolon at end of struct or union
/usr/src/linux-2.6.11/include/linux/sem.h:92: warning: type defaults to `int' in declaration of `sem_ctime'
/usr/src/linux-2.6.11/include/linux/sem.h:92: warning: data definition has no type or storage class
/usr/src/linux-2.6.11/include/linux/sem.h:98: error: parse error before '}' token
In file included from /usr/src/linux-2.6.11/include/linux/signal.h:6,
                 from /usr/src/linux-2.6.11/include/linux/sched.h:27,
                 from /usr/src/linux-2.6.11/include/linux/module.h:10,
                 from rt_config.h:54,
                 from rtmp_main.c:38:
/usr/include/asm/signal.h:181: error: parse error before "size_t"
In file included from /usr/src/linux-2.6.11/include/asm-generic/siginfo.h:6,
                 from /usr/include/asm/siginfo.h:4,
                 from /usr/src/linux-2.6.11/include/linux/signal.h:7,
                 from /usr/src/linux-2.6.11/include/linux/sched.h:27,
                 from /usr/src/linux-2.6.11/include/linux/module.h:10,
                 from rt_config.h:54,
                 from rtmp_main.c:38:
/usr/src/linux-2.6.11/include/linux/resource.h:22: error: field `ru_utime' has incomplete type
/usr/src/linux-2.6.11/include/linux/resource.h:23: error: field `ru_stime' has incomplete type
In file included from /usr/include/asm/siginfo.h:4,
                 from /usr/src/linux-2.6.11/include/linux/signal.h:7,
                 from /usr/src/linux-2.6.11/include/linux/sched.h:27,
                 from /usr/src/linux-2.6.11/include/linux/module.h:10,
                 from rt_config.h:54,
                 from rtmp_main.c:38:
/usr/src/linux-2.6.11/include/asm-generic/siginfo.h:51: error: parse error before "pid_t"
/usr/src/linux-2.6.11/include/asm-generic/siginfo.h:57: error: parse error before "timer_t"
/usr/src/linux-2.6.11/include/asm-generic/siginfo.h:59: error: `uid_t' undeclared here (not in a function)
/usr/src/linux-2.6.11/include/asm-generic/siginfo.h:59: error: size of array `_pad' is too large
/usr/src/linux-2.6.11/include/asm-generic/siginfo.h:62: error: parse error before '}' token
/usr/src/linux-2.6.11/include/asm-generic/siginfo.h:66: error: parse error before "pid_t"
/usr/src/linux-2.6.11/include/asm-generic/siginfo.h:69: error: parse error before '}' token
/usr/src/linux-2.6.11/include/asm-generic/siginfo.h:73: error: parse error before "pid_t"
/usr/src/linux-2.6.11/include/asm-generic/siginfo.h:76: error: parse error before "_utime"
/usr/src/linux-2.6.11/include/asm-generic/siginfo.h:77: error: parse error before "_stime"
/usr/src/linux-2.6.11/include/asm-generic/siginfo.h:93: error: parse error before '}' token
/usr/src/linux-2.6.11/include/asm-generic/siginfo.h:94: error: parse error before '}' token
/usr/src/linux-2.6.11/include/asm-generic/siginfo.h: In function `copy_siginfo':
/usr/src/linux-2.6.11/include/asm-generic/siginfo.h:275: error: dereferencing pointer to incomplete type
/usr/src/linux-2.6.11/include/asm-generic/siginfo.h:276: error: dereferencing pointer to incomplete type
/usr/src/linux-2.6.11/include/asm-generic/siginfo.h:276: error: dereferencing pointer to incomplete type
/usr/src/linux-2.6.11/include/asm-generic/siginfo.h:276: error: dereferencing pointer to incomplete type
/usr/src/linux-2.6.11/include/asm-generic/siginfo.h:279: error: dereferencing pointer to incomplete type
/usr/src/linux-2.6.11/include/asm-generic/siginfo.h:279: error: dereferencing pointer to incomplete type
/usr/src/linux-2.6.11/include/asm-generic/siginfo.h:279: error: dereferencing pointer to incomplete type
In file included from /usr/src/linux-2.6.11/include/linux/sched.h:27,
                 from /usr/src/linux-2.6.11/include/linux/module.h:10,
                 from rt_config.h:54,
                 from rtmp_main.c:38:
/usr/src/linux-2.6.11/include/linux/signal.h: At top level:
/usr/src/linux-2.6.11/include/linux/signal.h:21: error: parse error before "siginfo_t"
/usr/src/linux-2.6.11/include/linux/signal.h:21: warning: no semicolon at end of struct or union
/usr/src/linux-2.6.11/include/linux/signal.h:23: error: parse error before '}' token
/usr/src/linux-2.6.11/include/linux/signal.h:220: error: parse error before '*' token
/usr/src/linux-2.6.11/include/linux/signal.h:220: warning: function declaration isn't a prototype
In file included from /usr/src/linux-2.6.11/include/linux/gfp.h:4,
                 from /usr/src/linux-2.6.11/include/linux/slab.h:15,
                 from /usr/src/linux-2.6.11/include/linux/percpu.h:4,
                 from /usr/src/linux-2.6.11/include/linux/sched.h:33,
                 from /usr/src/linux-2.6.11/include/linux/module.h:10,
                 from rt_config.h:54,
                 from rtmp_main.c:38:
/usr/src/linux-2.6.11/include/linux/mmzone.h:366: error: parse error before "size_t"
/usr/src/linux-2.6.11/include/linux/mmzone.h:366: warning: function declaration isn't a prototype
/usr/src/linux-2.6.11/include/linux/mmzone.h:369: error: parse error before "size_t"
/usr/src/linux-2.6.11/include/linux/mmzone.h:369: warning: function declaration isn't a prototype
In file included from /usr/src/linux-2.6.11/include/linux/percpu.h:4,
                 from /usr/src/linux-2.6.11/include/linux/sched.h:33,
                 from /usr/src/linux-2.6.11/include/linux/module.h:10,
                 from rt_config.h:54,
                 from rtmp_main.c:38:
/usr/src/linux-2.6.11/include/linux/slab.h:59: error: parse error before "size_t"
/usr/src/linux-2.6.11/include/linux/slab.h:60: error: `kmem_cache_create' declared as function returning a function
/usr/src/linux-2.6.11/include/linux/slab.h:60: warning: function declaration isn't a prototype
/usr/src/linux-2.6.11/include/linux/slab.h:61: error: parse error before "void"
/usr/src/linux-2.6.11/include/linux/slab.h:78: error: parse error before "size_t"
/usr/src/linux-2.6.11/include/linux/slab.h:78: warning: no semicolon at end of struct or union
/usr/src/linux-2.6.11/include/linux/slab.h:81: error: parse error before '}' token
/usr/src/linux-2.6.11/include/linux/slab.h:83: error: parse error before "int"
/usr/src/linux-2.6.11/include/linux/slab.h:83: warning: function declaration isn't a prototype
/usr/src/linux-2.6.11/include/linux/slab.h:85: error: parse error before "size"
/usr/src/linux-2.6.11/include/linux/slab.h:86: warning: function declaration isn't a prototype
/usr/src/linux-2.6.11/include/linux/slab.h: In function `kmalloc':
/usr/src/linux-2.6.11/include/linux/slab.h:87: error: `size' undeclared (first use in this function)
In file included from /usr/src/linux-2.6.11/include/linux/percpu.h:4,
                 from /usr/src/linux-2.6.11/include/linux/sched.h:33,
                 from /usr/src/linux-2.6.11/include/linux/module.h:10,
                 from rt_config.h:54,
                 from rtmp_main.c:38:
/usr/src/linux-2.6.11/include/linux/slab.h:101: error: `flags' undeclared (first use in this function)
/usr/src/linux-2.6.11/include/linux/slab.h:102: error: invalid use of undefined type `struct cache_sizes'
/usr/src/linux-2.6.11/include/linux/slab.h:103: error: invalid use of undefined type `struct cache_sizes'
/usr/src/linux-2.6.11/include/linux/slab.h: At top level:
/usr/src/linux-2.6.11/include/linux/slab.h:108: error: parse error before "int"
/usr/src/linux-2.6.11/include/linux/slab.h:108: warning: function declaration isn't a prototype
In file included from /usr/src/linux-2.6.11/include/linux/sched.h:33,
                 from /usr/src/linux-2.6.11/include/linux/module.h:10,
                 from rt_config.h:54,
                 from rtmp_main.c:38:
/usr/src/linux-2.6.11/include/linux/percpu.h:36: error: parse error before "size"
/usr/src/linux-2.6.11/include/linux/percpu.h:36: warning: function declaration isn't a prototype
In file included from /usr/src/linux-2.6.11/include/linux/sched.h:194,
                 from /usr/src/linux-2.6.11/include/linux/module.h:10,
                 from rt_config.h:54,
                 from rtmp_main.c:38:
/usr/src/linux-2.6.11/include/linux/aio.h:55: error: parse error before "ssize_t"
/usr/src/linux-2.6.11/include/linux/aio.h:55: warning: no semicolon at end of struct or union
/usr/src/linux-2.6.11/include/linux/aio.h:66: error: parse error before "ki_pos"
/usr/src/linux-2.6.11/include/linux/aio.h:66: warning: type defaults to `int' in declaration of `ki_pos'
/usr/src/linux-2.6.11/include/linux/aio.h:66: warning: data definition has no type or storage class
/usr/src/linux-2.6.11/include/linux/aio.h:69: error: parse error before "ki_nbytes"
/usr/src/linux-2.6.11/include/linux/aio.h:69: warning: type defaults to `int' in declaration of `ki_nbytes'
/usr/src/linux-2.6.11/include/linux/aio.h:69: warning: data definition has no type or storage class
/usr/src/linux-2.6.11/include/linux/aio.h:71: error: parse error before "ki_left"
/usr/src/linux-2.6.11/include/linux/aio.h:71: warning: type defaults to `int' in declaration of `ki_left'
/usr/src/linux-2.6.11/include/linux/aio.h:71: warning: data definition has no type or storage class
/usr/src/linux-2.6.11/include/linux/aio.h:78: error: parse error before '}' token
/usr/src/linux-2.6.11/include/linux/aio.h:157: error: parse error before "wait_on_sync_kiocb"
/usr/src/linux-2.6.11/include/linux/aio.h:157: warning: type defaults to `int' in declaration of `wait_on_sync_kiocb'
/usr/src/linux-2.6.11/include/linux/aio.h:157: warning: data definition has no type or storage class
/usr/src/linux-2.6.11/include/linux/aio.h: In function `list_kiocb':
/usr/src/linux-2.6.11/include/linux/aio.h:194: error: dereferencing pointer to incomplete type
/usr/src/linux-2.6.11/include/linux/aio.h:194: warning: type defaults to `int' in declaration of `__mptr'
/usr/src/linux-2.6.11/include/linux/aio.h:194: warning: initialization from incompatible pointer type
/usr/src/linux-2.6.11/include/linux/aio.h:194: error: `size_t' undeclared (first use in this function)
/usr/src/linux-2.6.11/include/linux/aio.h:194: error: dereferencing pointer to incomplete type
In file included from /usr/src/linux-2.6.11/include/linux/module.h:10,
                 from rt_config.h:54,
                 from rtmp_main.c:38:
/usr/src/linux-2.6.11/include/linux/sched.h: At top level:
/usr/src/linux-2.6.11/include/linux/sched.h:304: error: parse error before "pid_t"
/usr/src/linux-2.6.11/include/linux/sched.h:304: warning: no semicolon at end of struct or union
/usr/src/linux-2.6.11/include/linux/sched.h:305: warning: type defaults to `int' in declaration of `tty_old_pgrp'
/usr/src/linux-2.6.11/include/linux/sched.h:305: warning: data definition has no type or storage class
/usr/src/linux-2.6.11/include/linux/sched.h:306: error: parse error before "session"
/usr/src/linux-2.6.11/include/linux/sched.h:306: warning: type defaults to `int' in declaration of `session'
/usr/src/linux-2.6.11/include/linux/sched.h:306: warning: data definition has no type or storage class
/usr/src/linux-2.6.11/include/linux/sched.h:332: error: parse error before '}' token
/usr/src/linux-2.6.11/include/linux/sched.h:382: error: parse error before "uid_t"
/usr/src/linux-2.6.11/include/linux/sched.h:382: warning: no semicolon at end of struct or union
/usr/src/linux-2.6.11/include/linux/sched.h:385: warning: parameter names (without types) in function declaration
/usr/src/linux-2.6.11/include/linux/sched.h:497: error: parse error before "gid_t"
/usr/src/linux-2.6.11/include/linux/sched.h:497: warning: no semicolon at end of struct or union
/usr/src/linux-2.6.11/include/linux/sched.h:499: error: parse error before '*' token
/usr/src/linux-2.6.11/include/linux/sched.h:499: warning: type defaults to `int' in declaration of `blocks'
/usr/src/linux-2.6.11/include/linux/sched.h:499: warning: data definition has no type or storage class
/usr/src/linux-2.6.11/include/linux/sched.h:500: error: parse error before '}' token
/usr/src/linux-2.6.11/include/linux/sched.h:571: error: parse error before "pid_t"
/usr/src/linux-2.6.11/include/linux/sched.h:571: warning: no semicolon at end of struct or union
/usr/src/linux-2.6.11/include/linux/sched.h:572: warning: type defaults to `int' in declaration of `tgid'
/usr/src/linux-2.6.11/include/linux/sched.h:572: warning: data definition has no type or storage class
/usr/src/linux-2.6.11/include/linux/sched.h:606: error: parse error before "uid"
/usr/src/linux-2.6.11/include/linux/sched.h:606: warning: type defaults to `int' in declaration of `uid'
/usr/src/linux-2.6.11/include/linux/sched.h:606: warning: type defaults to `int' in declaration of `euid'
/usr/src/linux-2.6.11/include/linux/sched.h:606: warning: type defaults to `int' in declaration of `suid'
/usr/src/linux-2.6.11/include/linux/sched.h:606: warning: type defaults to `int' in declaration of `fsuid'
/usr/src/linux-2.6.11/include/linux/sched.h:606: warning: data definition has no type or storage class
/usr/src/linux-2.6.11/include/linux/sched.h:607: error: parse error before "gid"
/usr/src/linux-2.6.11/include/linux/sched.h:607: warning: type defaults to `int' in declaration of `gid'
/usr/src/linux-2.6.11/include/linux/sched.h:607: warning: type defaults to `int' in declaration of `egid'
/usr/src/linux-2.6.11/include/linux/sched.h:607: warning: type defaults to `int' in declaration of `sgid'
/usr/src/linux-2.6.11/include/linux/sched.h:607: warning: type defaults to `int' in declaration of `fsgid'
/usr/src/linux-2.6.11/include/linux/sched.h:607: warning: data definition has no type or storage class
/usr/src/linux-2.6.11/include/linux/sched.h:610: error: parse error before ':' token
/usr/src/linux-2.6.11/include/linux/sched.h:639: error: parse error before "sas_ss_size"
/usr/src/linux-2.6.11/include/linux/sched.h:639: warning: type defaults to `int' in declaration of `sas_ss_size'
/usr/src/linux-2.6.11/include/linux/sched.h:639: warning: data definition has no type or storage class
/usr/src/linux-2.6.11/include/linux/sched.h:669: error: parse error before '*' token
/usr/src/linux-2.6.11/include/linux/sched.h:669: warning: type defaults to `int' in declaration of `last_siginfo'
/usr/src/linux-2.6.11/include/linux/sched.h:669: warning: data definition has no type or storage class
/usr/src/linux-2.6.11/include/linux/sched.h:682: error: parse error before "acct_stimexpd"
/usr/src/linux-2.6.11/include/linux/sched.h:682: warning: type defaults to `int' in declaration of `acct_stimexpd'
/usr/src/linux-2.6.11/include/linux/sched.h:682: warning: data definition has no type or storage class
/usr/src/linux-2.6.11/include/linux/sched.h:690: error: parse error before "process_group"
/usr/src/linux-2.6.11/include/linux/sched.h:691: warning: return type defaults to `int'
/usr/src/linux-2.6.11/include/linux/sched.h: In function `process_group':
/usr/src/linux-2.6.11/include/linux/sched.h:692: error: dereferencing pointer to incomplete type
/usr/src/linux-2.6.11/include/linux/sched.h: In function `pid_alive':
/usr/src/linux-2.6.11/include/linux/sched.h:705: error: dereferencing pointer to incomplete type
/usr/src/linux-2.6.11/include/linux/sched.h: At top level:
/usr/src/linux-2.6.11/include/linux/sched.h:828: error: parse error before "session"
/usr/src/linux-2.6.11/include/linux/sched.h:828: warning: function declaration isn't a prototype
/usr/src/linux-2.6.11/include/linux/sched.h:829: error: parse error before "session"
/usr/src/linux-2.6.11/include/linux/sched.h:829: warning: function declaration isn't a prototype
/usr/src/linux-2.6.11/include/linux/sched.h:832: warning: parameter names (without types) in function declaration
/usr/src/linux-2.6.11/include/linux/sched.h: In function `get_uid':
/usr/src/linux-2.6.11/include/linux/sched.h:835: error: dereferencing pointer to incomplete type
/usr/src/linux-2.6.11/include/linux/sched.h: At top level:
/usr/src/linux-2.6.11/include/linux/sched.h:857: warning: parameter names (without types) in function declaration
/usr/src/linux-2.6.11/include/linux/sched.h:858: warning: parameter names (without types) in function declaration
/usr/src/linux-2.6.11/include/linux/sched.h:863: error: parse error before "siginfo_t"
/usr/src/linux-2.6.11/include/linux/sched.h:863: warning: function declaration isn't a prototype
/usr/src/linux-2.6.11/include/linux/sched.h:865: error: parse error before "siginfo_t"
/usr/src/linux-2.6.11/include/linux/sched.h:866: warning: function declaration isn't a prototype
/usr/src/linux-2.6.11/include/linux/sched.h: In function `dequeue_signal_lock':
/usr/src/linux-2.6.11/include/linux/sched.h:870: error: `tsk' undeclared (first use in this function)
/usr/src/linux-2.6.11/include/linux/sched.h:871: error: `mask' undeclared (first use in this function)
/usr/src/linux-2.6.11/include/linux/sched.h:871: error: `info' undeclared (first use in this function)
/usr/src/linux-2.6.11/include/linux/sched.h: At top level:
/usr/src/linux-2.6.11/include/linux/sched.h:885: error: parse error before "pid_t"
/usr/src/linux-2.6.11/include/linux/sched.h:885: warning: function declaration isn't a prototype
/usr/src/linux-2.6.11/include/linux/sched.h:886: error: parse error before "pid_t"
/usr/src/linux-2.6.11/include/linux/sched.h:886: warning: function declaration isn't a prototype
/usr/src/linux-2.6.11/include/linux/sched.h:887: error: parse error before "pid_t"
/usr/src/linux-2.6.11/include/linux/sched.h:887: warning: function declaration isn't a prototype
/usr/src/linux-2.6.11/include/linux/sched.h:893: error: parse error before "int"
/usr/src/linux-2.6.11/include/linux/sched.h:893: warning: function declaration isn't a prototype
/usr/src/linux-2.6.11/include/linux/sched.h:894: error: parse error before "int"
/usr/src/linux-2.6.11/include/linux/sched.h:894: warning: function declaration isn't a prototype
/usr/src/linux-2.6.11/include/linux/sched.h:895: error: parse error before "int"
/usr/src/linux-2.6.11/include/linux/sched.h:895: warning: function declaration isn't a prototype
/usr/src/linux-2.6.11/include/linux/sched.h:901: warning: type defaults to `int' in declaration of `stack_t'
/usr/src/linux-2.6.11/include/linux/sched.h:901: error: parse error before '*' token
/usr/src/linux-2.6.11/include/linux/sched.h:901: warning: function declaration isn't a prototype
/usr/src/linux-2.6.11/include/linux/sched.h: In function `on_sig_stack':
/usr/src/linux-2.6.11/include/linux/sched.h:912: error: dereferencing pointer to incomplete type
/usr/src/linux-2.6.11/include/linux/sched.h:912: error: dereferencing pointer to incomplete type
/usr/src/linux-2.6.11/include/linux/sched.h: In function `sas_ss_flags':
/usr/src/linux-2.6.11/include/linux/sched.h:917: error: dereferencing pointer to incomplete type
/usr/src/linux-2.6.11/include/linux/sched.h: In function `thread_group_empty':
/usr/src/linux-2.6.11/include/linux/sched.h:1026: error: dereferencing pointer to incomplete type
/usr/src/linux-2.6.11/include/linux/sched.h: In function `task_lock':
/usr/src/linux-2.6.11/include/linux/sched.h:1044: error: dereferencing pointer to incomplete type
/usr/src/linux-2.6.11/include/linux/sched.h: In function `task_unlock':
/usr/src/linux-2.6.11/include/linux/sched.h:1049: error: dereferencing pointer to incomplete type
/usr/src/linux-2.6.11/include/linux/sched.h: In function `set_tsk_thread_flag':
/usr/src/linux-2.6.11/include/linux/sched.h:1057: error: dereferencing pointer to incomplete type
/usr/src/linux-2.6.11/include/linux/sched.h: In function `clear_tsk_thread_flag':
/usr/src/linux-2.6.11/include/linux/sched.h:1062: error: dereferencing pointer to incomplete type
/usr/src/linux-2.6.11/include/linux/sched.h: In function `test_and_set_tsk_thread_flag':
/usr/src/linux-2.6.11/include/linux/sched.h:1067: error: dereferencing pointer to incomplete type
/usr/src/linux-2.6.11/include/linux/sched.h: In function `test_and_clear_tsk_thread_flag':
/usr/src/linux-2.6.11/include/linux/sched.h:1072: error: dereferencing pointer to incomplete type
/usr/src/linux-2.6.11/include/linux/sched.h: In function `test_tsk_thread_flag':
/usr/src/linux-2.6.11/include/linux/sched.h:1077: error: dereferencing pointer to incomplete type
/usr/src/linux-2.6.11/include/linux/sched.h: In function `task_cpu':
/usr/src/linux-2.6.11/include/linux/sched.h:1148: error: dereferencing pointer to incomplete type
/usr/src/linux-2.6.11/include/linux/sched.h: In function `set_task_cpu':
/usr/src/linux-2.6.11/include/linux/sched.h:1153: error: dereferencing pointer to incomplete type
/usr/src/linux-2.6.11/include/linux/sched.h: At top level:
/usr/src/linux-2.6.11/include/linux/sched.h:1180: error: parse error before "pid"
/usr/src/linux-2.6.11/include/linux/sched.h:1180: warning: function declaration isn't a prototype
/usr/src/linux-2.6.11/include/linux/sched.h:1181: error: parse error before "pid"
/usr/src/linux-2.6.11/include/linux/sched.h:1181: warning: function declaration isn't a prototype
/usr/src/linux-2.6.11/include/linux/sched.h: In function `try_to_freeze':
/usr/src/linux-2.6.11/include/linux/sched.h:1201: error: dereferencing pointer to incomplete type
In file included from /usr/src/linux-2.6.11/include/linux/module.h:13,
                 from rt_config.h:54,
                 from rtmp_main.c:38:
/usr/src/linux-2.6.11/include/linux/stat.h: At top level:
/usr/src/linux-2.6.11/include/linux/stat.h:61: error: parse error before "dev_t"
/usr/src/linux-2.6.11/include/linux/stat.h:61: warning: no semicolon at end of struct or union
/usr/src/linux-2.6.11/include/linux/stat.h:62: error: conflicting types for `mode'
/usr/src/linux-2.6.11/include/linux/ipc.h:66: error: previous declaration of `mode'
/usr/src/linux-2.6.11/include/linux/stat.h:64: error: parse error before "uid"
/usr/src/linux-2.6.11/include/linux/stat.h:64: warning: type defaults to `int' in declaration of `uid'
/usr/src/linux-2.6.11/include/linux/stat.h:64: warning: data definition has no type or storage class
/usr/src/linux-2.6.11/include/linux/stat.h:65: error: parse error before "gid"
/usr/src/linux-2.6.11/include/linux/stat.h:65: warning: type defaults to `int' in declaration of `gid'
/usr/src/linux-2.6.11/include/linux/stat.h:65: warning: data definition has no type or storage class
/usr/src/linux-2.6.11/include/linux/stat.h:66: error: parse error before "rdev"
/usr/src/linux-2.6.11/include/linux/stat.h:66: warning: type defaults to `int' in declaration of `rdev'
/usr/src/linux-2.6.11/include/linux/stat.h:66: warning: data definition has no type or storage class
/usr/src/linux-2.6.11/include/linux/stat.h:67: error: parse error before "size"
/usr/src/linux-2.6.11/include/linux/stat.h:67: warning: type defaults to `int' in declaration of `size'
/usr/src/linux-2.6.11/include/linux/stat.h:67: error: `size' used prior to declaration
/usr/src/linux-2.6.11/include/linux/stat.h:67: warning: data definition has no type or storage class
/usr/src/linux-2.6.11/include/linux/stat.h:72: error: conflicting types for `blocks'
/usr/src/linux-2.6.11/include/linux/sched.h:499: error: previous declaration of `blocks'
/usr/src/linux-2.6.11/include/linux/stat.h:73: error: parse error before '}' token
In file included from /usr/src/linux-2.6.11/include/linux/kobject.h:22,
                 from /usr/src/linux-2.6.11/include/linux/module.h:19,
                 from rt_config.h:54,
                 from rtmp_main.c:38:
/usr/src/linux-2.6.11/include/linux/sysfs.h:21: error: parse error before "mode_t"
/usr/src/linux-2.6.11/include/linux/sysfs.h:21: warning: no semicolon at end of struct or union
/usr/src/linux-2.6.11/include/linux/sysfs.h:54: error: field `attr' has incomplete type
/usr/src/linux-2.6.11/include/linux/sysfs.h:55: error: parse error before "size_t"
/usr/src/linux-2.6.11/include/linux/sysfs.h:55: warning: no semicolon at end of struct or union
/usr/src/linux-2.6.11/include/linux/sysfs.h:57: error: parse error before '*' token
/usr/src/linux-2.6.11/include/linux/sysfs.h:57: error: parse error before "loff_t"
/usr/src/linux-2.6.11/include/linux/sysfs.h:57: warning: type defaults to `int' in declaration of `ssize_t'
/usr/src/linux-2.6.11/include/linux/sysfs.h:57: warning: function declaration isn't a prototype
/usr/src/linux-2.6.11/include/linux/sysfs.h:57: error: `ssize_t' declared as function returning a function
/usr/src/linux-2.6.11/include/linux/sysfs.h:57: warning: function declaration isn't a prototype
/usr/src/linux-2.6.11/include/linux/sysfs.h:57: warning: data definition has no type or storage class
/usr/src/linux-2.6.11/include/linux/sysfs.h:58: error: parse error before '*' token
/usr/src/linux-2.6.11/include/linux/sysfs.h:58: error: parse error before "loff_t"
/usr/src/linux-2.6.11/include/linux/sysfs.h:58: warning: type defaults to `int' in declaration of `ssize_t'
/usr/src/linux-2.6.11/include/linux/sysfs.h:58: warning: function declaration isn't a prototype
/usr/src/linux-2.6.11/include/linux/sysfs.h:58: error: `ssize_t' declared as function returning a function
/usr/src/linux-2.6.11/include/linux/sysfs.h:58: warning: function declaration isn't a prototype
/usr/src/linux-2.6.11/include/linux/sysfs.h:58: warning: data definition has no type or storage class
/usr/src/linux-2.6.11/include/linux/sysfs.h:61: error: parse error before '}' token
/usr/src/linux-2.6.11/include/linux/sysfs.h:64: error: parse error before "ssize_t"
/usr/src/linux-2.6.11/include/linux/sysfs.h:64: warning: no semicolon at end of struct or union
/usr/src/linux-2.6.11/include/linux/sysfs.h:65: error: parse error before '*' token
/usr/src/linux-2.6.11/include/linux/sysfs.h:65: error: parse error before "size_t"
/usr/src/linux-2.6.11/include/linux/sysfs.h:65: warning: type defaults to `int' in declaration of `ssize_t'
/usr/src/linux-2.6.11/include/linux/sysfs.h:65: warning: function declaration isn't a prototype
/usr/src/linux-2.6.11/include/linux/sysfs.h:65: error: `ssize_t' declared as function returning a function
/usr/src/linux-2.6.11/include/linux/sysfs.h:65: warning: function declaration isn't a prototype
/usr/src/linux-2.6.11/include/linux/sysfs.h:65: warning: data definition has no type or storage class
In file included from /usr/src/linux-2.6.11/include/linux/module.h:19,
                 from rt_config.h:54,
                 from rtmp_main.c:38:
/usr/src/linux-2.6.11/include/linux/kobject.h: In function `to_kset':
/usr/src/linux-2.6.11/include/linux/kobject.h:117: error: `size_t' undeclared (first use in this function)
/usr/src/linux-2.6.11/include/linux/kobject.h: In function `subsys_get':
/usr/src/linux-2.6.11/include/linux/kobject.h:225: error: `size_t' undeclared (first use in this function)
/usr/src/linux-2.6.11/include/linux/kobject.h: At top level:
/usr/src/linux-2.6.11/include/linux/kobject.h:234: error: field `attr' has incomplete type
/usr/src/linux-2.6.11/include/linux/kobject.h:235: error: parse error before "ssize_t"
/usr/src/linux-2.6.11/include/linux/kobject.h:235: warning: no semicolon at end of struct or union
/usr/src/linux-2.6.11/include/linux/kobject.h:236: error: parse error before '*' token
/usr/src/linux-2.6.11/include/linux/kobject.h:236: error: parse error before "size_t"
/usr/src/linux-2.6.11/include/linux/kobject.h:236: warning: type defaults to `int' in declaration of `ssize_t'
/usr/src/linux-2.6.11/include/linux/kobject.h:236: warning: function declaration isn't a prototype
/usr/src/linux-2.6.11/include/linux/kobject.h:236: error: `ssize_t' declared as function returning a function
/usr/src/linux-2.6.11/include/linux/kobject.h:236: warning: function declaration isn't a prototype
/usr/src/linux-2.6.11/include/linux/kobject.h:236: warning: data definition has no type or storage class
In file included from rt_config.h:54,
                 from rtmp_main.c:38:
/usr/src/linux-2.6.11/include/linux/module.h:50: error: field `attr' has incomplete type
/usr/src/linux-2.6.11/include/linux/module.h:51: error: parse error before "ssize_t"
/usr/src/linux-2.6.11/include/linux/module.h:51: warning: no semicolon at end of struct or union
/usr/src/linux-2.6.11/include/linux/module.h:52: error: parse error before '*' token
/usr/src/linux-2.6.11/include/linux/module.h:53: error: parse error before "size_t"
/usr/src/linux-2.6.11/include/linux/module.h:53: warning: type defaults to `int' in declaration of `ssize_t'
/usr/src/linux-2.6.11/include/linux/module.h:53: warning: function declaration isn't a prototype
/usr/src/linux-2.6.11/include/linux/module.h:53: error: `ssize_t' declared as function returning a function
/usr/src/linux-2.6.11/include/linux/module.h:53: warning: function declaration isn't a prototype
/usr/src/linux-2.6.11/include/linux/module.h:53: warning: data definition has no type or storage class
/usr/src/linux-2.6.11/include/linux/module.h:226: error: field `mattr' has incomplete type
In file included from /usr/src/linux-2.6.11/include/linux/hardirq.h:5,
                 from /usr/src/linux-2.6.11/include/linux/interrupt.h:11,
                 from rt_config.h:62,
                 from rtmp_main.c:38:
/usr/src/linux-2.6.11/include/linux/smp_lock.h: In function `reacquire_kernel_lock':
/usr/src/linux-2.6.11/include/linux/smp_lock.h:37: error: dereferencing pointer to incomplete type
In file included from /usr/src/linux-2.6.11/include/linux/pci.h:480,
                 from rt_config.h:63,
                 from rtmp_main.c:38:
/usr/src/linux-2.6.11/include/linux/device.h: At top level:
/usr/src/linux-2.6.11/include/linux/device.h:90: error: field `attr' has incomplete type
/usr/src/linux-2.6.11/include/linux/device.h:91: error: parse error before "ssize_t"
/usr/src/linux-2.6.11/include/linux/device.h:91: warning: no semicolon at end of struct or union
/usr/src/linux-2.6.11/include/linux/device.h:92: error: parse error before '*' token
/usr/src/linux-2.6.11/include/linux/device.h:92: error: parse error before "size_t"
/usr/src/linux-2.6.11/include/linux/device.h:92: warning: type defaults to `int' in declaration of `ssize_t'
/usr/src/linux-2.6.11/include/linux/device.h:92: warning: function declaration isn't a prototype
/usr/src/linux-2.6.11/include/linux/device.h:92: error: `ssize_t' declared as function returning a function
/usr/src/linux-2.6.11/include/linux/device.h:92: warning: function declaration isn't a prototype
/usr/src/linux-2.6.11/include/linux/device.h:92: warning: data definition has no type or storage class
/usr/src/linux-2.6.11/include/linux/device.h:130: error: field `attr' has incomplete type
/usr/src/linux-2.6.11/include/linux/device.h:131: error: parse error before "ssize_t"
/usr/src/linux-2.6.11/include/linux/device.h:131: warning: no semicolon at end of struct or union
/usr/src/linux-2.6.11/include/linux/device.h:132: error: parse error before '*' token
/usr/src/linux-2.6.11/include/linux/device.h:132: error: parse error before "size_t"
/usr/src/linux-2.6.11/include/linux/device.h:132: warning: type defaults to `int' in declaration of `ssize_t'
/usr/src/linux-2.6.11/include/linux/device.h:132: warning: function declaration isn't a prototype
/usr/src/linux-2.6.11/include/linux/device.h:132: error: `ssize_t' declared as function returning a function
/usr/src/linux-2.6.11/include/linux/device.h:132: warning: function declaration isn't a prototype
/usr/src/linux-2.6.11/include/linux/device.h:132: warning: data definition has no type or storage class
/usr/src/linux-2.6.11/include/linux/device.h:170: error: field `attr' has incomplete type
/usr/src/linux-2.6.11/include/linux/device.h:171: error: parse error before "ssize_t"
/usr/src/linux-2.6.11/include/linux/device.h:171: warning: no semicolon at end of struct or union
/usr/src/linux-2.6.11/include/linux/device.h:172: error: parse error before '*' token
/usr/src/linux-2.6.11/include/linux/device.h:172: error: parse error before "size_t"
/usr/src/linux-2.6.11/include/linux/device.h:172: warning: type defaults to `int' in declaration of `ssize_t'
/usr/src/linux-2.6.11/include/linux/device.h:172: warning: function declaration isn't a prototype
/usr/src/linux-2.6.11/include/linux/device.h:172: error: `ssize_t' declared as function returning a function
/usr/src/linux-2.6.11/include/linux/device.h:172: warning: function declaration isn't a prototype
/usr/src/linux-2.6.11/include/linux/device.h:172: warning: data definition has no type or storage class
/usr/src/linux-2.6.11/include/linux/device.h:218: error: field `attr' has incomplete type
/usr/src/linux-2.6.11/include/linux/device.h:219: error: parse error before "ssize_t"
/usr/src/linux-2.6.11/include/linux/device.h:219: warning: no semicolon at end of struct or union
/usr/src/linux-2.6.11/include/linux/device.h:220: error: parse error before '*' token
/usr/src/linux-2.6.11/include/linux/device.h:220: error: parse error before "size_t"
/usr/src/linux-2.6.11/include/linux/device.h:220: warning: type defaults to `int' in declaration of `ssize_t'
/usr/src/linux-2.6.11/include/linux/device.h:220: warning: function declaration isn't a prototype
/usr/src/linux-2.6.11/include/linux/device.h:220: error: `ssize_t' declared as function returning a function
/usr/src/linux-2.6.11/include/linux/device.h:220: warning: function declaration isn't a prototype
/usr/src/linux-2.6.11/include/linux/device.h:220: warning: data definition has no type or storage class
/usr/src/linux-2.6.11/include/linux/device.h:250: error: parse error before "dev_t"
/usr/src/linux-2.6.11/include/linux/device.h:251: warning: function declaration isn't a prototype
/usr/src/linux-2.6.11/include/linux/device.h:254: error: parse error before "dev"
/usr/src/linux-2.6.11/include/linux/device.h:254: warning: function declaration isn't a prototype
/usr/src/linux-2.6.11/include/linux/device.h: In function `list_to_dev':
/usr/src/linux-2.6.11/include/linux/device.h:296: error: `size_t' undeclared (first use in this function)
/usr/src/linux-2.6.11/include/linux/device.h: At top level:
/usr/src/linux-2.6.11/include/linux/device.h:336: error: field `attr' has incomplete type
/usr/src/linux-2.6.11/include/linux/device.h:337: error: parse error before "ssize_t"
/usr/src/linux-2.6.11/include/linux/device.h:337: warning: no semicolon at end of struct or union
/usr/src/linux-2.6.11/include/linux/device.h:338: error: parse error before '*' token
/usr/src/linux-2.6.11/include/linux/device.h:338: error: parse error before "size_t"
/usr/src/linux-2.6.11/include/linux/device.h:338: warning: type defaults to `int' in declaration of `ssize_t'
/usr/src/linux-2.6.11/include/linux/device.h:338: warning: function declaration isn't a prototype
/usr/src/linux-2.6.11/include/linux/device.h:338: error: `ssize_t' declared as function returning a function
/usr/src/linux-2.6.11/include/linux/device.h:338: warning: function declaration isn't a prototype
/usr/src/linux-2.6.11/include/linux/device.h:338: warning: data definition has no type or storage class
In file included from rt_config.h:63,
                 from rtmp_main.c:38:
/usr/src/linux-2.6.11/include/linux/pci.h:817: error: parse error before "size_t"
/usr/src/linux-2.6.11/include/linux/pci.h:817: warning: function declaration isn't a prototype
/usr/src/linux-2.6.11/include/linux/pci.h:818: error: parse error before "size_t"
/usr/src/linux-2.6.11/include/linux/pci.h:818: warning: function declaration isn't a prototype
In file included from /usr/src/linux-2.6.11/include/linux/pci.h:863,
                 from rt_config.h:63,
                 from rtmp_main.c:38:
/usr/src/linux-2.6.11/include/linux/dmapool.h:18: error: parse error before "size_t"
/usr/src/linux-2.6.11/include/linux/dmapool.h:18: warning: function declaration isn't a prototype
In file included from /usr/src/linux-2.6.11/include/linux/mm.h:14,
                 from /usr/include/asm/pci.h:7,
                 from /usr/src/linux-2.6.11/include/linux/pci.h:903,
                 from rt_config.h:63,
                 from rtmp_main.c:38:
/usr/src/linux-2.6.11/include/linux/prio_tree.h:45: error: parse error before "pgoff_t"
/usr/src/linux-2.6.11/include/linux/prio_tree.h:50: error: parse error before "pgoff_t"
/usr/src/linux-2.6.11/include/linux/prio_tree.h: In function `prio_tree_iter_init':
/usr/src/linux-2.6.11/include/linux/prio_tree.h:52: error: `iter' undeclared (first use in this function)
/usr/src/linux-2.6.11/include/linux/prio_tree.h:52: error: `root' undeclared (first use in this function)
/usr/src/linux-2.6.11/include/linux/prio_tree.h:53: error: `r_index' undeclared (first use in this function)
In file included from /usr/src/linux-2.6.11/include/linux/fs.h:205,
                 from /usr/src/linux-2.6.11/include/linux/mm.h:15,
                 from /usr/include/asm/pci.h:7,
                 from /usr/src/linux-2.6.11/include/linux/pci.h:903,
                 from rt_config.h:63,
                 from rtmp_main.c:38:
/usr/src/linux-2.6.11/include/linux/kdev_t.h: At top level:
/usr/src/linux-2.6.11/include/linux/kdev_t.h:21: error: parse error before "dev"
/usr/src/linux-2.6.11/include/linux/kdev_t.h: In function `old_valid_dev':
/usr/src/linux-2.6.11/include/linux/kdev_t.h:23: error: `dev' undeclared (first use in this function)
/usr/src/linux-2.6.11/include/linux/kdev_t.h: At top level:
/usr/src/linux-2.6.11/include/linux/kdev_t.h:26: error: parse error before "dev"
/usr/src/linux-2.6.11/include/linux/kdev_t.h: In function `old_encode_dev':
/usr/src/linux-2.6.11/include/linux/kdev_t.h:28: error: `dev' undeclared (first use in this function)
/usr/src/linux-2.6.11/include/linux/kdev_t.h: At top level:
/usr/src/linux-2.6.11/include/linux/kdev_t.h:31: error: parse error before "old_decode_dev"
/usr/src/linux-2.6.11/include/linux/kdev_t.h:36: error: parse error before "dev"
/usr/src/linux-2.6.11/include/linux/kdev_t.h:41: error: parse error before "dev"
/usr/src/linux-2.6.11/include/linux/kdev_t.h: In function `new_encode_dev':
/usr/src/linux-2.6.11/include/linux/kdev_t.h:43: error: `dev' undeclared (first use in this function)
/usr/src/linux-2.6.11/include/linux/kdev_t.h: At top level:
/usr/src/linux-2.6.11/include/linux/kdev_t.h:48: error: parse error before "new_decode_dev"
/usr/src/linux-2.6.11/include/linux/kdev_t.h:55: error: parse error before "dev"
/usr/src/linux-2.6.11/include/linux/kdev_t.h:60: error: parse error before "dev"
/usr/src/linux-2.6.11/include/linux/kdev_t.h: In function `huge_encode_dev':
/usr/src/linux-2.6.11/include/linux/kdev_t.h:62: error: `dev' undeclared (first use in this function)
/usr/src/linux-2.6.11/include/linux/kdev_t.h: At top level:
/usr/src/linux-2.6.11/include/linux/kdev_t.h:65: error: parse error before "huge_decode_dev"
/usr/src/linux-2.6.11/include/linux/kdev_t.h:70: error: parse error before "dev"
/usr/src/linux-2.6.11/include/linux/kdev_t.h: In function `sysv_valid_dev':
/usr/src/linux-2.6.11/include/linux/kdev_t.h:72: error: `dev' undeclared (first use in this function)
/usr/src/linux-2.6.11/include/linux/kdev_t.h: At top level:
/usr/src/linux-2.6.11/include/linux/kdev_t.h:75: error: parse error before "dev"
/usr/src/linux-2.6.11/include/linux/kdev_t.h: In function `sysv_encode_dev':
/usr/src/linux-2.6.11/include/linux/kdev_t.h:77: error: `dev' undeclared (first use in this function)
In file included from /usr/src/linux-2.6.11/include/linux/fs.h:213,
                 from /usr/src/linux-2.6.11/include/linux/mm.h:15,
                 from /usr/include/asm/pci.h:7,
                 from /usr/src/linux-2.6.11/include/linux/pci.h:903,
                 from rt_config.h:63,
                 from rtmp_main.c:38:
/usr/src/linux-2.6.11/include/linux/audit.h: At top level:
/usr/src/linux-2.6.11/include/linux/audit.h:144: error: parse error before "dev_t"
/usr/src/linux-2.6.11/include/linux/audit.h:151: error: parse error before "uid_t"
/usr/src/linux-2.6.11/include/linux/audit.h:152: error: parse error before "audit_get_loginuid"
In file included from /usr/src/linux-2.6.11/include/linux/mm.h:15,
                 from /usr/include/asm/pci.h:7,
                 from /usr/src/linux-2.6.11/include/linux/pci.h:903,
                 from rt_config.h:63,
                 from rtmp_main.c:38:
/usr/src/linux-2.6.11/include/linux/fs.h:242: error: parse error before "loff_t"
/usr/src/linux-2.6.11/include/linux/fs.h:275: error: parse error before "uid_t"
/usr/src/linux-2.6.11/include/linux/fs.h:277: error: parse error before "ia_size"
/usr/src/linux-2.6.11/include/linux/fs.h:282: error: parse error before '}' token
In file included from /usr/src/linux-2.6.11/include/linux/fs.h:296,
                 from /usr/src/linux-2.6.11/include/linux/mm.h:15,
                 from /usr/include/asm/pci.h:7,
                 from /usr/src/linux-2.6.11/include/linux/pci.h:903,
                 from rt_config.h:63,
                 from rtmp_main.c:38:
/usr/src/linux-2.6.11/include/linux/quota.h:154: error: parse error before "time_t"
/usr/src/linux-2.6.11/include/linux/quota.h:220: error: parse error before "loff_t"
/usr/src/linux-2.6.11/include/linux/quota.h:224: error: parse error before '}' token
In file included from /usr/src/linux-2.6.11/include/linux/mm.h:15,
                 from /usr/include/asm/pci.h:7,
                 from /usr/src/linux-2.6.11/include/linux/pci.h:903,
                 from rt_config.h:63,
                 from rtmp_main.c:38:
/usr/src/linux-2.6.11/include/linux/fs.h:330: error: parse error before "ssize_t"
/usr/src/linux-2.6.11/include/linux/fs.h:345: error: parse error before "pgoff_t"
/usr/src/linux-2.6.11/include/linux/fs.h:347: error: `flags' used prior to declaration
/usr/src/linux-2.6.11/include/linux/fs.h:352: error: parse error before '}' token
/usr/src/linux-2.6.11/include/linux/fs.h:360: error: parse error before "dev_t"
/usr/src/linux-2.6.11/include/linux/fs.h:384: error: parse error before '}' token
/usr/src/linux-2.6.11/include/linux/fs.h: In function `mapping_mapped':
/usr/src/linux-2.6.11/include/linux/fs.h:400: error: dereferencing pointer to incomplete type
/usr/src/linux-2.6.11/include/linux/fs.h:401: error: dereferencing pointer to incomplete type
/usr/src/linux-2.6.11/include/linux/fs.h: In function `mapping_writably_mapped':
/usr/src/linux-2.6.11/include/linux/fs.h:412: error: dereferencing pointer to incomplete type
/usr/src/linux-2.6.11/include/linux/fs.h: At top level:
/usr/src/linux-2.6.11/include/linux/fs.h:435: error: parse error before "uid_t"
/usr/src/linux-2.6.11/include/linux/fs.h:437: error: parse error before "i_rdev"
/usr/src/linux-2.6.11/include/linux/fs.h:438: error: parse error before "i_size"
/usr/src/linux-2.6.11/include/linux/fs.h:487: error: parse error before '}' token
/usr/src/linux-2.6.11/include/linux/fs.h:499: error: parse error before "i_size_read"
/usr/src/linux-2.6.11/include/linux/fs.h: In function `i_size_read':
/usr/src/linux-2.6.11/include/linux/fs.h:502: error: `loff_t' undeclared (first use in this function)
/usr/src/linux-2.6.11/include/linux/fs.h:502: error: parse error before "i_size"
/usr/src/linux-2.6.11/include/linux/fs.h:506: error: dereferencing pointer to incomplete type
/usr/src/linux-2.6.11/include/linux/fs.h:507: error: dereferencing pointer to incomplete type
/usr/src/linux-2.6.11/include/linux/fs.h:508: error: dereferencing pointer to incomplete type
/usr/src/linux-2.6.11/include/linux/fs.h: At top level:
/usr/src/linux-2.6.11/include/linux/fs.h:523: error: parse error before "loff_t"
/usr/src/linux-2.6.11/include/linux/fs.h: In function `i_size_write':
/usr/src/linux-2.6.11/include/linux/fs.h:526: error: `inode' undeclared (first use in this function)
/usr/src/linux-2.6.11/include/linux/fs.h: In function `iminor':
/usr/src/linux-2.6.11/include/linux/fs.h:540: error: dereferencing pointer to incomplete type
/usr/src/linux-2.6.11/include/linux/fs.h: In function `imajor':
/usr/src/linux-2.6.11/include/linux/fs.h:545: error: dereferencing pointer to incomplete type
/usr/src/linux-2.6.11/include/linux/fs.h: At top level:
/usr/src/linux-2.6.11/include/linux/fs.h:553: error: parse error before "uid_t"
/usr/src/linux-2.6.11/include/linux/fs.h:556: error: parse error before '}' token
/usr/src/linux-2.6.11/include/linux/fs.h:583: error: parse error before "mode_t"
/usr/src/linux-2.6.11/include/linux/fs.h:585: error: parse error before "f_pos"
/usr/src/linux-2.6.11/include/linux/fs.h:590: error: parse error before "f_maxcount"
/usr/src/linux-2.6.11/include/linux/fs.h:603: error: parse error before '}' token
In file included from /usr/src/linux-2.6.11/include/linux/mm.h:15,
                 from /usr/include/asm/pci.h:7,
                 from /usr/src/linux-2.6.11/include/linux/pci.h:903,
                 from rt_config.h:63,
                 from rtmp_main.c:38:
/usr/src/linux-2.6.11/include/linux/fs.h:665: error: parse error before "loff_t"
/usr/src/linux-2.6.11/include/linux/fs.h:676: error: parse error before '}' token
In file included from /usr/src/linux-2.6.11/include/linux/fcntl.h:4,
                 from /usr/src/linux-2.6.11/include/linux/fs.h:687,
                 from /usr/src/linux-2.6.11/include/linux/mm.h:15,
                 from /usr/include/asm/pci.h:7,
                 from /usr/src/linux-2.6.11/include/linux/pci.h:903,
                 from rt_config.h:63,
                 from rtmp_main.c:38:
/usr/include/asm/fcntl.h:73: error: parse error before "off_t"
/usr/include/asm/fcntl.h:75: error: parse error before "l_pid"
/usr/include/asm/fcntl.h:81: error: parse error before "loff_t"
/usr/include/asm/fcntl.h:83: error: parse error before "l_pid"
In file included from /usr/src/linux-2.6.11/include/linux/mm.h:15,
                 from /usr/include/asm/pci.h:7,
                 from /usr/src/linux-2.6.11/include/linux/pci.h:903,
                 from rt_config.h:63,
                 from rtmp_main.c:38:
/usr/src/linux-2.6.11/include/linux/fs.h:717: error: parse error before "loff_t"
/usr/src/linux-2.6.11/include/linux/fs.h:718: error: parse error before "loff_t"
/usr/src/linux-2.6.11/include/linux/fs.h:756: error: parse error before "dev_t"
/usr/src/linux-2.6.11/include/linux/fs.h:805: error: parse error before '}' token
/usr/src/linux-2.6.11/include/linux/fs.h: In function `lock_super':
/usr/src/linux-2.6.11/include/linux/fs.h:826: error: dereferencing pointer to incomplete type
/usr/src/linux-2.6.11/include/linux/fs.h: In function `unlock_super':
/usr/src/linux-2.6.11/include/linux/fs.h:831: error: dereferencing pointer to incomplete type
/usr/src/linux-2.6.11/include/linux/fs.h: At top level:
/usr/src/linux-2.6.11/include/linux/fs.h:839: error: parse error before "dev_t"
/usr/src/linux-2.6.11/include/linux/fs.h:878: error: parse error before "loff_t"
/usr/src/linux-2.6.11/include/linux/fs.h:900: error: parse error before "size_t"
/usr/src/linux-2.6.11/include/linux/fs.h:901: error: `count' used prior to declaration
/usr/src/linux-2.6.11/include/linux/fs.h:907: error: parse error before '}' token
/usr/src/linux-2.6.11/include/linux/fs.h:909: error: parse error before '*' token
/usr/src/linux-2.6.11/include/linux/fs.h:924: error: parse error before "loff_t"
/usr/src/linux-2.6.11/include/linux/fs.h:925: error: parse error before '*' token
/usr/src/linux-2.6.11/include/linux/fs.h:925: error: parse error before "size_t"
/usr/src/linux-2.6.11/include/linux/fs.h:925: error: `ssize_t' declared as function returning a function
/usr/src/linux-2.6.11/include/linux/fs.h:926: error: parse error before '*' token
/usr/src/linux-2.6.11/include/linux/fs.h:926: error: parse error before "size_t"
/usr/src/linux-2.6.11/include/linux/fs.h:926: error: `ssize_t' declared as function returning a function
/usr/src/linux-2.6.11/include/linux/fs.h:927: error: parse error before '*' token
/usr/src/linux-2.6.11/include/linux/fs.h:927: error: parse error before "size_t"
/usr/src/linux-2.6.11/include/linux/fs.h:927: error: `ssize_t' declared as function returning a function
/usr/src/linux-2.6.11/include/linux/fs.h:928: error: parse error before '*' token
/usr/src/linux-2.6.11/include/linux/fs.h:928: error: parse error before "size_t"
/usr/src/linux-2.6.11/include/linux/fs.h:928: error: `ssize_t' declared as function returning a function
/usr/src/linux-2.6.11/include/linux/fs.h:934: error: conflicting types for `mmap'
/usr/src/linux-2.6.11/include/linux/sysfs.h:60: error: previous declaration of `mmap'
/usr/src/linux-2.6.11/include/linux/fs.h:942: error: parse error before '*' token
/usr/src/linux-2.6.11/include/linux/fs.h:942: error: parse error before "loff_t"
/usr/src/linux-2.6.11/include/linux/fs.h:942: error: `ssize_t' declared as function returning a function
/usr/src/linux-2.6.11/include/linux/fs.h:943: error: parse error before '*' token
/usr/src/linux-2.6.11/include/linux/fs.h:943: error: parse error before "loff_t"
/usr/src/linux-2.6.11/include/linux/fs.h:943: error: `ssize_t' declared as function returning a function
/usr/src/linux-2.6.11/include/linux/fs.h:944: error: parse error before '*' token
/usr/src/linux-2.6.11/include/linux/fs.h:944: error: parse error before "loff_t"
/usr/src/linux-2.6.11/include/linux/fs.h:944: error: `ssize_t' declared as function returning a function
/usr/src/linux-2.6.11/include/linux/fs.h:945: error: parse error before '*' token
/usr/src/linux-2.6.11/include/linux/fs.h:945: error: parse error before "size_t"
/usr/src/linux-2.6.11/include/linux/fs.h:945: error: `ssize_t' declared as function returning a function
/usr/src/linux-2.6.11/include/linux/fs.h:950: error: parse error before '}' token
/usr/src/linux-2.6.11/include/linux/fs.h:960: error: parse error before "dev_t"
/usr/src/linux-2.6.11/include/linux/fs.h:970: error: parse error before "size_t"
/usr/src/linux-2.6.11/include/linux/fs.h:972: error: parse error before '*' token
/usr/src/linux-2.6.11/include/linux/fs.h:972: error: parse error before "size_t"
/usr/src/linux-2.6.11/include/linux/fs.h:972: error: `ssize_t' declared as function returning a function
/usr/src/linux-2.6.11/include/linux/fs.h:974: error: parse error before '}' token
/usr/src/linux-2.6.11/include/linux/fs.h:978: error: parse error before "vfs_read"
/usr/src/linux-2.6.11/include/linux/fs.h:978: error: parse error before "size_t"
/usr/src/linux-2.6.11/include/linux/fs.h:979: error: parse error before "vfs_write"
/usr/src/linux-2.6.11/include/linux/fs.h:979: error: parse error before "size_t"
/usr/src/linux-2.6.11/include/linux/fs.h:980: error: parse error before "vfs_readv"
/usr/src/linux-2.6.11/include/linux/fs.h:981: error: parse error before "loff_t"
/usr/src/linux-2.6.11/include/linux/fs.h:982: error: parse error before "vfs_writev"
/usr/src/linux-2.6.11/include/linux/fs.h:983: error: parse error before "loff_t"
/usr/src/linux-2.6.11/include/linux/fs.h:1012: error: parse error before "ssize_t"
/usr/src/linux-2.6.11/include/linux/fs.h:1013: error: parse error before '*' token
/usr/src/linux-2.6.11/include/linux/fs.h:1013: error: parse error before "size_t"
/usr/src/linux-2.6.11/include/linux/fs.h:1013: error: `ssize_t' declared as function returning a function
/usr/src/linux-2.6.11/include/linux/fs.h: In function `file_accessed':
/usr/src/linux-2.6.11/include/linux/fs.h:1047: error: dereferencing pointer to incomplete type
/usr/src/linux-2.6.11/include/linux/fs.h:1048: error: dereferencing pointer to incomplete type
/usr/src/linux-2.6.11/include/linux/fs.h:1048: error: dereferencing pointer to incomplete type
/usr/src/linux-2.6.11/include/linux/fs.h: At top level:
/usr/src/linux-2.6.11/include/linux/fs.h:1215: error: parse error before "loff_t"
/usr/src/linux-2.6.11/include/linux/fs.h: In function `locks_verify_locked':
/usr/src/linux-2.6.11/include/linux/fs.h:1226: error: dereferencing pointer to incomplete type
/usr/src/linux-2.6.11/include/linux/fs.h:1226: error: dereferencing pointer to incomplete type
/usr/src/linux-2.6.11/include/linux/fs.h: At top level:
/usr/src/linux-2.6.11/include/linux/fs.h:1231: error: parse error before "loff_t"
/usr/src/linux-2.6.11/include/linux/fs.h:1235: error: parse error before "loff_t"
/usr/src/linux-2.6.11/include/linux/fs.h: In function `locks_verify_truncate':
/usr/src/linux-2.6.11/include/linux/fs.h:1237: error: `inode' undeclared (first use in this function)
/usr/src/linux-2.6.11/include/linux/fs.h:1239: error: `filp' undeclared (first use in this function)
/usr/src/linux-2.6.11/include/linux/fs.h: In function `break_lease':
/usr/src/linux-2.6.11/include/linux/fs.h:1249: error: dereferencing pointer to incomplete type
/usr/src/linux-2.6.11/include/linux/fs.h: At top level:
/usr/src/linux-2.6.11/include/linux/fs.h:1256: error: parse error before "loff_t"
/usr/src/linux-2.6.11/include/linux/fs.h:1283: error: parse error before "loff_t"
/usr/src/linux-2.6.11/include/linux/fs.h:1286: error: parse error before "unsigned"
/usr/src/linux-2.6.11/include/linux/fs.h:1295: error: parse error before "mode_t"
/usr/src/linux-2.6.11/include/linux/fs.h:1301: error: parse error before '*' token
/usr/src/linux-2.6.11/include/linux/fs.h:1302: error: parse error before "unsigned"
/usr/src/linux-2.6.11/include/linux/fs.h:1306: error: parse error before "unsigned"
/usr/src/linux-2.6.11/include/linux/fs.h:1311: error: parse error before "char"
/usr/src/linux-2.6.11/include/linux/fs.h:1317: error: parse error before "dev_t"
/usr/src/linux-2.6.11/include/linux/fs.h:1347: error: parse error before "pgoff_t"
/usr/src/linux-2.6.11/include/linux/fs.h: In function `invalidate_remote_inode':
/usr/src/linux-2.6.11/include/linux/fs.h:1351: error: dereferencing pointer to incomplete type
/usr/src/linux-2.6.11/include/linux/fs.h:1351: error: dereferencing pointer to incomplete type
/usr/src/linux-2.6.11/include/linux/fs.h:1352: error: dereferencing pointer to incomplete type
/usr/src/linux-2.6.11/include/linux/fs.h:1353: error: dereferencing pointer to incomplete type
/usr/src/linux-2.6.11/include/linux/fs.h: In function `put_write_access':
/usr/src/linux-2.6.11/include/linux/fs.h:1378: error: dereferencing pointer to incomplete type
/usr/src/linux-2.6.11/include/linux/fs.h: In function `allow_write_access':
/usr/src/linux-2.6.11/include/linux/fs.h:1383: error: dereferencing pointer to incomplete type
/usr/src/linux-2.6.11/include/linux/fs.h: At top level:
/usr/src/linux-2.6.11/include/linux/fs.h:1395: error: parse error before "find_inode_number"
In file included from /usr/src/linux-2.6.11/include/linux/mm.h:15,
                 from /usr/include/asm/pci.h:7,
                 from /usr/src/linux-2.6.11/include/linux/pci.h:903,
                 from rt_config.h:63,
                 from rtmp_main.c:38:
/usr/src/linux-2.6.11/include/linux/fs.h:1400: error: parse error before "default_llseek"
/usr/src/linux-2.6.11/include/linux/fs.h:1400: error: parse error before "loff_t"
/usr/src/linux-2.6.11/include/linux/fs.h:1402: error: parse error before "vfs_llseek"
/usr/src/linux-2.6.11/include/linux/fs.h:1402: error: parse error before "loff_t"
/usr/src/linux-2.6.11/include/linux/fs.h:1407: error: parse error before "iunique"
/usr/src/linux-2.6.11/include/linux/fs.h:1407: error: parse error before "ino_t"
/usr/src/linux-2.6.11/include/linux/fs.h: In function `iget':
/usr/src/linux-2.6.11/include/linux/fs.h:1423: error: dereferencing pointer to incomplete type
/usr/src/linux-2.6.11/include/linux/fs.h:1424: error: dereferencing pointer to incomplete type
/usr/src/linux-2.6.11/include/linux/fs.h: In function `insert_inode_hash':
/usr/src/linux-2.6.11/include/linux/fs.h:1442: error: dereferencing pointer to incomplete type
/usr/src/linux-2.6.11/include/linux/fs.h: At top level:
/usr/src/linux-2.6.11/include/linux/fs.h:1457: error: parse error before '*' token
/usr/src/linux-2.6.11/include/linux/fs.h:1458: error: parse error before '*' token
/usr/src/linux-2.6.11/include/linux/fs.h:1459: error: parse error before "generic_file_read"
/usr/src/linux-2.6.11/include/linux/fs.h:1459: error: parse error before "size_t"
/usr/src/linux-2.6.11/include/linux/fs.h:1460: error: parse error before "loff_t"
/usr/src/linux-2.6.11/include/linux/fs.h:1461: error: parse error before "generic_file_write"
/usr/src/linux-2.6.11/include/linux/fs.h:1461: error: parse error before "size_t"
/usr/src/linux-2.6.11/include/linux/fs.h:1462: error: parse error before "generic_file_aio_read"
/usr/src/linux-2.6.11/include/linux/fs.h:1462: error: parse error before "size_t"
/usr/src/linux-2.6.11/include/linux/fs.h:1463: error: parse error before "__generic_file_aio_read"
/usr/src/linux-2.6.11/include/linux/fs.h:1463: error: parse error before "loff_t"
/usr/src/linux-2.6.11/include/linux/fs.h:1464: error: parse error before "generic_file_aio_write"
/usr/src/linux-2.6.11/include/linux/fs.h:1464: error: parse error before "size_t"
/usr/src/linux-2.6.11/include/linux/fs.h:1465: error: parse error before "generic_file_aio_write_nolock"
/usr/src/linux-2.6.11/include/linux/fs.h:1466: error: parse error before "loff_t"
/usr/src/linux-2.6.11/include/linux/fs.h:1467: error: parse error before "generic_file_direct_write"
/usr/src/linux-2.6.11/include/linux/fs.h:1468: error: parse error before "loff_t"
/usr/src/linux-2.6.11/include/linux/fs.h:1469: error: parse error before "generic_file_buffered_write"
/usr/src/linux-2.6.11/include/linux/fs.h:1470: error: parse error before "loff_t"
/usr/src/linux-2.6.11/include/linux/fs.h:1471: error: parse error before "do_sync_read"
/usr/src/linux-2.6.11/include/linux/fs.h:1471: error: parse error before "size_t"
/usr/src/linux-2.6.11/include/linux/fs.h:1472: error: parse error before "do_sync_write"
/usr/src/linux-2.6.11/include/linux/fs.h:1472: error: parse error before "size_t"
/usr/src/linux-2.6.11/include/linux/fs.h:1473: error: parse error before "generic_file_write_nolock"
/usr/src/linux-2.6.11/include/linux/fs.h:1474: error: parse error before "loff_t"
/usr/src/linux-2.6.11/include/linux/fs.h:1475: error: parse error before "generic_file_sendfile"
/usr/src/linux-2.6.11/include/linux/fs.h:1475: error: parse error before "loff_t"
/usr/src/linux-2.6.11/include/linux/fs.h:1478: error: parse error before "loff_t"
/usr/src/linux-2.6.11/include/linux/fs.h:1481: error: parse error before "generic_file_direct_IO"
/usr/src/linux-2.6.11/include/linux/fs.h:1482: error: parse error before "loff_t"
/usr/src/linux-2.6.11/include/linux/fs.h:1483: error: parse error before "generic_file_readv"
/usr/src/linux-2.6.11/include/linux/fs.h:1484: error: parse error before "loff_t"
/usr/src/linux-2.6.11/include/linux/fs.h:1485: error: parse error before "generic_file_writev"
/usr/src/linux-2.6.11/include/linux/fs.h:1486: error: parse error before "loff_t"
/usr/src/linux-2.6.11/include/linux/fs.h:1487: error: parse error before "no_llseek"
/usr/src/linux-2.6.11/include/linux/fs.h:1487: error: parse error before "loff_t"
/usr/src/linux-2.6.11/include/linux/fs.h:1488: error: parse error before "generic_file_llseek"
/usr/src/linux-2.6.11/include/linux/fs.h:1488: error: parse error before "loff_t"
/usr/src/linux-2.6.11/include/linux/fs.h:1489: error: parse error before "remote_llseek"
/usr/src/linux-2.6.11/include/linux/fs.h:1489: error: parse error before "loff_t"
/usr/src/linux-2.6.11/include/linux/fs.h:1493: error: parse error before "loff_t"
/usr/src/linux-2.6.11/include/linux/fs.h: In function `do_generic_file_read':
/usr/src/linux-2.6.11/include/linux/fs.h:1497: error: `filp' undeclared (first use in this function)
/usr/src/linux-2.6.11/include/linux/fs.h:1500: error: `ppos' undeclared (first use in this function)
/usr/src/linux-2.6.11/include/linux/fs.h:1501: error: `desc' undeclared (first use in this function)
/usr/src/linux-2.6.11/include/linux/fs.h:1502: error: `actor' undeclared (first use in this function)
/usr/src/linux-2.6.11/include/linux/fs.h: At top level:
/usr/src/linux-2.6.11/include/linux/fs.h:1505: error: parse error before "__blockdev_direct_IO"
/usr/src/linux-2.6.11/include/linux/fs.h:1506: error: parse error before "loff_t"
/usr/src/linux-2.6.11/include/linux/fs.h:1516: error: parse error before "blockdev_direct_IO"
/usr/src/linux-2.6.11/include/linux/fs.h:1518: error: parse error before "loff_t"
/usr/src/linux-2.6.11/include/linux/fs.h: In function `blockdev_direct_IO':
/usr/src/linux-2.6.11/include/linux/fs.h:1521: error: `rw' undeclared (first use in this function)
/usr/src/linux-2.6.11/include/linux/fs.h:1521: error: `iocb' undeclared (first use in this function)
/usr/src/linux-2.6.11/include/linux/fs.h:1521: error: `inode' undeclared (first use in this function)
/usr/src/linux-2.6.11/include/linux/fs.h:1521: error: `bdev' undeclared (first use in this function)
/usr/src/linux-2.6.11/include/linux/fs.h:1521: error: `iov' undeclared (first use in this function)
/usr/src/linux-2.6.11/include/linux/fs.h:1521: error: `offset' undeclared (first use in this function)
/usr/src/linux-2.6.11/include/linux/fs.h:1522: error: `nr_segs' undeclared (first use in this function)
/usr/src/linux-2.6.11/include/linux/fs.h:1522: error: `get_blocks' undeclared (first use in this function)
/usr/src/linux-2.6.11/include/linux/fs.h:1522: error: `end_io' undeclared (first use in this function)
/usr/src/linux-2.6.11/include/linux/fs.h: At top level:
/usr/src/linux-2.6.11/include/linux/fs.h:1525: error: parse error before "blockdev_direct_IO_no_locking"
/usr/src/linux-2.6.11/include/linux/fs.h:1527: error: parse error before "loff_t"
/usr/src/linux-2.6.11/include/linux/fs.h: In function `blockdev_direct_IO_no_locking':
/usr/src/linux-2.6.11/include/linux/fs.h:1530: error: `rw' undeclared (first use in this function)
/usr/src/linux-2.6.11/include/linux/fs.h:1530: error: `iocb' undeclared (first use in this function)
/usr/src/linux-2.6.11/include/linux/fs.h:1530: error: `inode' undeclared (first use in this function)
/usr/src/linux-2.6.11/include/linux/fs.h:1530: error: `bdev' undeclared (first use in this function)
/usr/src/linux-2.6.11/include/linux/fs.h:1530: error: `iov' undeclared (first use in this function)
/usr/src/linux-2.6.11/include/linux/fs.h:1530: error: `offset' undeclared (first use in this function)
/usr/src/linux-2.6.11/include/linux/fs.h:1531: error: `nr_segs' undeclared (first use in this function)
/usr/src/linux-2.6.11/include/linux/fs.h:1531: error: `get_blocks' undeclared (first use in this function)
/usr/src/linux-2.6.11/include/linux/fs.h:1531: error: `end_io' undeclared (first use in this function)
/usr/src/linux-2.6.11/include/linux/fs.h: At top level:
/usr/src/linux-2.6.11/include/linux/fs.h:1534: error: parse error before "blockdev_direct_IO_own_locking"
/usr/src/linux-2.6.11/include/linux/fs.h:1536: error: parse error before "loff_t"
/usr/src/linux-2.6.11/include/linux/fs.h: In function `blockdev_direct_IO_own_locking':
/usr/src/linux-2.6.11/include/linux/fs.h:1539: error: `rw' undeclared (first use in this function)
/usr/src/linux-2.6.11/include/linux/fs.h:1539: error: `iocb' undeclared (first use in this function)
/usr/src/linux-2.6.11/include/linux/fs.h:1539: error: `inode' undeclared (first use in this function)
/usr/src/linux-2.6.11/include/linux/fs.h:1539: error: `bdev' undeclared (first use in this function)
/usr/src/linux-2.6.11/include/linux/fs.h:1539: error: `iov' undeclared (first use in this function)
/usr/src/linux-2.6.11/include/linux/fs.h:1539: error: `offset' undeclared (first use in this function)
/usr/src/linux-2.6.11/include/linux/fs.h:1540: error: `nr_segs' undeclared (first use in this function)
/usr/src/linux-2.6.11/include/linux/fs.h:1540: error: `get_blocks' undeclared (first use in this function)
/usr/src/linux-2.6.11/include/linux/fs.h:1540: error: `end_io' undeclared (first use in this function)
/usr/src/linux-2.6.11/include/linux/fs.h: At top level:
/usr/src/linux-2.6.11/include/linux/fs.h:1557: error: parse error before "loff_t"
/usr/src/linux-2.6.11/include/linux/fs.h:1558: error: parse error before "loff_t"
/usr/src/linux-2.6.11/include/linux/fs.h:1559: error: parse error before "inode_get_bytes"
/usr/src/linux-2.6.11/include/linux/fs.h:1560: error: parse error before "loff_t"
/usr/src/linux-2.6.11/include/linux/fs.h:1577: error: parse error before "dcache_dir_lseek"
/usr/src/linux-2.6.11/include/linux/fs.h:1577: error: parse error before "loff_t"
/usr/src/linux-2.6.11/include/linux/fs.h:1594: error: parse error before "generic_read_dir"
/usr/src/linux-2.6.11/include/linux/fs.h:1594: error: parse error before "size_t"
/usr/src/linux-2.6.11/include/linux/fs.h:1603: error: parse error before "simple_read_from_buffer"
/usr/src/linux-2.6.11/include/linux/fs.h:1603: error: parse error before "size_t"
/usr/src/linux-2.6.11/include/linux/fs.h:1610: error: parse error before "parent_ino"
/usr/src/linux-2.6.11/include/linux/fs.h: In function `parent_ino':
/usr/src/linux-2.6.11/include/linux/fs.h:1612: error: `ino_t' undeclared (first use in this function)
/usr/src/linux-2.6.11/include/linux/fs.h:1612: error: parse error before "res"
/usr/src/linux-2.6.11/include/linux/fs.h:1615: error: `res' undeclared (first use in this function)
/usr/src/linux-2.6.11/include/linux/fs.h:1615: error: dereferencing pointer to incomplete type
/usr/src/linux-2.6.11/include/linux/fs.h: At top level:
/usr/src/linux-2.6.11/include/linux/fs.h:1630: error: parse error before "ssize_t"
/usr/src/linux-2.6.11/include/linux/fs.h:1632: error: parse error before '}' token
/usr/src/linux-2.6.11/include/linux/fs.h:1637: error: parse error before "size_t"
/usr/src/linux-2.6.11/include/linux/fs.h:1638: error: parse error before "simple_transaction_read"
/usr/src/linux-2.6.11/include/linux/fs.h:1639: error: parse error before "size_t"
/usr/src/linux-2.6.11/include/linux/fs.h:1642: error: parse error before "size_t"
/usr/src/linux-2.6.11/include/linux/fs.h: In function `simple_transaction_set':
/usr/src/linux-2.6.11/include/linux/fs.h:1644: error: `file' undeclared (first use in this function)
/usr/src/linux-2.6.11/include/linux/fs.h:1646: error: `n' undeclared (first use in this function)
/usr/src/linux-2.6.11/include/linux/fs.h:1646: error: invalid application of `sizeof' to an incomplete type
/usr/src/linux-2.6.11/include/linux/fs.h:1653: error: dereferencing pointer to incomplete type
In file included from /usr/include/asm/pci.h:7,
                 from /usr/src/linux-2.6.11/include/linux/pci.h:903,
                 from rt_config.h:63,
                 from rtmp_main.c:38:
/usr/src/linux-2.6.11/include/linux/mm.h: At top level:
/usr/src/linux-2.6.11/include/linux/mm.h:245: error: parse error before "pgoff_t"
/usr/src/linux-2.6.11/include/linux/mm.h:263: error: parse error before '}' token
In file included from /usr/include/asm/pci.h:7,
                 from /usr/src/linux-2.6.11/include/linux/pci.h:903,
                 from rt_config.h:63,
                 from rtmp_main.c:38:
/usr/src/linux-2.6.11/include/linux/mm.h: In function `page_count':
/usr/src/linux-2.6.11/include/linux/mm.h:318: error: dereferencing pointer to incomplete type
/usr/src/linux-2.6.11/include/linux/mm.h:318: error: dereferencing pointer to incomplete type
/usr/src/linux-2.6.11/include/linux/mm.h:319: error: dereferencing pointer to incomplete type
/usr/src/linux-2.6.11/include/linux/mm.h:320: error: dereferencing pointer to incomplete type
/usr/src/linux-2.6.11/include/linux/mm.h: In function `get_page':
/usr/src/linux-2.6.11/include/linux/mm.h:325: error: dereferencing pointer to incomplete type
/usr/src/linux-2.6.11/include/linux/mm.h:325: error: dereferencing pointer to incomplete type
/usr/src/linux-2.6.11/include/linux/mm.h:326: error: dereferencing pointer to incomplete type
/usr/src/linux-2.6.11/include/linux/mm.h:327: error: dereferencing pointer to incomplete type
/usr/src/linux-2.6.11/include/linux/mm.h: In function `page_zonenum':
/usr/src/linux-2.6.11/include/linux/mm.h:409: error: dereferencing pointer to incomplete type
/usr/src/linux-2.6.11/include/linux/mm.h: In function `page_to_nid':
/usr/src/linux-2.6.11/include/linux/mm.h:413: error: dereferencing pointer to incomplete type
/usr/src/linux-2.6.11/include/linux/mm.h: In function `page_zone':
/usr/src/linux-2.6.11/include/linux/mm.h:421: error: dereferencing pointer to incomplete type
/usr/src/linux-2.6.11/include/linux/mm.h: In function `set_page_zone':
/usr/src/linux-2.6.11/include/linux/mm.h:426: error: dereferencing pointer to incomplete type
/usr/src/linux-2.6.11/include/linux/mm.h:427: error: dereferencing pointer to incomplete type
/usr/src/linux-2.6.11/include/linux/mm.h: In function `lowmem_page_address':
/usr/src/linux-2.6.11/include/linux/mm.h:437: error: arithmetic on pointer to an incomplete type
/usr/src/linux-2.6.11/include/linux/mm.h:437: error: arithmetic on pointer to an incomplete type
/usr/src/linux-2.6.11/include/linux/mm.h: In function `page_mapping':
/usr/src/linux-2.6.11/include/linux/mm.h:479: error: dereferencing pointer to incomplete type
/usr/src/linux-2.6.11/include/linux/mm.h:481: error: dereferencing pointer to incomplete type
/usr/src/linux-2.6.11/include/linux/mm.h:481: error: dereferencing pointer to incomplete type
/usr/src/linux-2.6.11/include/linux/mm.h: In function `PageAnon':
/usr/src/linux-2.6.11/include/linux/mm.h:490: error: dereferencing pointer to incomplete type
/usr/src/linux-2.6.11/include/linux/mm.h: At top level:
/usr/src/linux-2.6.11/include/linux/mm.h:497: error: parse error before "page_index"
/usr/src/linux-2.6.11/include/linux/mm.h: In function `page_index':
/usr/src/linux-2.6.11/include/linux/mm.h:499: error: dereferencing pointer to incomplete type
/usr/src/linux-2.6.11/include/linux/mm.h:499: error: dereferencing pointer to incomplete type
/usr/src/linux-2.6.11/include/linux/mm.h:500: error: dereferencing pointer to incomplete type
/usr/src/linux-2.6.11/include/linux/mm.h:501: error: dereferencing pointer to incomplete type
/usr/src/linux-2.6.11/include/linux/mm.h: In function `reset_page_mapcount':
/usr/src/linux-2.6.11/include/linux/mm.h:511: error: dereferencing pointer to incomplete type
/usr/src/linux-2.6.11/include/linux/mm.h: In function `page_mapcount':
/usr/src/linux-2.6.11/include/linux/mm.h:516: error: dereferencing pointer to incomplete type
/usr/src/linux-2.6.11/include/linux/mm.h: In function `page_mapped':
/usr/src/linux-2.6.11/include/linux/mm.h:524: error: dereferencing pointer to incomplete type
/usr/src/linux-2.6.11/include/linux/mm.h: At top level:
/usr/src/linux-2.6.11/include/linux/mm.h:560: error: parse error before "loff_t"
/usr/src/linux-2.6.11/include/linux/mm.h: In function `can_do_mlock':
/usr/src/linux-2.6.11/include/linux/mm.h:568: error: dereferencing pointer to incomplete type
/usr/src/linux-2.6.11/include/linux/mm.h: At top level:
/usr/src/linux-2.6.11/include/linux/mm.h:572: error: parse error before "struct"
/usr/src/linux-2.6.11/include/linux/mm.h:573: error: parse error before "struct"
/usr/src/linux-2.6.11/include/linux/mm.h:581: error: parse error before "pgoff_t"
/usr/src/linux-2.6.11/include/linux/mm.h:586: error: parse error before '}' token
/usr/src/linux-2.6.11/include/linux/mm.h:600: error: parse error before "loff_t"
/usr/src/linux-2.6.11/include/linux/mm.h:603: error: parse error before "loff_t"
/usr/src/linux-2.6.11/include/linux/mm.h: In function `unmap_shared_mapping_range':
/usr/src/linux-2.6.11/include/linux/mm.h:605: error: `mapping' undeclared (first use in this function)
/usr/src/linux-2.6.11/include/linux/mm.h:605: error: `holebegin' undeclared (first use in this function)
/usr/src/linux-2.6.11/include/linux/mm.h:605: error: `holelen' undeclared (first use in this function)
/usr/src/linux-2.6.11/include/linux/mm.h: At top level:
/usr/src/linux-2.6.11/include/linux/mm.h:608: error: parse error before "loff_t"
/usr/src/linux-2.6.11/include/linux/mm.h:716: error: parse error before "pgoff_t"
/usr/src/linux-2.6.11/include/linux/mm.h:719: error: parse error before "pgoff_t"
/usr/src/linux-2.6.11/include/linux/mm.h:728: error: parse error before "pgoff_t"
/usr/src/linux-2.6.11/include/linux/mm.h:731: error: `get_unmapped_area' redeclared as different kind of symbol
/usr/src/linux-2.6.11/include/linux/fs.h:946: error: previous declaration of `get_unmapped_area'
/usr/src/linux-2.6.11/include/linux/mm.h:750: error: parse error before "size_t"
/usr/src/linux-2.6.11/include/linux/mm.h:756: error: parse error before "loff_t"
/usr/src/linux-2.6.11/include/linux/mm.h:782: error: parse error before "pgoff_t"
In file included from /usr/src/linux-2.6.11/include/linux/pci.h:903,
                 from rt_config.h:63,
                 from rtmp_main.c:38:
/usr/include/asm/pci.h: In function `pci_dac_page_to_dma':
/usr/include/asm/pci.h:66: error: arithmetic on pointer to an incomplete type
/usr/include/asm/pci.h:66: error: arithmetic on pointer to an incomplete type
/usr/include/asm/pci.h: In function `pci_dac_dma_to_page':
/usr/include/asm/pci.h:73: error: invalid use of undefined type `struct page'
/usr/include/asm/pci.h: At top level:
/usr/include/asm/pci.h:83: error: parse error before "size_t"
/usr/include/asm/pci.h:88: error: parse error before "size_t"
In file included from /usr/src/linux-2.6.11/include/linux/dma-mapping.h:19,
                 from /usr/src/linux-2.6.11/include/asm-generic/pci-dma-compat.h:7,
                 from /usr/include/asm/pci.h:105,
                 from /usr/src/linux-2.6.11/include/linux/pci.h:903,
                 from rt_config.h:63,
                 from rtmp_main.c:38:
/usr/include/asm/dma-mapping.h:13: error: parse error before "size_t"
/usr/include/asm/dma-mapping.h:16: error: parse error before "size_t"
/usr/include/asm/dma-mapping.h:20: error: parse error before "size_t"
/usr/include/asm/dma-mapping.h: In function `dma_map_single':
/usr/include/asm/dma-mapping.h:23: error: `direction' undeclared (first use in this function)
/usr/include/asm/dma-mapping.h:25: error: `ptr' undeclared (first use in this function)
/usr/include/asm/dma-mapping.h: At top level:
/usr/include/asm/dma-mapping.h:29: error: parse error before "size_t"
/usr/include/asm/dma-mapping.h: In function `dma_unmap_single':
/usr/include/asm/dma-mapping.h:32: error: `direction' undeclared (first use in this function)
/usr/include/asm/dma-mapping.h: In function `dma_map_sg':
/usr/include/asm/dma-mapping.h:46: error: arithmetic on pointer to an incomplete type
/usr/include/asm/dma-mapping.h:46: error: arithmetic on pointer to an incomplete type
/usr/include/asm/dma-mapping.h: At top level:
/usr/include/asm/dma-mapping.h:55: error: parse error before "size_t"
/usr/include/asm/dma-mapping.h: In function `dma_map_page':
/usr/include/asm/dma-mapping.h:57: error: `direction' undeclared (first use in this function)
/usr/include/asm/dma-mapping.h:58: error: `page' undeclared (first use in this function)
/usr/include/asm/dma-mapping.h:58: error: `offset' undeclared (first use in this function)
/usr/include/asm/dma-mapping.h: At top level:
/usr/include/asm/dma-mapping.h:62: error: parse error before "size_t"
/usr/include/asm/dma-mapping.h: In function `dma_unmap_page':
/usr/include/asm/dma-mapping.h:65: error: `direction' undeclared (first use in this function)
/usr/include/asm/dma-mapping.h: At top level:
/usr/include/asm/dma-mapping.h:77: error: parse error before "size_t"
/usr/include/asm/dma-mapping.h:83: error: parse error before "size_t"
/usr/include/asm/dma-mapping.h:91: error: parse error before "size_t"
/usr/include/asm/dma-mapping.h:98: error: parse error before "size_t"
/usr/include/asm/dma-mapping.h:159: error: parse error before "size_t"
/usr/include/asm/dma-mapping.h:168: error: parse error before "size_t"
/usr/include/asm/dma-mapping.h:175: error: parse error before "size_t"
In file included from /usr/include/asm/pci.h:105,
                 from /usr/src/linux-2.6.11/include/linux/pci.h:903,
                 from rt_config.h:63,
                 from rtmp_main.c:38:
/usr/src/linux-2.6.11/include/asm-generic/pci-dma-compat.h:19: error: parse error before "size_t"
/usr/src/linux-2.6.11/include/asm-generic/pci-dma-compat.h: In function `pci_alloc_consistent':
/usr/src/linux-2.6.11/include/asm-generic/pci-dma-compat.h:22: error: `hwdev' undeclared (first use in this function)
/usr/src/linux-2.6.11/include/asm-generic/pci-dma-compat.h:22: error: `dma_handle' undeclared (first use in this function)
/usr/src/linux-2.6.11/include/asm-generic/pci-dma-compat.h: At top level:
/usr/src/linux-2.6.11/include/asm-generic/pci-dma-compat.h:26: error: parse error before "size_t"
/usr/src/linux-2.6.11/include/asm-generic/pci-dma-compat.h: In function `pci_free_consistent':
/usr/src/linux-2.6.11/include/asm-generic/pci-dma-compat.h:29: error: `hwdev' undeclared (first use in this function)
/usr/src/linux-2.6.11/include/asm-generic/pci-dma-compat.h:29: error: `vaddr' undeclared (first use in this function)
/usr/src/linux-2.6.11/include/asm-generic/pci-dma-compat.h:29: error: `dma_handle' undeclared (first use in this function)
/usr/src/linux-2.6.11/include/asm-generic/pci-dma-compat.h: At top level:
/usr/src/linux-2.6.11/include/asm-generic/pci-dma-compat.h:33: error: parse error before "size_t"
/usr/src/linux-2.6.11/include/asm-generic/pci-dma-compat.h: In function `pci_map_single':
/usr/src/linux-2.6.11/include/asm-generic/pci-dma-compat.h:35: error: `hwdev' undeclared (first use in this function)
/usr/src/linux-2.6.11/include/asm-generic/pci-dma-compat.h:35: error: `ptr' undeclared (first use in this function)
/usr/src/linux-2.6.11/include/asm-generic/pci-dma-compat.h:35: error: `direction' undeclared (first use in this function)
/usr/src/linux-2.6.11/include/asm-generic/pci-dma-compat.h: At top level:
/usr/src/linux-2.6.11/include/asm-generic/pci-dma-compat.h:40: error: parse error before "size_t"
/usr/src/linux-2.6.11/include/asm-generic/pci-dma-compat.h: In function `pci_unmap_single':
/usr/src/linux-2.6.11/include/asm-generic/pci-dma-compat.h:42: error: `hwdev' undeclared (first use in this function)
/usr/src/linux-2.6.11/include/asm-generic/pci-dma-compat.h:42: error: `dma_addr' undeclared (first use in this function)
/usr/src/linux-2.6.11/include/asm-generic/pci-dma-compat.h:42: error: `direction' undeclared (first use in this function)
/usr/src/linux-2.6.11/include/asm-generic/pci-dma-compat.h: At top level:
/usr/src/linux-2.6.11/include/asm-generic/pci-dma-compat.h:47: error: parse error before "size_t"
/usr/src/linux-2.6.11/include/asm-generic/pci-dma-compat.h: In function `pci_map_page':
/usr/src/linux-2.6.11/include/asm-generic/pci-dma-compat.h:49: error: `hwdev' undeclared (first use in this function)
/usr/src/linux-2.6.11/include/asm-generic/pci-dma-compat.h:49: error: `page' undeclared (first use in this function)
/usr/src/linux-2.6.11/include/asm-generic/pci-dma-compat.h:49: error: `offset' undeclared (first use in thisfunction)
/usr/src/linux-2.6.11/include/asm-generic/pci-dma-compat.h:49: error: `direction' undeclared (first use in this function)
/usr/src/linux-2.6.11/include/asm-generic/pci-dma-compat.h: At top level:
/usr/src/linux-2.6.11/include/asm-generic/pci-dma-compat.h:54: error: parse error before "size_t"
/usr/src/linux-2.6.11/include/asm-generic/pci-dma-compat.h: In function `pci_unmap_page':
/usr/src/linux-2.6.11/include/asm-generic/pci-dma-compat.h:56: error: `hwdev' undeclared (first use in this function)
/usr/src/linux-2.6.11/include/asm-generic/pci-dma-compat.h:56: error: `dma_address' undeclared (first use inthis function)
/usr/src/linux-2.6.11/include/asm-generic/pci-dma-compat.h:56: error: `direction' undeclared (first use in this function)
/usr/src/linux-2.6.11/include/asm-generic/pci-dma-compat.h: At top level:
/usr/src/linux-2.6.11/include/asm-generic/pci-dma-compat.h:75: error: parse error before "size_t"
/usr/src/linux-2.6.11/include/asm-generic/pci-dma-compat.h: In function `pci_dma_sync_single_for_cpu':
/usr/src/linux-2.6.11/include/asm-generic/pci-dma-compat.h:77: error: `hwdev' undeclared (first use in this function)
/usr/src/linux-2.6.11/include/asm-generic/pci-dma-compat.h:77: error: `dma_handle' undeclared (first use in this function)
/usr/src/linux-2.6.11/include/asm-generic/pci-dma-compat.h:77: error: `direction' undeclared (first use in this function)
/usr/src/linux-2.6.11/include/asm-generic/pci-dma-compat.h: At top level:
/usr/src/linux-2.6.11/include/asm-generic/pci-dma-compat.h:82: error: parse error before "size_t"
/usr/src/linux-2.6.11/include/asm-generic/pci-dma-compat.h: In function `pci_dma_sync_single_for_device':
/usr/src/linux-2.6.11/include/asm-generic/pci-dma-compat.h:84: error: `hwdev' undeclared (first use in this function)
/usr/src/linux-2.6.11/include/asm-generic/pci-dma-compat.h:84: error: `dma_handle' undeclared (first use in this function)
/usr/src/linux-2.6.11/include/asm-generic/pci-dma-compat.h:84: error: `direction' undeclared (first use in this function)
In file included from /usr/src/linux-2.6.11/include/linux/socket.h:25,
                 from /usr/src/linux-2.6.11/include/linux/if.h:23,
                 from /usr/src/linux-2.6.11/include/linux/netdevice.h:28,
                 from rt_config.h:64,
                 from rtmp_main.c:38:
/usr/src/linux-2.6.11/include/linux/uio.h: At top level:
/usr/src/linux-2.6.11/include/linux/uio.h:30: error: parse error before "size_t"
/usr/src/linux-2.6.11/include/linux/uio.h:30: warning: no semicolon at end of struct or union
/usr/src/linux-2.6.11/include/linux/uio.h:54: error: parse error before "iov_length"
/usr/src/linux-2.6.11/include/linux/uio.h:55: warning: return type defaults to `int'
/usr/src/linux-2.6.11/include/linux/uio.h: In function `iov_length':
/usr/src/linux-2.6.11/include/linux/uio.h:57: error: `size_t' undeclared (first use in this function)
/usr/src/linux-2.6.11/include/linux/uio.h:57: error: parse error before "ret"
/usr/src/linux-2.6.11/include/linux/uio.h:60: error: `ret' undeclared (first use in this function)
/usr/src/linux-2.6.11/include/linux/uio.h: At top level:
/usr/src/linux-2.6.11/include/linux/uio.h:64: error: parse error before "size_t"
/usr/src/linux-2.6.11/include/linux/uio.h:64: warning: function declaration isn't a prototype
In file included from /usr/src/linux-2.6.11/include/linux/skbuff.h:29,
                 from /usr/src/linux-2.6.11/include/linux/if_ether.h:107,
                 from /usr/src/linux-2.6.11/include/linux/netdevice.h:29,
                 from rt_config.h:64,
                 from rtmp_main.c:38:
/usr/src/linux-2.6.11/include/linux/net.h:152: error: parse error before "size_t"
/usr/src/linux-2.6.11/include/linux/net.h:152: warning: function declaration isn't a prototype
/usr/src/linux-2.6.11/include/linux/net.h:154: error: parse error before "size_t"
/usr/src/linux-2.6.11/include/linux/net.h:155: warning: function declaration isn't a prototype
/usr/src/linux-2.6.11/include/linux/net.h:158: error: parse error before "ssize_t"
/usr/src/linux-2.6.11/include/linux/net.h:158: warning: no semicolon at end of struct or union
/usr/src/linux-2.6.11/include/linux/net.h:187: error: parse error before "size_t"
/usr/src/linux-2.6.11/include/linux/net.h:187: warning: function declaration isn't a prototype
/usr/src/linux-2.6.11/include/linux/net.h:189: error: parse error before "size_t"
/usr/src/linux-2.6.11/include/linux/net.h:189: warning: function declaration isn't a prototype
/usr/src/linux-2.6.11/include/linux/net.h:199: error: parse error before "size_t"
/usr/src/linux-2.6.11/include/linux/net.h:199: warning: function declaration isn't a prototype
/usr/src/linux-2.6.11/include/linux/net.h:201: error: parse error before "size_t"
/usr/src/linux-2.6.11/include/linux/net.h:202: warning: function declaration isn't a prototype
In file included from /usr/src/linux-2.6.11/include/linux/if_ether.h:107,
                 from /usr/src/linux-2.6.11/include/linux/netdevice.h:29,
                 from rt_config.h:64,
                 from rtmp_main.c:38:
/usr/src/linux-2.6.11/include/linux/skbuff.h:199: error: field `stamp' has incomplete type
In file included from rt_config.h:64,
                 from rtmp_main.c:38:
/usr/src/linux-2.6.11/include/linux/netdevice.h: In function `netif_poll_disable':
/usr/src/linux-2.6.11/include/linux/netdevice.h:874: error: dereferencing pointer to incomplete type
In file included from rt_config.h:71,
                 from rtmp_main.c:38:
/usr/src/linux-2.6.11/include/linux/proc_fs.h: At top level:
/usr/src/linux-2.6.11/include/linux/proc_fs.h:44: error: parse error before "off_t"
/usr/src/linux-2.6.11/include/linux/proc_fs.h:45: warning: function declaration isn't a prototype
/usr/src/linux-2.6.11/include/linux/proc_fs.h:48: error: parse error before "off_t"
/usr/src/linux-2.6.11/include/linux/proc_fs.h:48: warning: function declaration isn't a prototype
/usr/src/linux-2.6.11/include/linux/proc_fs.h:54: error: parse error before "mode_t"
/usr/src/linux-2.6.11/include/linux/proc_fs.h:54: warning: no semicolon at end of struct or union
/usr/src/linux-2.6.11/include/linux/proc_fs.h:55: warning: type defaults to `int' in declaration of `nlink'
/usr/src/linux-2.6.11/include/linux/proc_fs.h:55: error: conflicting types for `nlink'
/usr/src/linux-2.6.11/include/linux/stat.h:63: error: previous declaration of `nlink'
/usr/src/linux-2.6.11/include/linux/proc_fs.h:55: warning: data definition has no type or storage class
/usr/src/linux-2.6.11/include/linux/proc_fs.h:56: error: parse error before "uid"
/usr/src/linux-2.6.11/include/linux/proc_fs.h:56: warning: type defaults to `int' in declaration of `uid'
/usr/src/linux-2.6.11/include/linux/proc_fs.h:56: warning: data definition has no type or storage class
/usr/src/linux-2.6.11/include/linux/proc_fs.h:57: error: parse error before "gid"
/usr/src/linux-2.6.11/include/linux/proc_fs.h:57: warning: type defaults to `int' in declaration of `gid'
/usr/src/linux-2.6.11/include/linux/proc_fs.h:57: warning: data definition has no type or storage class
/usr/src/linux-2.6.11/include/linux/proc_fs.h:58: error: conflicting types for `size'
/usr/src/linux-2.6.11/include/linux/stat.h:67: error: previous declaration of `size'
/usr/src/linux-2.6.11/include/linux/proc_fs.h:63: error: conflicting types for `parent'
/usr/src/linux-2.6.11/include/linux/sched.h:579: error: previous declaration of `parent'
/usr/src/linux-2.6.11/include/linux/proc_fs.h:64: error: conflicting types for `data'
/usr/src/linux-2.6.11/include/linux/fs.h:1631: error: previous declaration of `data'
/usr/src/linux-2.6.11/include/linux/proc_fs.h:67: error: conflicting types for `count'
/usr/src/linux-2.6.11/include/linux/fs.h:901: error: previous declaration of `count'
/usr/src/linux-2.6.11/include/linux/proc_fs.h:69: error: parse error before '}' token
/usr/src/linux-2.6.11/include/linux/proc_fs.h:74: error: parse error before "size_t"
/usr/src/linux-2.6.11/include/linux/proc_fs.h:74: warning: no semicolon at end of struct or union
/usr/src/linux-2.6.11/include/linux/proc_fs.h:100: error: parse error before "mode_t"
/usr/src/linux-2.6.11/include/linux/proc_fs.h:101: warning: function declaration isn't a prototype
/usr/src/linux-2.6.11/include/linux/proc_fs.h:149: error: parse error before "mode_t"
/usr/src/linux-2.6.11/include/linux/proc_fs.h:150: warning: function declaration isn't a prototype
/usr/src/linux-2.6.11/include/linux/proc_fs.h:153: error: parse error before "mode_t"
/usr/src/linux-2.6.11/include/linux/proc_fs.h:155: warning: function declaration isn't a prototype
/usr/src/linux-2.6.11/include/linux/proc_fs.h: In function `create_proc_read_entry':
/usr/src/linux-2.6.11/include/linux/proc_fs.h:156: error: `name' undeclared (first use in this function)
/usr/src/linux-2.6.11/include/linux/proc_fs.h:156: error: `base' undeclared (first use in this function)
/usr/src/linux-2.6.11/include/linux/proc_fs.h:158: error: dereferencing pointer to incomplete type
/usr/src/linux-2.6.11/include/linux/proc_fs.h:159: error: dereferencing pointer to incomplete type
/usr/src/linux-2.6.11/include/linux/proc_fs.h: At top level:
/usr/src/linux-2.6.11/include/linux/proc_fs.h:165: error: parse error before "mode_t"
/usr/src/linux-2.6.11/include/linux/proc_fs.h:166: warning: function declaration isn't a prototype
/usr/src/linux-2.6.11/include/linux/proc_fs.h: In function `create_proc_info_entry':
/usr/src/linux-2.6.11/include/linux/proc_fs.h:167: error: `name' undeclared (first use in this function)
/usr/src/linux-2.6.11/include/linux/proc_fs.h:167: error: `base' undeclared (first use in this function)
/usr/src/linux-2.6.11/include/linux/proc_fs.h:168: error: dereferencing pointer to incomplete type
/usr/src/linux-2.6.11/include/linux/proc_fs.h: At top level:
/usr/src/linux-2.6.11/include/linux/proc_fs.h:173: error: parse error before "mode_t"
/usr/src/linux-2.6.11/include/linux/proc_fs.h:174: warning: function declaration isn't a prototype
/usr/src/linux-2.6.11/include/linux/proc_fs.h: In function `proc_net_create':
/usr/src/linux-2.6.11/include/linux/proc_fs.h:175: error: `name' undeclared (first use in this function)
/usr/src/linux-2.6.11/include/linux/proc_fs.h: At top level:
/usr/src/linux-2.6.11/include/linux/proc_fs.h:179: error: parse error before "mode_t"
/usr/src/linux-2.6.11/include/linux/proc_fs.h:180: warning: function declaration isn't a prototype
/usr/src/linux-2.6.11/include/linux/proc_fs.h: In function `proc_net_fops_create':
/usr/src/linux-2.6.11/include/linux/proc_fs.h:181: error: `name' undeclared (first use in this function)
/usr/src/linux-2.6.11/include/linux/proc_fs.h:183: error: dereferencing pointer to incomplete type
/usr/src/linux-2.6.11/include/linux/proc_fs.h:183: error: `fops' undeclared (first use in this function)
/usr/src/linux-2.6.11/include/linux/proc_fs.h: At top level:
/usr/src/linux-2.6.11/include/linux/proc_fs.h:235: error: parse error before "size_t"
/usr/src/linux-2.6.11/include/linux/proc_fs.h:235: warning: function declaration isn't a prototype
/usr/src/linux-2.6.11/include/linux/proc_fs.h:246: error: field `vfs_inode' has incomplete type
/usr/src/linux-2.6.11/include/linux/proc_fs.h: In function `PROC_I':
/usr/src/linux-2.6.11/include/linux/proc_fs.h:251: warning: type defaults to `int' in declaration of `__mptr'
/usr/src/linux-2.6.11/include/linux/proc_fs.h:251: warning: initialization from incompatible pointer type
/usr/src/linux-2.6.11/include/linux/proc_fs.h:251: error: `size_t' undeclared (first use in this function)
rtmp_main.c: In function `RT2500_probe':
rtmp_main.c:163: warning: passing arg 1 of `readl' makes pointer from integer without a cast
rtmp_main.c:164: warning: passing arg 1 of `readl' makes pointer from integer without a cast
rtmp_main.c: In function `RTMPIsr':
rtmp_main.c:465: warning: passing arg 1 of `readl' makes pointer from integer without a cast
rtmp_main.c:466: warning: passing arg 2 of `writel' makes pointer from integer without a cast
rtmp_main.c: At top level:
/usr/src/linux-2.6.11/include/asm-generic/siginfo.h:59: error: storage size of `_pad' isn't known
/usr/src/linux-2.6.11/include/linux/sched.h:602: error: storage size of `start_time' isn't known
/usr/src/linux-2.6.11/include/linux/stat.h:68: error: storage size of `atime' isn't known
/usr/src/linux-2.6.11/include/linux/stat.h:69: error: storage size of `mtime' isn't known
/usr/src/linux-2.6.11/include/linux/stat.h:70: error: storage size of `ctime' isn't known
/usr/src/linux-2.6.11/include/linux/fs.h:278: error: storage size of `ia_atime' isn't known
/usr/src/linux-2.6.11/include/linux/fs.h:279: error: storage size of `ia_mtime' isn't known
/usr/src/linux-2.6.11/include/linux/fs.h:280: error: storage size of `ia_ctime' isn't known
/usr/src/linux-2.6.11/include/linux/quota.h:223: error: storage size of `dq_dqb' isn't known
/usr/src/linux-2.6.11/include/linux/fs.h:439: error: storage size of `i_atime' isn't known
/usr/src/linux-2.6.11/include/linux/fs.h:440: error: storage size of `i_mtime' isn't known
/usr/src/linux-2.6.11/include/linux/fs.h:441: error: storage size of `i_ctime' isn't known
/usr/src/linux-2.6.11/include/linux/fs.h:456: error: storage size of `i_data' isn't known
/usr/src/linux-2.6.11/include/linux/fs.h:586: error: storage size of `f_owner' isn't known
make: *** [rtmp_main.o] Error 1