mythtv@mythtv:~/mythtv-0.20-fixes/mythplugins$ make
cd mytharchive && make -f Makefile
make[1]: Entering directory `/home/mythtv/mythtv-0.20-fixes/mythplugins/mytharchive'
cd mytharchive && make -f Makefile
make[2]: Entering directory `/home/mythtv/mythtv-0.20-fixes/mythplugins/mytharchive/mytharchive'
g++ -c -pipe -march=pentiumpro -I/usr/include/kde/artsc -pthread -I/usr/include/glib-2.0 -I/usr/lib/glib-2.0/include -Wall -W -O3 -Wall -Wno-switch -fomit-frame-pointer -D_REENTRANT -DPIC -fPIC -D_GNU_SOURCE -DPREFIX=\"/usr/local\" -DMMX -Di386 -DUSING_DBOX2 -D_FILE_OFFSET_BITS=64 -DQT_NO_DEBUG -DQT_THREAD_SUPPORT -DQT_PLUGIN -DQT_SHARED -DQT_TABLET_SUPPORT -I/usr/share/qt3/mkspecs/default -I. -I/usr/local/include -I/usr/kde/3.3/include -I/usr/local/include -I/usr/local/include/mythtv -I/usr/include/qt3 -o main.o main.cpp
main.cpp:23:45: error: mythtv/libmythui/myththemedmenu.h: No such file or directory
main.cpp: In function void runVideoSelector():
main.cpp:227: error: MSqlQuery was not declared in this scope
main.cpp:227: error: expected `;' before query
main.cpp:228: error: query was not declared in this scope
main.cpp: In function void runSelectMenu(QString):
main.cpp:276: error: MythThemedMenu was not declared in this scope
main.cpp:276: error: diag was not declared in this scope
main.cpp:276: error: expected type-specifier before MythThemedMenu
main.cpp:276: error: expected `;' before MythThemedMenu
main.cpp:284: error: GetMythMainWindow was not declared in this scope
main.cpp: At global scope:
main.cpp:273: warning: unused parameter which_menu
main.cpp: In function void runFormatMenu(QString):
main.cpp:309: error: MythThemedMenu was not declared in this scope
main.cpp:309: error: diag was not declared in this scope
main.cpp:309: error: expected type-specifier before MythThemedMenu
main.cpp:309: error: expected `;' before MythThemedMenu
main.cpp:317: error: GetMythMainWindow was not declared in this scope
main.cpp: At global scope:
main.cpp:306: warning: unused parameter which_menu
main.cpp: In function void runMenu(QString):
main.cpp:343: error: MythThemedMenu was not declared in this scope
main.cpp:343: error: diag was not declared in this scope
main.cpp:343: error: expected type-specifier before MythThemedMenu
main.cpp:343: error: expected `;' before MythThemedMenu
main.cpp:352: error: GetMythMainWindow was not declared in this scope
main.cpp: At global scope:
main.cpp:339: warning: unused parameter which_menu
make[2]: *** [main.o] Error 1
make[2]: Leaving directory `/home/mythtv/mythtv-0.20-fixes/mythplugins/mytharchive/mytharchive'
make[1]: *** [sub-mytharchive] Error 2
make[1]: Leaving directory `/home/mythtv/mythtv-0.20-fixes/mythplugins/mytharchive'
make: *** [sub-mytharchive] Error 2