i686-pc-linux-gnu-gcc -DHAVE_CONFIG_H -I. -I. -I.. -I. -I../pixman/src -I/usr/include/libpng12 -I/usr/include/freetype2 -I/usr/include/freetype2 -Wall -Wpointer-arith -Wstrict-prototypes -Wmissing-prototypes -Wmissing-declarations -Wnested-externs -fno-strict-aliasing -march=i686 -O2 -pipe -MT cairo-glitz-surface.lo -MD -MP -MF .deps/cairo-glitz-surface.Tpo -c cairo-glitz-surface.c -fPIC -DPIC -o .libs/cairo-glitz-surface.o
cairo-glitz-surface.c: In function '_cairo_glitz_surface_get_image':
cairo-glitz-surface.c:152: error: 'glitz_format_t' has no member named 'type'
cairo-glitz-surface.c:152: error: 'GLITZ_FORMAT_TYPE_COLOR' undeclared (first use in this function)
cairo-glitz-surface.c:152: error: (Each undeclared identifier is reported only once
cairo-glitz-surface.c:152: error: for each function it appears in.)
cairo-glitz-surface.c: In function '_cairo_glitz_pattern_acquire_surface':
cairo-glitz-surface.c:501: warning: braces around scalar initializer
cairo-glitz-surface.c:501: warning: (near initialization for 'format.fourcc')
cairo-glitz-surface.c:503: warning: excess elements in scalar initializer
cairo-glitz-surface.c:503: warning: (near initialization for 'format.fourcc')
cairo-glitz-surface.c:504: warning: excess elements in scalar initializer
cairo-glitz-surface.c:504: warning: (near initialization for 'format.fourcc')
cairo-glitz-surface.c:505: warning: excess elements in scalar initializer
cairo-glitz-surface.c:505: warning: (near initialization for 'format.fourcc')
cairo-glitz-surface.c:507: warning: excess elements in scalar initializer
cairo-glitz-surface.c:507: warning: (near initialization for 'format.fourcc')
cairo-glitz-surface.c:508: warning: missing braces around initializer
cairo-glitz-surface.c:508: warning: (near initialization for 'format.masks')
make[2]: *** [cairo-glitz-surface.lo] Error 1
make[2]: Leaving directory `/var/tmp/portage/cairo-1.0.4/work/cairo-1.0.4/src'
make[1]: *** [all-recursive] Error 1
make[1]: Leaving directory `/var/tmp/portage/cairo-1.0.4/work/cairo-1.0.4'
make: *** [all] Error 2
!!! ERROR: x11-libs/cairo-1.0.4 failed.
Call stack:
ebuild.sh, line 1546: Called dyn_compile
ebuild.sh, line 937: Called src_compile
cairo-1.0.4.ebuild, line 42: Called die
!!! Compilation failed
!!! If you need support, post the topmost build error, and the call stack if relevant.