All pastes #1724856 Raw Edit

Untitled

public text v1 · immutable
#1724856 ·published 2009-12-23 14:21 UTC
rendered paste body
You should enable -g (or higher) for debugging!
>>> Unpacking source...
>>> Unpacking kdelibs-4.3.3.tar.bz2 to /var/tmp/portage/kde-base/kdelibs-4.3.3-r1/work
>>> Source unpacked in /var/tmp/portage/kde-base/kdelibs-4.3.3-r1/work
>>> Preparing source in /var/tmp/portage/kde-base/kdelibs-4.3.3-r1/work/kdelibs-4.3.3 ...
 [32;01m*[0m Applying 01_gentoo_set_xdg_menu_prefix.patch ...
[A[72C  [34;01m[ [32;01mok[34;01m ][0m
 [32;01m*[0m Applying 02_gentoo_append_xdg_config_dirs.patch ...
[A[72C  [34;01m[ [32;01mok[34;01m ][0m
 [32;01m*[0m Applying 23_solid_no_double_build.patch ...
[A[72C  [34;01m[ [32;01mok[34;01m ][0m
 [32;01m*[0m Applying kdelibs-4.3.3-glibc-2.11.patch ...
[A[72C  [34;01m[ [32;01mok[34;01m ][0m
 [32;01m*[0m Applying kdelibs-4.3.3-plasma-pixmap-cache.patch ...
[A[72C  [34;01m[ [32;01mok[34;01m ][0m
>>> Source prepared.
>>> Configuring source in /var/tmp/portage/kde-base/kdelibs-4.3.3-r1/work/kdelibs-4.3.3 ...
>>> Working in BUILD_DIR: "/var/tmp/portage/kde-base/kdelibs-4.3.3-r1/work/kdelibs-4.3.3_build"
cmake -C /var/tmp/portage/kde-base/kdelibs-4.3.3-r1/temp/gentoo_common_config.cmake -DCMAKE_INSTALL_PREFIX=/usr -DKDE4_BUILD_TESTS=OFF -DKDE_DISTRIBUTION_TEXT=Gentoo -DCMAKE_INSTALL_PREFIX=/usr -DSYSCONF_INSTALL_DIR=/etc -DWITH_Avahi=OFF -DWITH_DNSSD=OFF -DWITH_HSPELL=OFF -DKDE_DEFAULT_HOME=.kde4 -DBUILD_doc=ON -DHAVE_X86_3DNOW=OFF -DHAVE_PPC_ALTIVEC=OFF -DHAVE_X86_MMX=ON -DHAVE_X86_SSE=ON -DHAVE_X86_SSE2=ON -DWITH_acl=ON -DWITH_ACL=ON -DWITH_Acl=ON -DWITH_alsa=ON -DWITH_ALSA=ON -DWITH_Alsa=ON -DWITH_BZip2=ON -DWITH_fam=ON -DWITH_FAM=ON -DWITH_Fam=ON -DWITH_Jasper=ON -DWITH_GSSAPI=OFF -DWITH_LibLZMA=OFF -DWITH_Libintl=ON -DWITH_OpenEXR=OFF -DWITH_OpenGL=ON -DWITH_Soprano=ON -DWITH_ASPELL=ON -DWITH_ENCHANT=ON -DWITH_OpenSSL=ON -DCMAKE_BUILD_TYPE=Gentoo -DCMAKE_INSTALL_DO_STRIP=OFF -DCMAKE_USER_MAKE_RULES_OVERRIDE=/var/tmp/portage/kde-base/kdelibs-4.3.3-r1/temp/gentoo_rules.cmake /var/tmp/portage/kde-base/kdelibs-4.3.3-r1/work/kdelibs-4.3.3
loading initial cache file /var/tmp/portage/kde-base/kdelibs-4.3.3-r1/temp/gentoo_common_config.cmake
-- The C compiler identification is GNU
-- The CXX compiler identification is GNU
-- Check for working C compiler: /usr/lib/ccache/bin/i686-pc-linux-gnu-gcc
-- Check for working C compiler: /usr/lib/ccache/bin/i686-pc-linux-gnu-gcc -- works
-- Detecting C compiler ABI info
-- Detecting C compiler ABI info - done
-- Check for working CXX compiler: /usr/lib/ccache/bin/i686-pc-linux-gnu-g++
-- Check for working CXX compiler: /usr/lib/ccache/bin/i686-pc-linux-gnu-g++ -- works
-- Detecting CXX compiler ABI info
-- Detecting CXX compiler ABI info - done
-- Looking for Q_WS_X11
-- Looking for Q_WS_X11 - found
-- Looking for Q_WS_WIN
-- Looking for Q_WS_WIN - not found.
-- Looking for Q_WS_QWS
-- Looking for Q_WS_QWS - not found.
-- Looking for Q_WS_MAC
-- Looking for Q_WS_MAC - not found.
-- Found Qt-Version 4.5.3 (using /usr/bin/qmake)
-- Looking for XOpenDisplay in /usr/lib/libX11.so;/usr/lib/libXext.so;/usr/lib/libXft.so;/usr/lib/libXau.so;/usr/lib/libXdmcp.so;/usr/lib/libXpm.so
-- Looking for XOpenDisplay in /usr/lib/libX11.so;/usr/lib/libXext.so;/usr/lib/libXft.so;/usr/lib/libXau.so;/usr/lib/libXdmcp.so;/usr/lib/libXpm.so - found
-- Looking for gethostbyname
-- Looking for gethostbyname - found
-- Looking for connect
-- Looking for connect - found
-- Looking for remove
-- Looking for remove - found
-- Looking for shmat
-- Looking for shmat - found
-- Looking for IceConnectionNumber in ICE
-- Looking for IceConnectionNumber in ICE - found
-- Found X11: /usr/lib/libX11.so
-- Looking for include files CMAKE_HAVE_PTHREAD_H
-- Looking for include files CMAKE_HAVE_PTHREAD_H - found
-- Looking for pthread_create in pthreads
-- Looking for pthread_create in pthreads - not found
-- Looking for pthread_create in pthread
-- Looking for pthread_create in pthread - found
-- Found Threads: TRUE
-- Found Automoc4: /usr/bin/automoc4
-- Found Perl: /usr/bin/perl
-- Building kdelibs...
-- Phonon Version: 4.3.50
-- Found Phonon: /usr/lib/libphonon.so
-- Found Phonon Includes: /usr/include/KDE;/usr/include
-- Performing Test _OFFT_IS_64BIT
-- Performing Test _OFFT_IS_64BIT - Failed
-- Performing Test HAVE_FPIE_SUPPORT
-- Performing Test HAVE_FPIE_SUPPORT - Success
-- Performing Test __KDE_HAVE_W_OVERLOADED_VIRTUAL
-- Performing Test __KDE_HAVE_W_OVERLOADED_VIRTUAL - Success
-- Performing Test __KDE_HAVE_GCC_VISIBILITY
-- Performing Test __KDE_HAVE_GCC_VISIBILITY - Success
-- Found the KDE4 kconfig_compiler preprocessor: /var/tmp/portage/kde-base/kdelibs-4.3.3-r1/work/kdelibs-4.3.3_build/bin/./kconfig_compiler.shell
-- Found automoc4: /usr/bin/automoc4
-- CTest cannot determine repository type. Please set UPDATE_TYPE to 'cvs' or 'svn'. CTest update will not work.
-- Found ZLIB: /lib/libz.so
-- Strigi API needs 'signed char'
-- Found Strigi: /usr/lib/libstreams.so
-- Found BZip2: /lib/libbz2.so
-- Looking for BZ2_bzCompressInit in /lib/libbz2.so
-- Looking for BZ2_bzCompressInit in /lib/libbz2.so - found
-- Found OpenSSL: /usr/lib/libssl.so
-- Looking for dgettext
-- Looking for dgettext - found
-- Found Libintl: /usr/include
-- Found Soprano version 2.3.1: /usr/lib/libsoprano.so
-- Found Soprano includes: /usr/include
-- Found Soprano Index: /usr/lib/libsopranoindex.so
-- Found Soprano Client: /usr/lib/libsopranoclient.so
-- Found Soprano Plugin Dir: /usr/share/soprano/plugins
-- Found Soprano Plugins: nquadparser nquadserializer raptorparser sesame2backend
-- Looking for include files HAVE_ATTR_LIBATTR_H
-- Looking for include files HAVE_ATTR_LIBATTR_H - found
-- Looking for include files HAVE_SYS_XATTR_H
-- Looking for include files HAVE_SYS_XATTR_H - found
-- Looking for include files HAVE_SYS_ACL_H
-- Looking for include files HAVE_SYS_ACL_H - found
-- Looking for include files HAVE_ACL_LIBACL_H
-- Looking for include files HAVE_ACL_LIBACL_H - found
-- Found ACL support: /lib/libacl.so;/lib/libattr.so
-- Looking for include files HAVE_STDIO_H
-- Looking for include files HAVE_STDIO_H - found
-- Looking for include files HAVE_STDLIB_H
-- Looking for include files HAVE_STDLIB_H - found
-- Looking for include files HAVE_STRING_H
-- Looking for include files HAVE_STRING_H - found
-- Looking for include files HAVE_STRINGS_H
-- Looking for include files HAVE_STRINGS_H - found
-- Looking for include files HAVE_MALLOC_H
-- Looking for include files HAVE_MALLOC_H - found
-- Looking for include files HAVE_DLFCN_H
-- Looking for include files HAVE_DLFCN_H - found
-- Looking for include files TIME_WITH_SYS_TIME
-- Looking for include files TIME_WITH_SYS_TIME - found
-- Looking for include files HAVE_CRT_EXTERNS_H
-- Looking for include files HAVE_CRT_EXTERNS_H - not found.
-- Looking for include files HAVE_ALLOCA_H
-- Looking for include files HAVE_ALLOCA_H - found
-- Looking for include files HAVE_FSTAB_H
-- Looking for include files HAVE_FSTAB_H - found
-- Looking for include files HAVE_LIMITS_H
-- Looking for include files HAVE_LIMITS_H - found
-- Looking for include files HAVE_MNTENT_H
-- Looking for include files HAVE_MNTENT_H - found
-- Looking for include files HAVE_SYSENT_H
-- Looking for include files HAVE_SYSENT_H - not found.
-- Looking for include files HAVE_SYS_MMAN_H
-- Looking for include files HAVE_SYS_MMAN_H - found
-- Looking for include files HAVE_SYS_STAT_H
-- Looking for include files HAVE_SYS_STAT_H - found
-- Looking for include files HAVE_SYS_UCRED_H
-- Looking for include files HAVE_SYS_UCRED_H - not found.
-- Looking for include files HAVE_SYS_TYPES_H
-- Looking for include files HAVE_SYS_TYPES_H - found
-- Looking for include files HAVE_SYS_SELECT_H
-- Looking for include files HAVE_SYS_SELECT_H - found
-- Looking for include files HAVE_SYS_PARAM_H
-- Looking for include files HAVE_SYS_PARAM_H - found
-- Looking for include files HAVE_SYS_MNTTAB_H
-- Looking for include files HAVE_SYS_MNTTAB_H - not found.
-- Looking for include files HAVE_SYS_MNTENT_H
-- Looking for include files HAVE_SYS_MNTENT_H - not found.
-- Looking for include files HAVE_SYS_MOUNT_H
-- Looking for include files HAVE_SYS_MOUNT_H - found
-- Looking for include files HAVE_UNISTD_H
-- Looking for include files HAVE_UNISTD_H - found
-- Looking for include files HAVE_STDINT_H
-- Looking for include files HAVE_STDINT_H - found
-- Looking for include files HAVE_NETINET_IN_H
-- Looking for include files HAVE_NETINET_IN_H - found
-- Looking for include files HAVE_PATHS_H
-- Looking for include files HAVE_PATHS_H - found
-- Looking for include files HAVE_ERRNO_H
-- Looking for include files HAVE_ERRNO_H - found
-- Looking for include files HAVE_SYS_TIME_H
-- Looking for include files HAVE_SYS_TIME_H - found
-- Looking for include files HAVE_VALGRIND_MEMCHECK_H
-- Looking for include files HAVE_VALGRIND_MEMCHECK_H - found
-- Looking for include files HAVE_CRTDBG_H
-- Looking for include files HAVE_CRTDBG_H - not found.
-- Looking for include files HAVE_LANGINFO_H
-- Looking for include files HAVE_LANGINFO_H - found
-- Looking for include files HAVE_ARPA_NAMESER8_COMPAT_H
-- Looking for include files HAVE_ARPA_NAMESER8_COMPAT_H - not found.
-- Looking for strcmp
-- Looking for strcmp - found
-- Looking for strrchr
-- Looking for strrchr - found
-- Looking for strtoll
-- Looking for strtoll - found
-- Looking for S_ISSOCK
-- Looking for S_ISSOCK - found
-- Looking for vsnprintf
-- Looking for vsnprintf - found
-- Looking for posix_madvise
-- Looking for posix_madvise - found
-- Looking for posix_fadvise
-- Looking for posix_fadvise - found
-- Looking for backtrace
-- Looking for backtrace - found
-- Looking for getpagesize
-- Looking for getpagesize - found
-- Looking for getpeereid
-- Looking for getpeereid - not found
-- Looking for fdatasync
-- Looking for fdatasync - found
-- Looking for mmap
-- Looking for mmap - found
-- Looking for readdir_r
-- Looking for readdir_r - found
-- Looking for sendfile
-- Looking for sendfile - found
-- Looking for setlocale
-- Looking for setlocale - found
-- Looking for srandom
-- Looking for srandom - found
-- Looking for _NSGetEnviron
-- Looking for _NSGetEnviron - not found
-- Looking for gettimeofday
-- Looking for gettimeofday - found
-- Looking for getgrouplist
-- Looking for getgrouplist - found
-- Looking for volmgt_running in volmgt
-- Looking for volmgt_running in volmgt - not found
-- Looking for res_init in resolv
-- Looking for res_init in resolv - not found
-- Looking for __res_init in resolv
-- Looking for __res_init in resolv - found
-- Looking for include files HAVE_LIBUTIL_H
-- Looking for include files HAVE_LIBUTIL_H - not found.
-- Looking for include files HAVE_UTIL_H
-- Looking for include files HAVE_UTIL_H - not found.
-- Looking for include files HAVE_TERMIOS_H
-- Looking for include files HAVE_TERMIOS_H - found
-- Looking for include files HAVE_TERMIO_H
-- Looking for include files HAVE_TERMIO_H - found
-- Looking for include files HAVE_PTY_H
-- Looking for include files HAVE_PTY_H - found
-- Looking for include files HAVE_SYS_STROPTS_H
-- Looking for include files HAVE_SYS_STROPTS_H - found
-- Looking for include files HAVE_SYS_FILIO_H
-- Looking for include files HAVE_SYS_FILIO_H - not found.
-- Looking for addToUtmp in utempter
-- Looking for addToUtmp in utempter - found
-- Looking for include files HAVE_UTEMPTER_H
-- Looking for include files HAVE_UTEMPTER_H - found
-- Looking for openpty
-- Looking for openpty - not found
-- Looking for openpty in util
-- Looking for openpty in util - found
-- Looking for ptsname
-- Looking for ptsname - found
-- Looking for getmntinfo
-- Looking for getmntinfo - not found
-- Looking for initgroups
-- Looking for initgroups - found
-- Looking for mkstemps
-- Looking for mkstemps - not found
-- Looking for mkstemp
-- Looking for mkstemp - found
-- Looking for mkdtemp
-- Looking for mkdtemp - found
-- Looking for random
-- Looking for random - found
-- Looking for strlcpy
-- Looking for strlcpy - not found
-- Looking for strlcat
-- Looking for strlcat - not found
-- Looking for __CORRECT_ISO_CPP_STRING_H_PROTO
-- Looking for __CORRECT_ISO_CPP_STRING_H_PROTO - not found.
-- Looking for strcasestr
-- Looking for strcasestr - found
-- Performing Test HAVE_STRCASESTR_PROTO
-- Performing Test HAVE_STRCASESTR_PROTO - Success
-- Looking for setenv
-- Looking for setenv - found
-- Looking for seteuid
-- Looking for seteuid - found
-- Looking for setmntent
-- Looking for setmntent - found
-- Looking for unsetenv
-- Looking for unsetenv - found
-- Looking for usleep
-- Looking for usleep - found
-- Performing Test HAVE_MKSTEMPS_PROTO
-- Performing Test HAVE_MKSTEMPS_PROTO - Failed
-- Performing Test HAVE_MKDTEMP_PROTO
-- Performing Test HAVE_MKDTEMP_PROTO - Success
-- Performing Test HAVE_MKSTEMP_PROTO
-- Performing Test HAVE_MKSTEMP_PROTO - Success
-- Performing Test HAVE_STRLCAT_PROTO
-- Performing Test HAVE_STRLCAT_PROTO - Failed
-- Performing Test HAVE_STRLCPY_PROTO
-- Performing Test HAVE_STRLCPY_PROTO - Failed
-- Performing Test HAVE_RANDOM_PROTO
-- Performing Test HAVE_RANDOM_PROTO - Success
-- Performing Test HAVE_RES_INIT_PROTO
-- Performing Test HAVE_RES_INIT_PROTO - Success
-- Performing Test HAVE_SETENV_PROTO
-- Performing Test HAVE_SETENV_PROTO - Success
-- Performing Test HAVE_SRANDOM_PROTO
-- Performing Test HAVE_SRANDOM_PROTO - Success
-- Performing Test HAVE_UNSETENV_PROTO
-- Performing Test HAVE_UNSETENV_PROTO - Success
-- Performing Test HAVE_USLEEP_PROTO
-- Performing Test HAVE_USLEEP_PROTO - Success
-- Performing Test HAVE_INITGROUPS_PROTO
-- Performing Test HAVE_INITGROUPS_PROTO - Success
-- Performing Test HAVE_SETREUID_PROTO
-- Performing Test HAVE_SETREUID_PROTO - Success
-- Performing Test HAVE_SETEUID_PROTO
-- Performing Test HAVE_SETEUID_PROTO - Success
-- Performing Test HAVE_TRUNC
-- Performing Test HAVE_TRUNC - Success
-- Looking for stddef.h
-- Looking for stddef.h - found
-- Check size of struct ucred
-- Check size of struct ucred - done
-- Check size of time_t
-- Check size of time_t - done
-- Performing Test GETMNTINFO_USES_STATVFS
-- Performing Test GETMNTINFO_USES_STATVFS - Failed
-- Performing Test HAVE_STRUCT_TM_TM_ZONE
-- Performing Test HAVE_STRUCT_TM_TM_ZONE - Success
-- Performing Test HAVE_TM_GMTOFF
-- Performing Test HAVE_TM_GMTOFF - Success
-- Performing Test HAVE_DIRENT_D_TYPE
-- Performing Test HAVE_DIRENT_D_TYPE - Success
-- Check if the system is big endian
-- Searching 16 bit integer
-- Check size of unsigned short
-- Check size of unsigned short - done
-- Using unsigned short
-- Check if the system is big endian - little endian
-- Looking for gethostbyname in nsl
-- Looking for gethostbyname in nsl - found
-- Looking for connect in socket
-- Looking for connect in socket - not found
-- Performing Test HAVE_QSSLSOCKET
-- Performing Test HAVE_QSSLSOCKET - Success
-- Looking for include files HAVE_NET_IF_H
-- Looking for include files HAVE_NET_IF_H - found
-- Looking for include files HAVE_STROPTS_H
-- Looking for include files HAVE_STROPTS_H - found
-- Looking for inet_pton
-- Looking for inet_pton - found
-- Looking for inet_ntop
-- Looking for inet_ntop - found
-- Looking for getprotobyname_r
-- Looking for getprotobyname_r - found
-- Looking for poll
-- Looking for poll - found
-- Looking for getservbyname_r
-- Looking for getservbyname_r - found
-- Looking for getservbyport_r
-- Looking for getservbyport_r - found
-- Looking for gethostbyname2
-- Looking for gethostbyname2 - found
-- Looking for gethostbyname2_r
-- Looking for gethostbyname2_r - found
-- Looking for gethostbyname
-- Looking for gethostbyname - found
-- Looking for gethostbyname_r
-- Looking for gethostbyname_r - found
-- Looking for if_nametoindex
-- Looking for if_nametoindex - found
-- Performing Test HAVE_GETSERVBYNAME_R_PROTO
-- Performing Test HAVE_GETSERVBYNAME_R_PROTO - Success
-- Looking for freeaddrinfo
-- Looking for freeaddrinfo - found
-- Looking for getnameinfo
-- Looking for getnameinfo - found
-- Looking for getaddrinfo
-- Looking for getaddrinfo - found
-- Looking for res_init
-- Looking for res_init - found
-- Performing Test HAVE_STRUCT_SOCKADDR_SA_LEN
-- Performing Test HAVE_STRUCT_SOCKADDR_SA_LEN - Failed
-- Performing Test HAVE_GAI_STRERROR_PROTO
-- Performing Test HAVE_GAI_STRERROR_PROTO - Success
-- Check size of struct addrinfo
-- Check size of struct addrinfo - done
-- Check size of struct sockaddr_in6
-- Check size of struct sockaddr_in6 - done
-- Looking for pthread_attr_get_np in pthread
-- Looking for pthread_attr_get_np in pthread - not found
-- Looking for pthread_getattr_np in pthread
-- Looking for pthread_getattr_np in pthread - found
-- Looking for include files HAVE_FLOAT_H
-- Looking for include files HAVE_FLOAT_H - found
-- Looking for include files HAVE_SYS_TIMEB_H
-- Looking for include files HAVE_SYS_TIMEB_H - found
-- Looking for include files HAVE_IEEEFP_H
-- Looking for include files HAVE_IEEEFP_H - not found.
-- Looking for include files HAVE_PTHREAD_NP_H
-- Looking for include files HAVE_PTHREAD_NP_H - not found.
-- Looking for include files HAVE_MEMCHECK_H
-- Looking for include files HAVE_MEMCHECK_H - found
-- Looking for _finite
-- Looking for _finite - not found
-- Looking for finite
-- Looking for finite - found
-- Looking for posix_memalign
-- Looking for posix_memalign - found
-- Looking for isnan
-- Looking for isnan - found
-- Looking for isinf
-- Looking for isinf - found
--   found libpcre, version 7.9
-- Found PCRE: /usr/include
-- Looking for PCRE_CONFIG_UTF8
-- Looking for PCRE_CONFIG_UTF8 - found
-- Looking for PCRE_CONFIG_STACKRECURSE
-- Looking for PCRE_CONFIG_STACKRECURSE - found
-- Found FAM: /usr/include
-- Looking for include files SYS_INOTIFY_H_FOUND
-- Looking for include files SYS_INOTIFY_H_FOUND - found
-- -- Building Solid HAL backend.
-- Found Flex: /usr/bin/flex 2.5.35
--   found libxslt, version 1.1.24
-- Found LibXslt: /usr/lib/libxslt.so
--   found libxml-2.0, version 2.7.3
-- Found LibXml2: /usr/lib/libxml2.so
-- Found shared-mime-info version: 0.60
-- Looking for __progname
-- Looking for __progname - found
-- Looking for __progname_full
-- Looking for __progname_full - found
-- Looking for include files HAVE_SYS_PSTAT_H
-- Looking for include files HAVE_SYS_PSTAT_H - not found.
-- Looking for pstat
-- Looking for pstat - not found
-- Looking for setproctitle
-- Looking for setproctitle - not found
-- Found ASPELL: /usr/lib/libaspell.so
--   found enchant, version 1.4.2
-- Found ENCHANT: /usr/include/enchant
-- Found JPEG: /usr/lib/libjpeg.so
-- Performing Test GIF_FOUND
-- Performing Test GIF_FOUND - Success
-- Found GIF: /usr/lib/libgif.so
-- Found PNG: /usr/lib/libpng.so
-- Found Jasper: /usr/lib/libjasper.so
-- Adding support for OpenGL applets to libplasma
-- Adding support for Phonon to libplasma

-----------------------------------------------------------------------------
-- The following external packages were located on your system.
-- This installation will have the extra features provided by these packages.
-----------------------------------------------------------------------------
   * Perl - Practical Extraction and Report Language
   * ZLib - The Zlib compression library
   * Strigi - A fast and small desktop searching program
   * X Rendering extension - an X Window System extension for image compositing
   * BZip2 - A high-quality data compressor
   * OpenSSL - A toolkit implementing the Secure Sockets Layer (SSL v2/v3) and Transport Layer Security (TLS v1) protocols
   * Libintl - Library for message translation
   * OpenGL - API for developing portable, interactive 2D and 3D graphics applications
   * Soprano - Semantic Desktop Storing
   * LibACL - Access control list (ACL) support library
   * PCRE - Perl Compatible Regular Expression
   * FAM - File Alteration Monitor
   * Flex - Fast lexical analyser generator
   * Bison - Project parser generator (yacc replacement)
   * LibXSLT - A library to transform XML files into other XML files
   * LibXML2 - Libraries used to develop XML applications
   * shared-mime-info - The core MIME database used to represent types of files
   * Aspell - GNU Aspell spell checker
   * Enchant - Enchant Package
   * libjpeg - A library for reading and writing JPEG image files
   * giflib - A library for manipulating GIF format image files
   * libpng - A library for manipulating PNG image format files
   * JasPer - JasPer JPEG2000 Library

-----------------------------------------------------------------------------
-- The following OPTIONAL packages could NOT be located on your system.
-- Consider installing them to enable more features from this software.
-----------------------------------------------------------------------------
   * LZMA/XZ  <http://tukaani.org/xz/>
     A very high compression ratio data compressor
     Provides the ability to read and write xz compressed data files.
   * GSSAPI  <http://web.mit.edu/kerberos/www>
     Generic Security Services API
     A MIT or HEIMDAL flavor of GSSAPI to provide HTTP authentication services.
   * HSpell  <http://ivrix.org.il/projects/spell-checker/>
     Hebrew spell checker
     Provides spell checking for Hebrew.
   * OpenEXR  <http://www.openexr.com/>
     OpenEXR Package
     High dynamic range image manipulation library.
   * Avahi  <http://avahi.org>
     For Linux and BSDs: a system which facilitates service discovery on a local network, based on the Zeroconf standard
     Enables KDE applications access to multicast DNS/DNS-SD service discovery.
   * DNSSD  <http://www.zeroconf.org>
     For MacOS and platforms without Avahi: A system which facilitates service discovery on a local network, based on the Zeroconf standard
     Enables KDE applications access to multicast DNS/DNS-SD service discovery.

-----------------------------------------------------------------------------

-- <<< Gentoo configuration >>>
Build type: Gentoo
Install path: /usr

-- Configuring done
-- Generating done
-- Build files have been written to: /var/tmp/portage/kde-base/kdelibs-4.3.3-r1/work/kdelibs-4.3.3_build
>>> Source configured.
>>> Compiling source in /var/tmp/portage/kde-base/kdelibs-4.3.3-r1/work/kdelibs-4.3.3 ...
>>> Working in BUILD_DIR: "/var/tmp/portage/kde-base/kdelibs-4.3.3-r1/work/kdelibs-4.3.3_build"
make -j3 
[35m[1mScanning dependencies of target kdeui_automoc
[0m[35m[1mScanning dependencies of target kdecore_automoc
[0m[35m[1mScanning dependencies of target nepomuk-rcgen_automoc
[0m[  0%] Built target nepomuk-rcgen_automoc
[35m[1mScanning dependencies of target nepomuk_automoc
[0m[34m[1mGenerating kratingwidget.moc
[0m[34m[1mGenerating k3datagramsocket.moc
[0m[34m[1mGenerating kcharselect.moc
[0m[34m[1mGenerating kjob.moc
[0m[34m[1mGenerating klauncher_iface.moc
[0m[34m[1mGenerating resourcefiltermodel.moc
[0m[34m[1mGenerating moc_kfontcombobox.moc
[0m[34m[1mGenerating nepomukmassupdatejob.moc
[0m[34m[1mGenerating kprocess.moc
[0m[34m[1mGenerating kautoscrollarea.moc
[0m[34m[1mGenerating kcolordialog.moc
[0m[34m[1mGenerating k3socketbase.moc
[0m[34m[1mGenerating ksycoca.moc
[0m[34m[1mGenerating k3reverseresolver.moc
[0m[34m[1mGenerating resourcedata.moc
[0m[34m[1mGenerating kcompositejob.moc
[0m[34m[1mGenerating backgroundengine_p.moc
[0m[34m[1mGenerating resourcemanager.moc
[0m[34m[1mGenerating k3bufferedsocket.moc
[0m[34m[1mGenerating nepomukmainmodel.moc
[0m[34m[1mGenerating kssld/kssld_interface.moc
[0m[34m[1mGenerating ktoggletoolbaraction.moc
[0m[34m[1mGenerating kmetadatatagwidget.moc
[0m[34m[1mGenerating kselectaction.moc
[0m[34m[1mGenerating kdedmodule.moc
[0m[34m[1mGenerating ktagcloudwidget.moc
[0m[34m[1mGenerating k3streamsocket.moc
[0m[34m[1mGenerating klibloader.moc
[0m[34m[1mGenerating kacceleratormanager_private.moc
[0m[34m[1mGenerating kdebugdbusiface_p.moc
[0m[34m[1mGenerating nepomukservice.moc
[0m[34m[1mGenerating kconfigbackend.moc
[0m[34m[1mGenerating kglobalsettings.moc
[0m[34m[1mGenerating graphwrapper_p.moc
[0m[34m[1mGenerating kmetadatatagcloud.moc
[0m[34m[1mGenerating k3resolver.moc
[0m[34m[1mGenerating kplotwidget.moc
[0m[34m[1mGenerating klibrary.moc
[0m[34m[1mGenerating kjobtrackerinterface.moc
[0m[34m[1mGenerating ktagdisplaywidget.moc
[0m[34m[1mGenerating ktcpsocket.moc
[0m[34m[1mGenerating kdatepicker_p.moc
[0m[34m[1mGenerating kjobuidelegate.moc
[0m[  0%] Built target nepomuk_automoc
[35m[1mScanning dependencies of target nepomuk_testbase_automoc
[0m[34m[1mGenerating ktoolinvocation.moc
[0m[34m[1mGenerating testbase.moc
[0m[34m[1mGenerating client_p.moc
[0m[34m[1mGenerating ktoggleaction.moc
[0m[34m[1mGenerating loader_p.moc
[0m[34m[1mGenerating qtest_kde.moc
[0m[34m[1mGenerating kcompletion.moc
[0m[  0%] Built target nepomuk_testbase_automoc
[35m[1mScanning dependencies of target resourcetest_automoc
[0m[34m[1mGenerating knotificationmanager_p.moc
[0m[34m[1mGenerating resourcetest.moc
[0m[34m[1mGenerating k3serversocket.moc
[0m[34m[1mGenerating kcoreconfigskeleton.moc
[0m[34m[1mGenerating kstatusbarjobtracker_p.moc
[0m[34m[1mGenerating kpluginloader.moc
[0m[34m[1mGenerating kautostart.moc
[0m[34m[1mGenerating k3clientsocketbase.moc
[0m[  0%] Built target resourcetest_automoc
[34m[1mGenerating klocalsocket.moc
[0m[35m[1mScanning dependencies of target speedtest_automoc
[0m[34m[1mGenerating speedtest.moc
[0m[34m[1mGenerating kcmodule.moc
[0m[  0%] Built target speedtest_automoc
[34m[1mGenerating kpluginfactory.moc
[0m[35m[1mScanning dependencies of target KDECMakeModulesManPage
[0m[  0%] Built target KDECMakeModulesManPage
[35m[1mScanning dependencies of target kde4-config_automoc
[0m[34m[1mGenerating kdatetimewidget.moc
[0m[34m[1mGenerating ksystemtimezone.moc
[0m[  0%] Built target kde4-config_automoc
[35m[1mScanning dependencies of target kdefakes
[34m[1mGenerating backgroundchecker.moc
[0m[0m[  0%] [32mBuilding C object kdecore/CMakeFiles/kdefakes.dir/fakes.o
[0m[34m[1mGenerating kautosavefile.moc
[0m[34m[1mGenerating kshortcutwidget.moc
[0m[  0%] Built target kdecore_automoc
[35m[1mScanning dependencies of target kjs_automoc
[0m[31m[1mLinking C shared library ../lib/libkdefakes.so
[0m[34m[1mGenerating kglobalaccel.moc
[0m[  0%] Built target kdefakes
[  0%] Built target kjs_automoc
[35m[1mScanning dependencies of target icemaker_automoc
[0m[35m[1mScanning dependencies of target ktranscript_automoc
[0m[  0%] [  0%] Built target icemaker_automoc
Built target ktranscript_automoc
[35m[1mScanning dependencies of target klibloadertestmodule_automoc
[0m[35m[1mScanning dependencies of target kconfig_compiler_automoc
[0m[  0%] Built target klibloadertestmodule_automoc
[35m[1mScanning dependencies of target klibloadertestmodule4_automoc
[0m[  0%] Built target kconfig_compiler_automoc
[  0%] [35m[1mScanning dependencies of target solid_automoc
[0m[34m[1mGenerating ktitlewidget.moc
[0mBuilt target klibloadertestmodule4_automoc
[35m[1mScanning dependencies of target kio_automoc
[0m[34m[1mGenerating backends/fakehw/fakegenericinterface.moc
[0m[34m[1mGenerating backends/hal/halacadapter.moc
[0m[34m[1mGenerating kprogressdialog.moc
[0m[34m[1mGenerating backends/fakehw/fakebattery.moc
[0m[34m[1mGenerating backends/fakehw/fakebutton.moc
[0m[34m[1mGenerating backends/fakehw/fakedeviceinterface.moc
[0m[34m[1mGenerating sessiondata.moc
[0m[34m[1mGenerating backends/hal/halstorage.moc
[0m[34m[1mGenerating devicenotifier.moc
[0m[34m[1mGenerating kfontchooser.moc
[0m[34m[1mGenerating backends/fakehw/fakecamera.moc
[0m[34m[1mGenerating backends/hal/halaudiointerface.moc
[0m[34m[1mGenerating connection.moc
[0m[34m[1mGenerating processor.moc
[0m[34m[1mGenerating knewpassworddialog.moc
[0m[34m[1mGenerating backends/hal/halbutton.moc
[0m[34m[1mGenerating kdirwatch_p.moc
[0m[34m[1mGenerating backends/fakehw/fakesmartcardreader.moc
[0m[34m[1mGenerating deviceinterface.moc
[0m[34m[1mGenerating block.moc
[0m[34m[1mGenerating kbookmarkmenu.moc
[0m[34m[1mGenerating backends/hal/halbattery.moc
[0m[34m[1mGenerating backends/hal/halcamera.moc
[0m[34m[1mGenerating kdatetable.moc
[0m[34m[1mGenerating backends/fakehw/fakestorage.moc
[0m[34m[1mGenerating video.moc
[0m[34m[1mGenerating button.moc
[0m[34m[1mGenerating opticaldisc.moc
[0m[34m[1mGenerating kpageview_p.moc
[0m[34m[1mGenerating kmetaprops.moc
[0m[34m[1mGenerating backends/fakehw/fakedvbinterface.moc
[0m[34m[1mGenerating storagedrive.moc
[0m[34m[1mGenerating backends/hal/halvideo.moc
[0m[34m[1mGenerating backends/fakehw/fakedevice.moc
[0m[34m[1mGenerating ifaces/devicemanager.moc
[0m[34m[1mGenerating serialinterface.moc
[0m[34m[1mGenerating backends/hal/halnetworkinterface.moc
[0m[34m[1mGenerating kstatusbar.moc
[0m[34m[1mGenerating backends/fakehw/fakestorageaccess.moc
[0m[34m[1mGenerating kopenwithdialog.moc
[0m[34m[1mGenerating networking.moc
[0m[34m[1mGenerating backends/hal/haldvbinterface.moc
[0m[34m[1mGenerating backends/hal/halmanager.moc
[0m[34m[1mGenerating kstringvalidator.moc
[0m[34m[1mGenerating opticaldrive.moc
[0m[34m[1mGenerating storageaccess.moc
[0m[34m[1mGenerating kanimatedbutton.moc
[0m[34m[1mGenerating genericinterface.moc
[0m[34m[1mGenerating storagevolume.moc
[0m[34m[1mGenerating backends/hal/halstorageaccess.moc
[0m[34m[1mGenerating chmodjob.moc
[0m[34m[1mGenerating networkinterface.moc
[0m[34m[1mGenerating backends/fakehw/fakevolume.moc
[0m[34m[1mGenerating knotification.moc
[0m[34m[1mGenerating backends/hal/halvolume.moc
[0m[34m[1mGenerating backends/fakehw/fakeacadapter.moc
[0m[34m[1mGenerating backends/hal/haldeviceinterface.moc
[0m[34m[1mGenerating backends/hal/halsmartcardreader.moc
[0m[34m[1mGenerating khuesaturationselect.moc
[0m[34m[1mGenerating kurlcombobox.moc
[0m[34m[1mGenerating camera.moc
[0m[34m[1mGenerating backends/fakehw/fakeaudiointerface.moc
[0m[34m[1mGenerating backends/hal/halserialinterface.moc
[0m[34m[1mGenerating backends/fakehw/fakeportablemediaplayer.moc
[0m[34m[1mGenerating device_p.moc
[0m[34m[1mGenerating moc_kactioncategory.cpp
[0m[34m[1mGenerating portablemediaplayer.moc
[0m[34m[1mGenerating backends/fakehw/fakeopticaldisc.moc
[0m[34m[1mGenerating kurlrequesterdialog.moc
[0m[34m[1mGenerating smartcardreader.moc
[0m[34m[1mGenerating acadapter.moc
[0m[34m[1mGenerating powermanagement.moc
[0m[34m[1mGenerating backends/fakehw/fakeprocessor.moc
[0m[34m[1mGenerating networking_p.moc
[0m[34m[1mGenerating battery.moc
[0m[34m[1mGenerating backends/hal/halopticaldisc.moc
[0m[34m[1mGenerating backends/hal/halcdrom.moc
[0m[34m[1mGenerating karrowbutton.moc
[0m[34m[1mGenerating kurlrequester.moc
[0m[34m[1mGenerating powermanagement_p.moc
[0m[34m[1mGenerating backends/hal/halportablemediaplayer.moc
[0m[34m[1mGenerating backends/fakehw/fakeblock.moc
[0m[34m[1mGenerating backends/fakehw/fakemanager.moc
[0m[34m[1mGenerating backends/hal/haldevice.moc
[0m[34m[1mGenerating backends/hal/halblock.moc
[0m[34m[1mGenerating kmultitabbar.moc
[0m[34m[1mGenerating backends/fakehw/fakecdrom.moc
[0m[34m[1mGenerating backends/fakehw/fakevideo.moc
[0m[34m[1mGenerating devicemanager_p.moc
[0m[34m[1mGenerating kdatatool.moc
[0m[34m[1mGenerating backends/hal/halprocessor.moc
[0m[34m[1mGenerating kkeysequencewidget.moc
[0m[34m[1mGenerating job_p.moc
[0m[34m[1mGenerating ifaces/device.moc
[0m[34m[1mGenerating audiointerface.moc
[0m[34m[1mGenerating dvbinterface.moc
[0m[34m[1mGenerating backends/fakehw/fakenetworkinterface.moc
[0m[34m[1mGenerating backends/hal/halgenericinterface.moc
[0m[34m[1mGenerating kdatepicker.moc
[0m[  0%] Built target solid_automoc
[35m[1mScanning dependencies of target kded_kssld_automoc
[34m[1mGenerating connection_p.moc
[0m[0m[34m[1mGenerating kssld_adaptor.moc
[0m[34m[1mGenerating ktoolbar.moc
[0m[34m[1mGenerating kssld.moc
[0m[  0%] Built target kded_kssld_automoc
[34m[1mGenerating kfontaction.moc
[0m[35m[1mScanning dependencies of target kpty_automoc
[0m[34m[1mGenerating slaveinterface.moc
[0m[34m[1mGenerating kptyprocess.moc
[0m[34m[1mGenerating kptydevice.moc
[0m[  0%] Built target kpty_automoc
[35m[1mScanning dependencies of target kdesu_automoc
[0m[  0%] [34m[1mGenerating kmultitabbar_p.moc
[0mBuilt target kdesu_automoc
[35m[1mScanning dependencies of target kdesu_stub
[34m[1mGenerating kpreviewprops.moc
[0m[0m[  0%] [32mBuilding C object kdesu/CMakeFiles/kdesu_stub.dir/kdesu_stub.o
[0m[34m[1mGenerating kedittoolbar_p.moc
[0m/var/tmp/portage/kde-base/kdelibs-4.3.3-r1/work/kdelibs-4.3.3/kdesu/kdesu_stub.c: In function main:
/var/tmp/portage/kde-base/kdelibs-4.3.3-r1/work/kdelibs-4.3.3/kdesu/kdesu_stub.c:346: warning: ignoring return value of system, declared with attribute warn_unused_result
[31m[1mLinking C executable ../bin/kdesu_stub
[0m[34m[1mGenerating kacleditwidget.moc
[0m[34m[1mGenerating kxyselector.moc
[0m[  0%] Built target kdesu_stub
[35m[1mScanning dependencies of target kjs_bin_automoc
[0m[  0%] Built target kjs_bin_automoc
[35m[1mScanning dependencies of target kjsapi_automoc
[0m[  0%] Built target kjsapi_automoc
[35m[1mScanning dependencies of target kjsembed_automoc
[34m[1mGenerating configdialog.moc
[0m[0m[34m[1mGenerating kfileshare_p.moc
[0m[  0%] Built target kjsembed_automoc
[34m[1mGenerating accessmanager.moc
[0m[35m[1mScanning dependencies of target kjscmd_automoc
[0m[  0%] Built target kjscmd_automoc
[35m[1mScanning dependencies of target kmailservice_automoc
[0m[  0%] Built target kmailservice_automoc
[35m[1mScanning dependencies of target ktelnetservice_automoc
[0m[  0%] Built target ktelnetservice_automoc
[35m[1mScanning dependencies of target ksendbugmail_automoc
[0m[34m[1mGenerating kselector.moc
[0m[34m[1mGenerating smtp.moc
[0m[34m[1mGenerating kbookmarkmanageradaptor_p.moc
[0m[34m[1mGenerating main.moc
[0m[34m[1mGenerating kpastetextaction.moc
[0m[  0%] Built target ksendbugmail_automoc
[35m[1mScanning dependencies of target kded_proxyscout_automoc
[0m[34m[1mGenerating discovery.moc
[0m[34m[1mGenerating downloader.moc
[0m[34m[1mGenerating kkeysequencewidget_p.moc
[0m[34m[1mGenerating kmimetyperesolver.moc
[0m[34m[1mGenerating proxyscout.moc
[0m[34m[1mGenerating kicondialog.moc
[0m[34m[1mGenerating ktogglefullscreenaction.moc
[0m[34m[1mGenerating ksqueezedtextlabel.moc
[0m[34m[1mGenerating kpropertiesdialog_p.moc
[0m[  0%] Built target kded_proxyscout_automoc
[35m[1mScanning dependencies of target kpac_dhcp_helper
[34m[1mGenerating kwidgetjobtracker_p.moc
[0m[0m[  0%] [32mBuilding C object kio/misc/kpac/CMakeFiles/kpac_dhcp_helper.dir/kpac_dhcp_helper.o
[0m[34m[1mGenerating filejob.moc
[0m[34m[1mGenerating kiconloader.moc
[0m[31m[1mLinking C executable ../../../bin/kpac_dhcp_helper
[0m[34m[1mGenerating ktabbar.moc
[0m[34m[1mGenerating kdirmodel.moc
[0m[  0%] Built target kpac_dhcp_helper
[35m[1mScanning dependencies of target kntlm_automoc
[0m[  0%] Built target kntlm_automoc
[34m[1mGenerating kaboutkdedialog_p.moc
[0m[35m[1mScanning dependencies of target dummy_automoc
[0m[  0%] Built target dummy_automoc
[35m[1mScanning dependencies of target solid_static_automoc
[0m[34m[1mGenerating backends/fakehw/fakegenericinterface.moc
[0m[34m[1mGenerating kfilemetainfowidget.moc
[0m[34m[1mGenerating backends/hal/halacadapter.moc
[0m[34m[1mGenerating backends/fakehw/fakebattery.moc
[0m[34m[1mGenerating kled.moc
[0m[34m[1mGenerating backends/fakehw/fakebutton.moc
[0m[34m[1mGenerating backends/fakehw/fakedeviceinterface.moc
[0m[34m[1mGenerating backends/hal/halstorage.moc
[0m[34m[1mGenerating fileundomanager.moc
[0m[34m[1mGenerating kmenumenuhandler_p.moc
[0m[34m[1mGenerating devicenotifier.moc
[0m[34m[1mGenerating kactionselector.moc
[0m[34m[1mGenerating backends/fakehw/fakecamera.moc
[0m[34m[1mGenerating copyjob.moc
[0m[34m[1mGenerating backends/hal/halaudiointerface.moc
[0m[34m[1mGenerating processor.moc
[0m[34m[1mGenerating backends/hal/halbutton.moc
[0m[34m[1mGenerating ksystemtrayicon.moc
[0m[34m[1mGenerating backends/fakehw/fakesmartcardreader.moc
[0m[34m[1mGenerating netaccess.moc
[0m[34m[1mGenerating deviceinterface.moc
[0m[34m[1mGenerating block.moc
[0m[34m[1mGenerating knuminput.moc
[0m[34m[1mGenerating backends/hal/halbattery.moc
[0m[34m[1mGenerating backends/hal/halcamera.moc
[0m[34m[1mGenerating backends/fakehw/fakestorage.moc
[0m[34m[1mGenerating kabstractfilemodule.moc
[0m[34m[1mGenerating video.moc
[0m[34m[1mGenerating kconfigskeleton.moc
[0m[34m[1mGenerating button.moc
[0m[34m[1mGenerating opticaldisc.moc
[0m[34m[1mGenerating kpropertiesdialog.moc
[0m[34m[1mGenerating backends/fakehw/fakedvbinterface.moc
[0m[34m[1mGenerating kmenu.moc
[0m[34m[1mGenerating storagedrive.moc
[0m[34m[1mGenerating backends/hal/halvideo.moc
[0m[34m[1mGenerating backends/fakehw/fakedevice.moc
[0m[34m[1mGenerating ifaces/devicemanager.moc
[0m[34m[1mGenerating serialinterface.moc
[0m[34m[1mGenerating knotificationrestrictions.moc
[0m[34m[1mGenerating backends/hal/halnetworkinterface.moc
[0m[34m[1mGenerating jobclasses.moc
[0m[34m[1mGenerating backends/fakehw/fakestorageaccess.moc
[0m[34m[1mGenerating dialog.moc
[0m[34m[1mGenerating networking.moc
[0m[34m[1mGenerating backends/hal/haldvbinterface.moc
[0m[34m[1mGenerating backends/hal/halmanager.moc
[0m[34m[1mGenerating opticaldrive.moc
[0m[34m[1mGenerating klineedit_p.moc
[0m[34m[1mGenerating kshellcompletion.moc
[0m[34m[1mGenerating storageaccess.moc
[0m[34m[1mGenerating genericinterface.moc
[0m[34m[1mGenerating storagevolume.moc
[0m[34m[1mGenerating backends/hal/halstorageaccess.moc
[0m[34m[1mGenerating networkinterface.moc
[0m[34m[1mGenerating kcolorbutton.moc
[0m[34m[1mGenerating backends/fakehw/fakevolume.moc
[0m[34m[1mGenerating previewjob.moc
[0m[34m[1mGenerating backends/hal/halvolume.moc
[0m[34m[1mGenerating backends/fakehw/fakeacadapter.moc
[0m[34m[1mGenerating backends/hal/haldeviceinterface.moc
[0m[34m[1mGenerating kwhatsthismanager_p.moc
[0m[34m[1mGenerating backends/hal/halsmartcardreader.moc
[0m[34m[1mGenerating kpreviewwidgetbase.moc
[0m[34m[1mGenerating camera.moc
[0m[34m[1mGenerating backends/fakehw/fakeaudiointerface.moc
[0m[34m[1mGenerating kuniqueapplication_p.moc
[0m[34m[1mGenerating backends/hal/halserialinterface.moc
[0m[34m[1mGenerating kdirwatch.moc
[0m[34m[1mGenerating backends/fakehw/fakeportablemediaplayer.moc
[0m[34m[1mGenerating device_p.moc
[0m[34m[1mGenerating kfilemetapreview.moc
[0m[34m[1mGenerating portablemediaplayer.moc
[0m[34m[1mGenerating backends/fakehw/fakeopticaldisc.moc
[0m[34m[1mGenerating smartcardreader.moc
[0m[34m[1mGenerating acadapter.moc
[0m[34m[1mGenerating ksslkeygen_p.moc
[0m[34m[1mGenerating powermanagement.moc
[0m[34m[1mGenerating backends/fakehw/fakeprocessor.moc
[0m[34m[1mGenerating kmenubar.moc
[0m[34m[1mGenerating networking_p.moc
[0m[34m[1mGenerating battery.moc
[0m[34m[1mGenerating renamedialog.moc
[0m[34m[1mGenerating backends/hal/halopticaldisc.moc
[0m[34m[1mGenerating backends/hal/halcdrom.moc
[0m[34m[1mGenerating kwidgetitemdelegate_p.moc
[0m[34m[1mGenerating powermanagement_p.moc
[0m[34m[1mGenerating backends/hal/halportablemediaplayer.moc
[0m[34m[1mGenerating backends/fakehw/fakeblock.moc
[0m[34m[1mGenerating knumvalidator.moc
[0m[34m[1mGenerating kimagefilepreview.moc
[0m[34m[1mGenerating backends/fakehw/fakemanager.moc
[0m[34m[1mGenerating kcharselect_p.moc
[0m[34m[1mGenerating backends/hal/haldevice.moc
[0m[34m[1mGenerating backends/hal/halblock.moc
[0m[34m[1mGenerating backends/fakehw/fakecdrom.moc
[0m[34m[1mGenerating backends/fakehw/fakevideo.moc
[0m[34m[1mGenerating kbookmarkdombuilder.moc
[0m[34m[1mGenerating devicemanager_p.moc
[0m[34m[1mGenerating backends/hal/halprocessor.moc
[0m[34m[1mGenerating ifaces/device.moc
[0m[34m[1mGenerating kfile.moc
[0m[34m[1mGenerating audiointerface.moc
[0m[34m[1mGenerating ktabwidget.moc
[0m[34m[1mGenerating dvbinterface.moc
[0m[34m[1mGenerating backends/fakehw/fakenetworkinterface.moc
[0m[34m[1mGenerating kbookmarkimporter.moc
[0m[34m[1mGenerating backends/hal/halgenericinterface.moc
[0m[  0%] Built target solid_static_automoc
[34m[1mGenerating deletejob.moc
[0m[34m[1mGenerating kstartupinfo.moc
[0m[35m[1mScanning dependencies of target kdeinit_kbuildsycoca4_automoc
[0m[34m[1mGenerating vfolder_menu.moc
[0m[34m[1mGenerating kbuttongroup.moc
[0m[34m[1mGenerating kfsprocess.moc
[0m[34m[1mGenerating kbuildsycoca.moc
[0m[34m[1mGenerating moc_kfadewidgeteffect.cpp
[0m[34m[1mGenerating kdirlister.moc
[0m[34m[1mGenerating kdialog.moc
[0m[  0%] Built target kdeinit_kbuildsycoca4_automoc
[35m[1mScanning dependencies of target kdeinit_kded4_automoc
[0m[34m[1mGenerating kded.moc
[0m[34m[1mGenerating kconfigdialog.moc
[0m[34m[1mGenerating knfsshare.moc
[0m[34m[1mGenerating klineedit.moc
[0m[34m[1mGenerating kdirnotify.moc
[0m[34m[1mGenerating kdedadaptor.moc
[0m[34m[1mGenerating kmanagerselection.moc
[0m[34m[1mGenerating kpagedialog.moc
[0m[34m[1mGenerating fileundomanager_p.moc
[0m[  0%] Built target kdeinit_kded4_automoc
[35m[1mScanning dependencies of target kdontchangethehostname_automoc
[0m[34m[1mGenerating kgesturemap.moc
[0m[  0%] Built target kdontchangethehostname_automoc
[35m[1mScanning dependencies of target kparts_automoc
[0m[34m[1mGenerating kbookmarkmenu_p.moc
[0m[34m[1mGenerating part.moc
[0m[34m[1mGenerating kcombobox.moc
[0m[34m[1mGenerating historyprovider.moc
[0m[34m[1mGenerating factory.moc
[0m[34m[1mGenerating configwidget.moc
[0m[34m[1mGenerating statusbarextension.moc
[0m[34m[1mGenerating kmimetypechooser.moc
[0m[34m[1mGenerating kpassivepopupmessagehandler.moc
[0m[34m[1mGenerating plugin.moc
[0m[34m[1mGenerating kwidgetitemdelegate.moc
[0m[34m[1mGenerating kfiledialog.moc
[0m[34m[1mGenerating browserextension.moc
[0m[34m[1mGenerating ksplashscreen.moc
[0m[34m[1mGenerating browserinterface.moc
[0m[34m[1mGenerating partmanager.moc
[0m[34m[1mGenerating kbookmarkimporter_crash.moc
[0m[34m[1mGenerating kundostack.moc
[0m[34m[1mGenerating kshortcutsdialog_p.moc
[0m[34m[1mGenerating kbookmarkmanager.moc
[0m[34m[1mGenerating browserrun.moc
[0m[34m[1mGenerating kbuildsycocaprogressdialog.moc
[0m[34m[1mGenerating mainwindow.moc
[0m[34m[1mGenerating kconfigdialogmanager.moc
[0m[34m[1mGenerating kxmlguifactory.moc
[0m[34m[1mGenerating ksambashare.moc
[0m[34m[1mGenerating slave.moc
[0m[34m[1mGenerating kstyle.moc
[0m[  0%] Built target kparts_automoc
[35m[1mScanning dependencies of target kde3support_automoc
[0m[34m[1mGenerating kdialogbuttonbox.moc
[0m[34m[1mGenerating k3listview.moc
[0m[34m[1mGenerating kurifilter.moc
[0m[34m[1mGenerating keditlistbox.moc
[0m[34m[1mGenerating hostinfo.moc
[0m[34m[1mGenerating k3listbox.moc
[0m[34m[1mGenerating kaboutapplicationdialog.moc
[0m[34m[1mGenerating konqbookmarkmenu.moc
[0m[34m[1mGenerating k3iconviewsearchline.moc
[0m[34m[1mGenerating klistwidget.moc
[0m[34m[1mGenerating directorysizejob.moc
[0m[34m[1mGenerating k3multipledrag.moc
[0m[34m[1mGenerating kcolordialog_p.moc
[0m[34m[1mGenerating k3panelapplet.moc
[0m[34m[1mGenerating kbookmarkimporter_ie.moc
[0m[34m[1mGenerating kactioncollection.moc
[0m[34m[1mGenerating kpushbutton.moc
[0m[34m[1mGenerating k3activelabel.moc
[0m[34m[1mGenerating kpagewidgetmodel.moc
[0m[34m[1mGenerating scheduler.moc
[0m[34m[1mGenerating k3process.moc
[0m[34m[1mGenerating kmessageboxmessagehandler.moc
[0m[34m[1mGenerating kpassworddialog.moc
[0m[34m[1mGenerating k3sconfig.moc
[0m[34m[1mGenerating kdiskfreespace.moc
[0m[34m[1mGenerating kdynamicjobtracker_p.moc
[0m[34m[1mGenerating metainfojob.moc
[0m[34m[1mGenerating kshortcutsdialog.moc
[0m[34m[1mGenerating k3command.moc
[0m[34m[1mGenerating ktextedit.moc
[0m[34m[1mGenerating k3fileview.moc
[0m[34m[1mGenerating delegateanimationhandler_p.moc
[0m[34m[1mGenerating kpagemodel.moc
[0m[34m[1mGenerating jobuidelegate.moc
[0m[34m[1mGenerating kreplacedialog.moc
[0m[34m[1mGenerating k3aboutdialog.moc
[0m[34m[1mGenerating kacleditwidget_p.moc
[0m[34m[1mGenerating kcursor_p.moc
[0m[34m[1mGenerating k3filetreeview.moc
[0m[34m[1mGenerating kshortcutseditor.moc
[0m[34m[1mGenerating khbox.moc
[0m[34m[1mGenerating ksslcertificatebox.moc
[0m[34m[1mGenerating kcolorvalueselector.moc
[0m[34m[1mGenerating skipdialog.moc
[0m[34m[1mGenerating kstatusbarjobtracker.moc
[0m[34m[1mGenerating k3processcontroller.moc
[0m[34m[1mGenerating kabstractwidgetjobtracker.moc
[0m[34m[1mGenerating kpageview.moc
[0m[34m[1mGenerating k3dockwidget_private.moc
[0m[34m[1mGenerating ksslinfodialog.moc
[0m[34m[1mGenerating kmodifierkeyinfoprovider_p.moc
[0m[34m[1mGenerating k3syntaxhighlighter.moc
[0m[34m[1mGenerating kdevicelistmodel.moc
[0m[34m[1mGenerating dictionarycombobox.moc
[0m[34m[1mGenerating k3dockwidget.moc
[0m[34m[1mGenerating kscan.moc
[0m[34m[1mGenerating kfontrequester.moc
[0m[34m[1mGenerating krestrictedline.moc
[0m[34m[1mGenerating k3buttonbox.moc
[0m[34m[1mGenerating davjob.moc
[0m[34m[1mGenerating k3spell.moc
[0m[34m[1mGenerating kcheckaccelerators.moc
[0m[34m[1mGenerating k3listviewsearchline.moc
[0m[34m[1mGenerating kmainwindowiface_p.moc
[0m[34m[1mGenerating ksslkeygen.moc
[0m[34m[1mGenerating k3listviewlineedit.moc
[0m[34m[1mGenerating krun.moc
[0m[34m[1mGenerating kpasswdserverloop_p.moc
[0m[34m[1mGenerating kcolorcombo.moc
[0m[34m[1mGenerating k3wizard.moc
[0m[34m[1mGenerating kfileitemdelegate.moc
[0m[34m[1mGenerating kedittoolbar.moc
[0m[34m[1mGenerating k3colordrag.moc
[0m[34m[1mGenerating kencodingfiledialog.moc
[0m[34m[1mGenerating ktoolbarpopupaction.moc
[0m[34m[1mGenerating k3procio.moc
[0m[34m[1mGenerating k3iconview.moc
[0m[34m[1mGenerating kautomount.moc
[0m[34m[1mGenerating kuiserverjobtracker_p.moc
[0m[34m[1mGenerating pastedialog.moc
[0m[34m[1mGenerating ksvgrenderer.moc
[0m[34m[1mGenerating k3popupmenu.moc
[0m[34m[1mGenerating khelpmenu.moc
[0m[34m[1mGenerating ktoolbarhandler.moc
[0m[34m[1mGenerating slaveconfig.moc
[0m[34m[1mGenerating kclipboard.moc
[0m[34m[1mGenerating dockmainwindow3.moc
[0m[34m[1mGenerating kvbox.moc
[0m[34m[1mGenerating forwardingslavebase.moc
[0m[34m[1mGenerating kmodifierkeyinfo.moc
[0m[34m[1mGenerating krichtextwidget.moc
[0m[34m[1mGenerating kfiletreebranch.moc
[0m[34m[1mGenerating krun_p.moc
[0m[34m[1mGenerating renamedialogplugin.moc
[0m[34m[1mGenerating kfilterproxysearchline.moc
[0m[34m[1mGenerating ktoolbarspaceraction.moc
[0m[34m[1mGenerating kbookmarkimporter_opera_p.moc
[0m[34m[1mGenerating kstatusbarofflineindicator.moc
[0m[34m[1mGenerating k3textedit.moc
[0m[34m[1mGenerating klistwidgetsearchline.moc
[0m[34m[1mGenerating kdirlister_p.moc
[0m[34m[1mGenerating kswitchlanguagedialog_p.moc
[0m[34m[1mGenerating k3aboutdialog_p.moc
[0m[34m[1mGenerating dataslave.moc
[0m[34m[1mGenerating kpagewidget.moc
[0m[34m[1mGenerating k3panelmenu.moc
[0m[34m[1mGenerating ktip.moc
[0m[34m[1mGenerating kfilesharedialog.moc
[0m[34m[1mGenerating k3spelldlg.moc
[0m[34m[1mGenerating moc_kglobalshortcutinfo.cpp
[0m[34m[1mGenerating kcupsoptionsjobwidget_p.moc
[0m[34m[1mGenerating kfilewriteplugin.moc
[0m[34m[1mGenerating k3passworddialog.moc
[0m[34m[1mGenerating accessmanagerreply_p.moc
[0m[34m[1mGenerating kxmlguiwindow.moc
[0m[34m[1mGenerating kopenwithdialog_p.moc
[0m[34m[1mGenerating kaction.moc
[0m[  0%] Built target kde3support_automoc
[35m[1mScanning dependencies of target kfile_automoc
[0m[34m[1mGenerating kurldropdownbutton_p.moc
[0m[34m[1mGenerating passworddialog.moc
[0m[34m[1mGenerating kdatewidget.moc
[0m[34m[1mGenerating kurlnavigator.moc
[0m[34m[1mGenerating kfind.moc
[0m[34m[1mGenerating kurlcompletion.moc
[0m[34m[1mGenerating kprotocolcombo_p.moc
[0m[34m[1mGenerating kactionmenu.moc
[0m[34m[1mGenerating moc_kfileitemactions.cpp
[0m[34m[1mGenerating kurlnavigatormenu_p.moc
[0m[34m[1mGenerating kextendableitemdelegate.moc
[0m[34m[1mGenerating moc_kfileitemactions_p.cpp
[0m[34m[1mGenerating kfilewidget.moc
[0m[34m[1mGenerating kfinddialog.moc
[0m[34m[1mGenerating kfiletreeview.moc
[0m[34m[1mGenerating kseparator.moc
[0m[34m[1mGenerating moc_kbookmarkdialog.cpp
[0m[34m[1mGenerating kwindowsystem.moc
[0m[34m[1mGenerating kfileplacesselector_p.moc
[0m[  0%] [34m[1mGenerating klanguagebutton.moc
[0mBuilt target kio_automoc
[35m[1mScanning dependencies of target kunittest_automoc
[0m[34m[1mGenerating runner.moc
[0m[34m[1mGenerating kdiroperator.moc
[0m[34m[1mGenerating kpassivepopup.moc
[0m[34m[1mGenerating tester.moc
[0m[  0%] Built target kunittest_automoc
[35m[1mScanning dependencies of target kunittestmodrunner_automoc
[0m[34m[1mGenerating krecentfilesaction.moc
[0m[  0%] Built target kunittestmodrunner_automoc
[35m[1mScanning dependencies of target kfilemodule_automoc
[0m[34m[1mGenerating kfilemodule.moc
[0m[  0%] Built target kfilemodule_automoc
[35m[1mScanning dependencies of target kdeinit_kconf_update_automoc
[0m[34m[1mGenerating ktextbrowser.moc
[0m[  0%] Built target kdeinit_kconf_update_automoc
[35m[1mScanning dependencies of target genshortcutents_automoc
[0m[  0%] Built target genshortcutents_automoc
[35m[1mScanning dependencies of target kio_ghelp_automoc
[0m[  0%] Built target kio_ghelp_automoc
[35m[1mScanning dependencies of target kio_help_automoc
[0m[  0%] [34m[1mGenerating kurltogglebutton_p.moc
[0mBuilt target kio_help_automoc
[34m[1mGenerating kcompletionbox.moc
[0m[35m[1mScanning dependencies of target meinproc4_automoc
[0m[  0%] Built target meinproc4_automoc
[35m[1mScanning dependencies of target kio_file_automoc
[0m[34m[1mGenerating file.moc
[0m[34m[1mGenerating kfileplacessharedbookmarks_p.moc
[0m[34m[1mGenerating kreplace.moc
[0m[34m[1mGenerating kfilefiltercombo.moc
[0m[34m[1mGenerating kurllabel.moc
[0m[  0%] Built target kio_file_automoc
[35m[1mScanning dependencies of target kdeinit_kio_http_cache_cleaner_automoc
[0m[34m[1mGenerating kfileplacesmodel.moc
[0m[  0%] Built target kdeinit_kio_http_cache_cleaner_automoc
[35m[1mScanning dependencies of target kio_http_automoc
[0m[34m[1mGenerating kfontsizeaction.moc
[0m[34m[1mGenerating httpfilter.moc
[0m[34m[1mGenerating http.moc
[0m[34m[1mGenerating kfileplaceeditdialog.moc
[0m[34m[1mGenerating kpixmapregionselectorwidget.moc
[0m[34m[1mGenerating kurlbutton_p.moc
[0m[34m[1mGenerating kuiserverjobtracker.moc
[0m[  0%] Built target kio_http_automoc
[35m[1mScanning dependencies of target kcookiejar4_automoc
[0m[34m[1mGenerating kwallet.moc
[0m[  0%] Built target kcookiejar4_automoc
[35m[1mScanning dependencies of target kded_kcookiejar_automoc
[0m[34m[1mGenerating kruler.moc
[0m[34m[1mGenerating kcookieserver.moc
[0m[34m[1mGenerating kdirselectdialog.moc
[0m[34m[1mGenerating kcodecaction.moc
[0m[34m[1mGenerating kfileplacesview_p.moc
[0m[34m[1mGenerating kxmessages.moc
[0m[34m[1mGenerating kcookiewin.moc
[0m[34m[1mGenerating kfileplacesitem_p.moc
[0m[34m[1mGenerating kfileplacesview.moc
[0m[34m[1mGenerating kmainwindow.moc
[0m[  0%] Built target kded_kcookiejar_automoc
[35m[1mScanning dependencies of target kio_ftp_automoc
[0m[  0%] Built target kio_ftp_automoc
[35m[1mScanning dependencies of target kio_metainfo_automoc
[0m[  0%] Built target kio_metainfo_automoc
[34m[1mGenerating kuniqueapplication.moc
[0m[35m[1mScanning dependencies of target knewstuff2_automoc
[0m[34m[1mGenerating kfilepreviewgenerator.moc
[0m[34m[1mGenerating knewstuffbutton.moc
[0m[34m[1mGenerating kfilebookmarkhandler_p.moc
[0m[34m[1mGenerating kdialogjobuidelegate.moc
[0m[34m[1mGenerating sampleedit_p.moc
[0m[34m[1mGenerating kdxstranslation.moc
[0m[34m[1mGenerating kurlnavigatorbutton_p.moc
[0m[34m[1mGenerating coreengine.moc
[0m[34m[1mGenerating kassistantdialog.moc
[0m[34m[1mGenerating kdxschanges.moc
[0m[34m[1mGenerating moc_kdiroperatordetailview_p.cpp
[0m[34m[1mGenerating kfontdialog.moc
[0m[34m[1mGenerating dxs.moc
[0m[  0%] Built target kfile_automoc
[34m[1mGenerating kbugreport.moc
[0m[34m[1mGenerating qasyncimage_p.moc
[0m[35m[1mScanning dependencies of target notepadpart_automoc
[0m[34m[1mGenerating notepad.moc
[0m[34m[1mGenerating qstarframe.moc
[0m[  0%] Built target notepadpart_automoc
[35m[1mScanning dependencies of target spellcheckplugin_automoc
[34m[1mGenerating ktreewidgetsearchline.moc
[0m[0m[34m[1mGenerating plugin_spellcheck.moc
[0m[34m[1mGenerating providerdialog.moc
[0m[34m[1mGenerating highlighter.moc
[0m[  0%] Built target spellcheckplugin_automoc
[35m[1mScanning dependencies of target kutils_automoc
[0m[34m[1mGenerating dxsengine.moc
[0m[34m[1mGenerating kcmultidialog.moc
[0m[34m[1mGenerating kcupsoptionspageswidget_p.moc
[0m[34m[1mGenerating kdxscomment.moc
[0m[34m[1mGenerating kfontcombobox.moc
[0m[34m[1mGenerating dispatcher_p.moc
[0m[34m[1mGenerating uploaddialog.moc
[0m[34m[1mGenerating kemoticons.moc
[0m[34m[1mGenerating ktoolbarlabelaction.moc
[0m[34m[1mGenerating componentsdialog_p.moc
[0m[34m[1mGenerating downloaddialog.moc
[0m[34m[1mGenerating khistorycombobox.moc
[0m[34m[1mGenerating kcmoduleproxy.moc
[0m[34m[1mGenerating security.moc
[0m[34m[1mGenerating kdxsrating.moc
[0m[34m[1mGenerating kcategorizedview.moc
[0m[34m[1mGenerating kcmodulecontainer.moc
[0m[34m[1mGenerating krichtextedit.moc
[0m[34m[1mGenerating kdxscomments.moc
[0m[34m[1mGenerating pluginpage.moc
[0m[34m[1mGenerating kstandardaction_p.moc
[0m[34m[1mGenerating soap.moc
[0m[34m[1mGenerating dialog.moc
[0m[34m[1mGenerating engine.moc
[0m[34m[1mGenerating kinputdialog_p.moc
[0m[34m[1mGenerating ksettingswidgetadaptor.moc
[0m[34m[1mGenerating ktimezonewidget.moc
[0m[34m[1mGenerating qprogressindicator.moc
[0m[34m[1mGenerating kprintpreview.moc
[0m[34m[1mGenerating providerloader.moc
[0m[34m[1mGenerating kapplication.moc
[0m[34m[1mGenerating kpluginselector_p.moc
[0m[34m[1mGenerating entryloader.moc
[0m[34m[1mGenerating kdialogqueue_p.moc
[0m[34m[1mGenerating kwidgetjobtracker.moc
[0m[34m[1mGenerating moc_kdeuiwidgetsproxystyle_p.cpp
[0m[34m[1mGenerating moc_itemsviewdelegate.cpp
[0m[34m[1mGenerating kpluginselector.moc
[0m[34m[1mGenerating moc_klinkdialog.cpp
[0m[34m[1mGenerating moc_itemsmodel.cpp
[0m[34m[1mGenerating moc_kemoticonsprovider.cpp
[0m[34m[1mGenerating moc_kcupsoptionswidget_p.cpp
[0m[  0%] Built target kutils_automoc
[  0%] Built target knewstuff2_automoc
[35m[1mScanning dependencies of target emoticonstheme_kde_automoc
[0m[35m[1mScanning dependencies of target emoticonstheme_xmpp_automoc
[  0%] [0mBuilt target kdeui_automoc
[34m[1mGenerating moc_kde_emoticons.cpp
[0m[35m[1mScanning dependencies of target emoticonstheme_adium_automoc
[0m[34m[1mGenerating moc_xmpp_emoticons.cpp
[0m[34m[1mGenerating moc_adium_emoticons.cpp
[0m[  0%] Built target emoticonstheme_kde_automoc
[  0%] [  0%] Built target emoticonstheme_xmpp_automoc
Built target emoticonstheme_adium_automoc
[35m[1mScanning dependencies of target emoticonstheme_pidgin_automoc
[0m[35m[1mScanning dependencies of target kemoticonstest_automoc
[0m[35m[1mScanning dependencies of target kdeinit4_automoc
[0m[34m[1mGenerating moc_pidgin_emoticons.cpp
[0m[34m[1mGenerating main.moc
[0m[  0%] Built target kdeinit4_automoc
[35m[1mScanning dependencies of target kdeinit4_shutdown
[  0%] [0mBuilt target emoticonstheme_pidgin_automoc
[  0%] [32mBuilding C object kinit/CMakeFiles/kdeinit4_shutdown.dir/wrapper.o
[0m[35m[1mScanning dependencies of target kdeinit4_wrapper
[0m[  0%] [32mBuilding C object kinit/CMakeFiles/kdeinit4_wrapper.dir/wrapper.o
[0m[  0%] Built target kemoticonstest_automoc
[35m[1mScanning dependencies of target kdeinit_klauncher_automoc
[0m[31m[1mLinking C executable ../bin/kdeinit4_shutdown
[0m[34m[1mGenerating klauncher.moc
[0m[  0%] Built target kdeinit4_shutdown
[35m[1mScanning dependencies of target kioslave_automoc
[0m[  0%] Built target kioslave_automoc
[31m[1mLinking C executable ../bin/kdeinit4_wrapper
[0m[35m[1mScanning dependencies of target kshell4
[0m[  0%] Built target kdeinit4_wrapper
[  0%] [32mBuilding C object kinit/CMakeFiles/kshell4.dir/shell.o
[0m[35m[1mScanning dependencies of target kwrapper4
[0m[  0%] [34m[1mGenerating klauncher_adaptor.moc
[0m[32mBuilding C object kinit/CMakeFiles/kwrapper4.dir/kwrapper.o
[0m[31m[1mLinking C executable ../bin/kshell4
[0m[31m[1mLinking C executable ../bin/kwrapper4
[0m[  0%] Built target kshell4
[  0%] Built target kdeinit_klauncher_automoc
[35m[1mScanning dependencies of target lnusertemp
[35m[1mScanning dependencies of target threadweaver_automoc
[0m[0m[34m[1mGenerating Thread.moc
[0m[  0%] [32mBuilding C object kinit/CMakeFiles/lnusertemp.dir/lnusertemp.o
[0m[34m[1mGenerating Job_p.moc
[0m[  0%] Built target kwrapper4
[34m[1mGenerating WeaverImpl.moc
[0m[35m[1mScanning dependencies of target kspell_aspell_automoc
[0m[34m[1mGenerating WeaverObserver.moc
[0m[34m[1mGenerating kspell_aspellclient.moc
[0m[34m[1mGenerating JobCollection.moc
[0m[34m[1mGenerating Thread_p.moc
[0m[  0%] [34m[1mGenerating JobSequence.moc
[0mBuilt target kspell_aspell_automoc
[35m[1mScanning dependencies of target kspell_enchant_automoc
[0m[34m[1mGenerating WeaverInterface.moc
[0m[34m[1mGenerating enchantclient.moc
[0m[31m[1mLinking C executable ../bin/lnusertemp
[0m[34m[1mGenerating ThreadWeaver.moc
[0m[34m[1mGenerating JobCollection_p.moc
[0m[34m[1mGenerating Job.moc
[0m[  0%] [  0%] Built target lnusertemp
[  0%] Built target threadweaver_automoc
Built target kspell_enchant_automoc
[35m[1mScanning dependencies of target ktexteditor_automoc
[0m[35m[1mScanning dependencies of target khtml_automoc
[35m[1mScanning dependencies of target khtmladaptorpart_automoc
[0m[0m[34m[1mGenerating moc_khtmladaptorpart.cpp
[0m[34m[1mGenerating view.moc
[0m[34m[1mGenerating loadsavefiltercheckplugin.moc
[0m[  0%] Built target khtmladaptorpart_automoc
[35m[1mScanning dependencies of target khtmlimagepart_automoc
[0m[34m[1mGenerating annotationinterface.moc
[0m[  0%] Built target khtmlimagepart_automoc
[35m[1mScanning dependencies of target khtmlpart_automoc
[0mautomoc4: empty source file: /var/tmp/portage/kde-base/kdelibs-4.3.3-r1/work/kdelibs-4.3.3_build/khtml/JSTimeRanges.cpp
automoc4: empty source file: /var/tmp/portage/kde-base/kdelibs-4.3.3-r1/work/kdelibs-4.3.3_build/khtml/JSMediaError.cpp
automoc4: empty source file: /var/tmp/portage/kde-base/kdelibs-4.3.3-r1/work/kdelibs-4.3.3_build/khtml/JSHTMLMediaElement.cpp
automoc4: empty source file: /var/tmp/portage/kde-base/kdelibs-4.3.3-r1/work/kdelibs-4.3.3_build/khtml/JSHTMLAudioElement.cpp
automoc4: empty source file: /var/tmp/portage/kde-base/kdelibs-4.3.3-r1/work/kdelibs-4.3.3_build/khtml/JSHTMLVideoElement.cpp
[34m[1mGenerating factory.moc
[0m[34m[1mGenerating khtml_factory.moc
[0m[34m[1mGenerating documentadaptor_p.moc
[0m[34m[1mGenerating khtml_run.moc
[0m[  0%] Built target khtmlpart_automoc
[35m[1mScanning dependencies of target testkhtml_automoc
[0m[34m[1mGenerating testkhtml.moc
[0m[34m[1mGenerating khtml_part.moc
[0m[34m[1mGenerating editor.moc
[0m[34m[1mGenerating plugin.moc
[0m[  0%] Built target testkhtml_automoc
[35m[1mScanning dependencies of target testkhtml_static_automoc
[0m[34m[1mGenerating testkhtml.moc
[0m[34m[1mGenerating codecompletionmodel.moc
[0m[34m[1mGenerating callstackdock.moc
[0m[34m[1mGenerating cursorfeedback.moc
[0m[34m[1mGenerating render_layer.moc
[0m[34m[1mGenerating scriptsdock.moc
[0m[34m[1mGenerating xmlhttprequest.moc
[0m[34m[1mGenerating configpage.moc
[0m[  0%] Built target testkhtml_static_automoc
[35m[1mScanning dependencies of target kmultipart_automoc
[0m[34m[1mGenerating httpfilter.moc
[0m[34m[1mGenerating kmultipart.moc
[0m[34m[1mGenerating render_form.moc
[0m[34m[1mGenerating rangefeedback.moc
[0m[34m[1mGenerating editorchooser.moc
[0m[  0%] Built target kmultipart_automoc
[35m[1mScanning dependencies of target kjavaappletviewer_automoc
[0m[34m[1mGenerating kjavaappletwidget.moc
[0m[34m[1mGenerating document.moc
[0m[34m[1mGenerating html_objectimpl.moc
[0m[  0%] Built target ktexteditor_automoc
[35m[1mScanning dependencies of target kmediaplayer_automoc
[0m[34m[1mGenerating kjavaappletviewer.moc
[0m[34m[1mGenerating kmediaplayeradaptor_p.moc
[0m[34m[1mGenerating kjserrordlg.moc
[0m[34m[1mGenerating render_frames.moc
[0m[34m[1mGenerating dom_docimpl.moc
[0m[34m[1mGenerating view.moc
[0m[34m[1mGenerating kjavaprocess.moc
[0m[34m[1mGenerating localvariabledock.moc
[0m[34m[1mGenerating kjavadownloader.moc
[0m[34m[1mGenerating player.moc
[0m[34m[1mGenerating kjavaapplet.moc
[0m[34m[1mGenerating khtmlpart_p.moc
[0m[34m[1mGenerating kjavaappletcontext.moc
[0m[  0%] Built target kmediaplayer_automoc
[34m[1mGenerating kjavaappletserver.moc
[0m[35m[1mScanning dependencies of target kfileaudiopreview_automoc
[0m[34m[1mGenerating mediacontrols.moc
[0m[  0%] Built target kjavaappletviewer_automoc
[35m[1mScanning dependencies of target kimproxy_automoc
[0m[34m[1mGenerating kimproxy.moc
[0m[34m[1mGenerating kfileaudiopreview.moc
[0m[  0%] Built target kimproxy_automoc
[35m[1mScanning dependencies of target kde3supportwidgets_automoc
[0m[  0%] Built target kde3supportwidgets_automoc
[35m[1mScanning dependencies of target makekdewidgets_automoc
[0m[  0%] Built target kfileaudiopreview_automoc
[  0%] Built target makekdewidgets_automoc
[35m[1mScanning dependencies of target kdewidgets_automoc
[0m[35m[1mScanning dependencies of target katepart_automoc
[0m[  0%] Built target kdewidgets_automoc
[35m[1mScanning dependencies of target testkateregression_automoc
[0m[34m[1mGenerating khtmlview.moc
[0m[34m[1mGenerating katecompletionwidget.moc
[0m[34m[1mGenerating katebookmarks.moc
[0m[34m[1mGenerating moc_completiontest.cpp
[0m[34m[1mGenerating katewordcompletion.moc
[0m[34m[1mGenerating khtml_wallet_p.moc
[0m[34m[1mGenerating katecompletiontree.moc
[0m[34m[1mGenerating katedocumenthelpers.moc
[0m[34m[1mGenerating kateautoindent.moc
[0m[34m[1mGenerating khtml_pagecache.moc
[0m[34m[1mGenerating katemodemenu.moc
[0m[34m[1mGenerating khtml_ext.moc
[0m[34m[1mGenerating expandingwidgetmodel.moc
[0m[34m[1mGenerating katestyletreewidget.moc
[0m[34m[1mGenerating katespell.moc
[0m[34m[1mGenerating render_replaced.moc
[0m[34m[1mGenerating kateviewinternal.moc
[0m[34m[1mGenerating katepartpluginmanager.moc
[0m[34m[1mGenerating khtml_printsettings.moc
[0m[34m[1mGenerating katedynamicanimation.moc
[0m[34m[1mGenerating katedialogs.moc
[0m[34m[1mGenerating editor.moc
[0m[34m[1mGenerating kjs_window.moc
[0m[34m[1mGenerating katemodeconfigpage.moc
[0m[34m[1mGenerating kjs_audio.moc
[0m[34m[1mGenerating kateprinter.moc
[0m[34m[1mGenerating kateargumenthinttree.moc
[0m[34m[1mGenerating animtimer.moc
[0m[34m[1mGenerating xml_tokenizer.moc
[0m[34m[1mGenerating kateprinter.moc
[0m[34m[1mGenerating katepartpluginmanager.moc
[0m[34m[1mGenerating consoledock.moc
[0m[34m[1mGenerating katebookmarks.moc
[0m[34m[1mGenerating katecodefolding.moc
[0m[34m[1mGenerating katecompletionmodel.moc
[0m[34m[1mGenerating katecompletionconfig.moc
[0m[34m[1mGenerating updater.moc
[0m[34m[1mGenerating katelayoutcache.moc
[0m[34m[1mGenerating khtml_iface.moc
[0m[34m[1mGenerating completiontest.moc
[0m[34m[1mGenerating kateedit.moc
[0m[34m[1mGenerating kateglobal.moc
[0m[34m[1mGenerating kateview.moc
[0m[34m[1mGenerating kateviewinternal.moc
[0m[34m[1mGenerating breakpointsdock.moc
[0m[34m[1mGenerating html_documentimpl.moc
[0m[34m[1mGenerating khtmlimage.moc
[0m[34m[1mGenerating kateschema.moc
[0m[34m[1mGenerating kateschema.moc
[0m[34m[1mGenerating expandingwidgetmodel.moc
[0m[34m[1mGenerating loader.moc
[0m[34m[1mGenerating katesmartmanager.moc
[0m[34m[1mGenerating katetemplatehandler.moc
[0m[34m[1mGenerating katedocument.moc
[0m[34m[1mGenerating debugwindow.moc
[0m[34m[1mGenerating katelayoutcache.moc
[0m[34m[1mGenerating katecompletionwidget.moc
[0m[34m[1mGenerating katecodefolding.moc
[0m[34m[1mGenerating katedialogs.moc
[0m[34m[1mGenerating katemodeconfigpage.moc
[0m[34m[1mGenerating moc_khtmlfind_p.cpp
[0m[34m[1mGenerating katesmartrange.moc
[0m[34m[1mGenerating moc_khtmlviewbar.cpp
[0m[34m[1mGenerating kateedit.moc
[0m[34m[1mGenerating katebuffer.moc
[0m[34m[1mGenerating moc_paintbuffer.cpp
[0m[34m[1mGenerating expandingdelegate.moc
[0m[34m[1mGenerating kateargumenthintmodel.moc
[0m[34m[1mGenerating moc_debugdocument.cpp
[0m[34m[1mGenerating katesyntaxmanager.moc
[0m[34m[1mGenerating katewordcompletion.moc
[0m[34m[1mGenerating moc_errordlg.cpp
[0m[34m[1mGenerating katebuffer.moc
[0m[34m[1mGenerating katesyntaxmanager.moc
[0m[34m[1mGenerating moc_khtmlfindbar.cpp
[0m[34m[1mGenerating moc_storepassbar.cpp
[0m[34m[1mGenerating katecompletionmodel.moc
[0m[34m[1mGenerating moc_khtmlviewbarwidget.cpp
[0m[34m[1mGenerating kateview.moc
[0m[34m[1mGenerating expandingdelegate.moc
[0m[  0%] Built target khtml_automoc
[35m[1mScanning dependencies of target GeneratePhpXmlFiles
[0m[  0%] [34m[1mGenerating css-php.xml
[0m[34m[1mGenerating katedocumenthelpers.moc
[0m[  0%] [34m[1mGenerating html-php.xml
[0m[  0%] [34m[1mGenerating javascript-php.xml
[0m[34m[1mGenerating katedynamicanimation.moc
[0m[  0%] Built target GeneratePhpXmlFiles
[35m[1mScanning dependencies of target ktexteditor_insertfile_automoc
[0m[34m[1mGenerating insertfileplugin.moc
[0m[34m[1mGenerating katecompletionconfig.moc
[0m[34m[1mGenerating katesmartrange.moc
[0m[34m[1mGenerating test_regression.moc
[0m[34m[1mGenerating kateargumenthinttree.moc
[0m[  0%] Built target ktexteditor_insertfile_automoc
[35m[1mScanning dependencies of target ktexteditor_kdatatool_automoc
[0m[34m[1mGenerating kateviewhelpers.moc
[0m[34m[1mGenerating kate_kdatatool.moc
[0m[34m[1mGenerating kateargumenthintmodel.moc
[0m[  0%] Built target ktexteditor_kdatatool_automoc
[35m[1mScanning dependencies of target ktexteditor_python-encoding_automoc
[0m[34m[1mGenerating python_encoding.moc
[0m[34m[1mGenerating katehighlightmenu.moc
[0m[34m[1mGenerating kateviewhelpers.moc
[0m[34m[1mGenerating katestyletreewidget.moc
[0m[  0%] Built target ktexteditor_python-encoding_automoc
[35m[1mScanning dependencies of target knotifyconfig_automoc
[0m[34m[1mGenerating knotifyconfigactionswidget.moc
[0m[34m[1mGenerating katesearchbar.moc
[0m[34m[1mGenerating katecompletiontree.moc
[0m[34m[1mGenerating knotifyconfigwidget.moc
[0m[34m[1mGenerating knotifyeventlist.moc
[0m[34m[1mGenerating kateautoindent.moc
[0m[  0%] Built target knotifyconfig_automoc
[35m[1mScanning dependencies of target kimg_dds_automoc
[0m[34m[1mGenerating katespell.moc
[0m[  0%] Built target kimg_dds_automoc
[35m[1mScanning dependencies of target kimg_eps_automoc
[0m[  0%] Built target kimg_eps_automoc
[35m[1mScanning dependencies of target kimg_jp2_automoc
[0m[  0%] Built target kimg_jp2_automoc
[35m[1mScanning dependencies of target kimg_pcx_automoc
[0m[  0%] Built target kimg_pcx_automoc
[35m[1mScanning dependencies of target kimg_psd_automoc
[0m[  0%] Built target kimg_psd_automoc
[35m[1mScanning dependencies of target kimg_rgb_automoc
[0m[34m[1mGenerating katemodemenu.moc
[0m[  0%] Built target kimg_rgb_automoc
[35m[1mScanning dependencies of target kimg_tga_automoc
[0m[  0%] Built target kimg_tga_automoc
[35m[1mScanning dependencies of target kimg_xcf_automoc
[0m[  0%] Built target kimg_xcf_automoc
[34m[1mGenerating katesmartmanager.moc
[0m[35m[1mScanning dependencies of target kimg_xview_automoc
[0m[  0%] Built target kimg_xview_automoc
[35m[1mScanning dependencies of target kdnssd_automoc
[0m[34m[1mGenerating domainbrowser.moc
[0m[34m[1mGenerating publicservice.moc
[0m[34m[1mGenerating servicebrowser.moc
[0m[34m[1mGenerating servicetypebrowser.moc
[0m[34m[1mGenerating kateglobal.moc
[0m[34m[1mGenerating remoteservice.moc
[0m[34m[1mGenerating moc_servicemodel.cpp
[0m[34m[1mGenerating katetemplatehandler.moc
[0m[34m[1mGenerating moc_domainmodel.cpp
[0m[34m[1mGenerating katedocument.moc
[0m[  0%] Built target kdnssd_automoc
[35m[1mScanning dependencies of target krosscore_automoc
[0m[34m[1mGenerating action.moc
[0m[34m[1mGenerating katehighlightmenu.moc
[0m[34m[1mGenerating codecompletiontestmodel.moc
[0m[34m[1mGenerating script.moc
[0m[34m[1mGenerating moc_katevinormalmode.cpp
[0m[34m[1mGenerating manager.moc
[0m[34m[1mGenerating katesearchbar.moc
[0m[34m[1mGenerating interpreter.moc
[0m[34m[1mGenerating actioncollection.moc
[0m[  0%] Built target krosscore_automoc
[35m[1mScanning dependencies of target krossui_automoc
[0m[34m[1mGenerating plugin.moc
[0m[34m[1mGenerating moc_katevimodebase.cpp
[0m[34m[1mGenerating moc_katevinormalmode.cpp
[0m[34m[1mGenerating model.moc
[0m[34m[1mGenerating view.moc
[0m[34m[1mGenerating moc_kateundomanager.cpp
[0m[  0%] Built target krossui_automoc
[35m[1mScanning dependencies of target krossmoduleforms_automoc
[0m[34m[1mGenerating moc_katevimodebar.cpp
[0m[34m[1mGenerating form.moc
[0m[34m[1mGenerating moc_katevimodebase.cpp
[0m[  0%] Built target krossmoduleforms_automoc
[35m[1mScanning dependencies of target krossmodulekdetranslation_automoc
[0m[34m[1mGenerating moc_katescriptdocument.cpp
[0m[34m[1mGenerating moc_kateundomanager.cpp
[0m[34m[1mGenerating translation.moc
[0m[34m[1mGenerating moc_katevimodebar.cpp
[0m[  0%] Built target krossmodulekdetranslation_automoc
[34m[1mGenerating moc_katescriptview.cpp
[0m[35m[1mScanning dependencies of target kross_automoc
[0m[  0%] Built target kross_automoc
[35m[1mScanning dependencies of target krosskjs_automoc
[0m[  0%] [  0%] Built target krosskjs_automoc
Built target katepart_automoc
[35m[1mScanning dependencies of target krossqtsplugin_automoc
[35m[1mScanning dependencies of target krossqts_automoc
[0m[0m[  0%] Built target krossqtsplugin_automoc
[34m[1mGenerating script.moc
[0m[35m[1mScanning dependencies of target plasma_automoc
[0m[34m[1mGenerating moc_katescriptdocument.cpp
[0m[  0%] Built target krossqts_automoc
[  0%] [34m[1mGenerating videowidget.moc
[0m[34m[1mGenerating qrc_templates.cxx
[0m[35m[1mScanning dependencies of target nepomuk-rcgen
[34m[1mGenerating moc_katescriptview.cpp
[0m[34m[1mGenerating label.moc
[0m[  0%] Built target testkateregression_automoc
[35m[1mScanning dependencies of target kdecore
[34m[1mGenerating datacontainer_p.moc
[0m[34m[1mGenerating signalplotter.moc
[0m[34m[1mGenerating scrollbar.moc
[0m[0m[  0%] [32mBuilding CXX object nepomuk/rcgen/CMakeFiles/nepomuk-rcgen.dir/nepomuk-rcgen_automoc.o
[0m[  0%] [32mBuilding CXX object nepomuk/rcgen/CMakeFiles/nepomuk-rcgen.dir/codegenerator.o
[0m[34m[1mGenerating extenderapplet_p.moc
[0m[34m[1mGenerating context.moc
[0m[34m[1mGenerating svg.moc
[0m[34m[1mGenerating pushbutton.moc
[0m[34m[1mGenerating meter.moc
[0m[34m[1mGenerating textbrowser.moc
[0m[34m[1mGenerating tabbar.moc
[0m[34m[1mGenerating combobox.moc
[0m[34m[1mGenerating framesvg.moc
[0m[34m[1mGenerating svgwidget.moc
[0m[34m[1mGenerating runnercontext.moc
[0m[34m[1mGenerating theme.moc
[0m[34m[1mGenerating extender.moc
[0m[  0%] [32mBuilding CXX object nepomuk/rcgen/CMakeFiles/nepomuk-rcgen.dir/fastcode.o
[0m[34m[1mGenerating groupbox.moc
[0m[34m[1mGenerating runnerscript.moc
[0m/var/tmp/portage/kde-base/kdelibs-4.3.3-r1/work/kdelibs-4.3.3/nepomuk/rcgen/fastcode.cpp:30: warning: unused parameter property
/var/tmp/portage/kde-base/kdelibs-4.3.3-r1/work/kdelibs-4.3.3/nepomuk/rcgen/fastcode.cpp:30: warning: unused parameter rc
/var/tmp/portage/kde-base/kdelibs-4.3.3-r1/work/kdelibs-4.3.3/nepomuk/rcgen/fastcode.cpp:30: warning: unused parameter nameSpace
/var/tmp/portage/kde-base/kdelibs-4.3.3-r1/work/kdelibs-4.3.3/nepomuk/rcgen/fastcode.cpp:44: warning: unused parameter property
/var/tmp/portage/kde-base/kdelibs-4.3.3-r1/work/kdelibs-4.3.3/nepomuk/rcgen/fastcode.cpp:44: warning: unused parameter rc
/var/tmp/portage/kde-base/kdelibs-4.3.3-r1/work/kdelibs-4.3.3/nepomuk/rcgen/fastcode.cpp:44: warning: unused parameter nameSpace
/var/tmp/portage/kde-base/kdelibs-4.3.3-r1/work/kdelibs-4.3.3/nepomuk/rcgen/fastcode.cpp:49: warning: unused parameter rc
/var/tmp/portage/kde-base/kdelibs-4.3.3-r1/work/kdelibs-4.3.3/nepomuk/rcgen/fastcode.cpp:49: warning: unused parameter nameSpace
/var/tmp/portage/kde-base/kdelibs-4.3.3-r1/work/kdelibs-4.3.3/nepomuk/rcgen/fastcode.cpp:54: warning: unused parameter baseRc
/var/tmp/portage/kde-base/kdelibs-4.3.3-r1/work/kdelibs-4.3.3/nepomuk/rcgen/fastcode.cpp:54: warning: unused parameter rc
/var/tmp/portage/kde-base/kdelibs-4.3.3-r1/work/kdelibs-4.3.3/nepomuk/rcgen/fastcode.cpp:54: warning: unused parameter nameSpace
/var/tmp/portage/kde-base/kdelibs-4.3.3-r1/work/kdelibs-4.3.3/nepomuk/rcgen/fastcode.cpp:88: warning: unused parameter property
/var/tmp/portage/kde-base/kdelibs-4.3.3-r1/work/kdelibs-4.3.3/nepomuk/rcgen/fastcode.cpp:88: warning: unused parameter rc
/var/tmp/portage/kde-base/kdelibs-4.3.3-r1/work/kdelibs-4.3.3/nepomuk/rcgen/fastcode.cpp:108: warning: unused parameter property
/var/tmp/portage/kde-base/kdelibs-4.3.3-r1/work/kdelibs-4.3.3/nepomuk/rcgen/fastcode.cpp:108: warning: unused parameter rc
/var/tmp/portage/kde-base/kdelibs-4.3.3-r1/work/kdelibs-4.3.3/nepomuk/rcgen/fastcode.cpp:113: warning: unused parameter rc
/var/tmp/portage/kde-base/kdelibs-4.3.3-r1/work/kdelibs-4.3.3/nepomuk/rcgen/fastcode.cpp:118: warning: unused parameter baseRc
/var/tmp/portage/kde-base/kdelibs-4.3.3-r1/work/kdelibs-4.3.3/nepomuk/rcgen/fastcode.cpp:118: warning: unused parameter rc
[  0%] [34m[1mGenerating dataenginescript.moc
[0m[32mBuilding CXX object nepomuk/rcgen/CMakeFiles/nepomuk-rcgen.dir/property.o
[0m[34m[1mGenerating datacontainer.moc
[0m[34m[1mGenerating paneltoolbox_p.moc
[0m[34m[1mGenerating nativetabbar_p.moc
[0m[34m[1mGenerating checkbox.moc
[0m[34m[1mGenerating scrollwidget.moc
[0m[  0%] [32mBuilding CXX object nepomuk/rcgen/CMakeFiles/nepomuk-rcgen.dir/rcgen.o
[0m[34m[1mGenerating packages_p.moc
[0m[34m[1mGenerating servicejob.moc
[0m[34m[1mGenerating glapplet.moc
[0m[  0%] [32mBuilding CXX object nepomuk/rcgen/CMakeFiles/nepomuk-rcgen.dir/resourceclass.o
[0m[  0%] [32mBuilding CXX object nepomuk/rcgen/CMakeFiles/nepomuk-rcgen.dir/safecode.o
[0m[34m[1mGenerating flashinglabel.moc
[0m[34m[1mGenerating extenderitem.moc
[0m[34m[1mGenerating toolbox_p.moc
[0m[  0%] [32mBuilding CXX object nepomuk/rcgen/CMakeFiles/nepomuk-rcgen.dir/ontologyparser.o
[0m[34m[1mGenerating applethandle_p.moc
[0m[34m[1mGenerating corona.moc
[0m[34m[1mGenerating animationdriver.moc
[0m[34m[1mGenerating textedit.moc
[0m[34m[1mGenerating spinbox.moc
[0m[34m[1mGenerating busywidget.moc
[0m[34m[1mGenerating service.moc
[0m[34m[1mGenerating wallpaperrenderthread_p.moc
[0m[34m[1mGenerating containment.moc
[0m[34m[1mGenerating dataenginemanager.moc
[0m[0m[  0%] [32mBuilding CXX object kdecore/CMakeFiles/kdecore.dir/kdecore_automoc.o
[0m[  0%] [32mBuilding CXX object kdecore/CMakeFiles/kdecore.dir/compression/kgzipfilter.o
[0m[34m[1mGenerating scriptengine.moc
[0m[34m[1mGenerating extendergroup.moc
[0m[  0%] [32mBuilding CXX object kdecore/CMakeFiles/kdecore.dir/compression/kfilterbase.o
[34m[1mGenerating iconwidget.moc
[0m[0m[34m[1mGenerating animator.moc
[0m[34m[1mGenerating private/applet_p.moc
[0m[34m[1mGenerating delegate.moc
[0m[  0%] [32mBuilding CXX object kdecore/CMakeFiles/kdecore.dir/compression/kfilterdev.o
[0m[34m[1mGenerating frame.moc
[0m[34m[1mGenerating tooltipmanager.moc
[0m[34m[1mGenerating toolbutton.moc
[0m[34m[1mGenerating radiobutton.moc
[0m[34m[1mGenerating windowpreview_p.moc
[0m[34m[1mGenerating abstractrunner.moc
[0m[  0%] [32mBuilding CXX object kdecore/CMakeFiles/kdecore.dir/config/kconfig.o
[0m[34m[1mGenerating applet.moc
[0m/var/tmp/portage/kde-base/kdelibs-4.3.3-r1/work/kdelibs-4.3.3/nepomuk/rcgen/ontologyparser.cpp:241: warning: unused parameter externalRefs
[  0%] [32mBuilding CXX object nepomuk/rcgen/CMakeFiles/nepomuk-rcgen.dir/qrc_templates.o
[0m[31m[1mLinking CXX executable ../../bin/nepomuk-rcgen
[0m[34m[1mGenerating wallpaper.moc
[0m/usr/lib/gcc/i686-pc-linux-gnu/4.3.4/../../../libsoprano.so: undefined reference to `QHashData::detach_helper2(void (*)(QHashData::Node*, void*), void (*)(QHashData::Node*), int, int)'
/usr/lib/gcc/i686-pc-linux-gnu/4.3.4/../../../libsoprano.so: undefined reference to `QListData::append2(QListData const&)'
/usr/lib/gcc/i686-pc-linux-gnu/4.3.4/../../../libsoprano.so: undefined reference to `QHashData::allocateNode(int)'
/usr/lib/gcc/i686-pc-linux-gnu/4.3.4/../../../libsoprano.so: undefined reference to `QVectorData::free(QVectorData*, int)'
/usr/lib/gcc/i686-pc-linux-gnu/4.3.4/../../../libsoprano.so: undefined reference to `qBadAlloc()'
/usr/lib/gcc/i686-pc-linux-gnu/4.3.4/../../../libsoprano.so: undefined reference to `QVariant::QVariant(int, void const*, unsigned int)'
/usr/lib/gcc/i686-pc-linux-gnu/4.3.4/../../../libsoprano.so: undefined reference to `QListData::detach3()'
/usr/lib/gcc/i686-pc-linux-gnu/4.3.4/../../../libsoprano.so: undefined reference to `QHashData::free_helper(void (*)(QHashData::Node*))'
/usr/lib/gcc/i686-pc-linux-gnu/4.3.4/../../../libsoprano.so: undefined reference to `QVectorData::allocate(int, int)'
collect2: ld returned 1 exit status
make[2]: *** [bin/nepomuk-rcgen] Error 1
make[1]: *** [nepomuk/rcgen/CMakeFiles/nepomuk-rcgen.dir/all] Error 2
make[1]: *** Waiting for unfinished jobs....
[  0%] [32mBuilding CXX object kdecore/CMakeFiles/kdecore.dir/config/kconfigbase.o
[0m[34m[1mGenerating slider.moc
[0m[34m[1mGenerating appletscript.moc
[0m[34m[1mGenerating webview.moc
[0m[  0%] [32mBuilding CXX object kdecore/CMakeFiles/kdecore.dir/config/kconfiggroup.o
[0m[34m[1mGenerating desktoptoolbox_p.moc
[0m[34m[1mGenerating packagestructure.moc
[0m[34m[1mGenerating style_p.moc
[0m[34m[1mGenerating tooltip_p.moc
[0m[34m[1mGenerating view.moc
[0m[34m[1mGenerating dialog.moc
[0m[34m[1mGenerating treeview.moc
[0m[  0%] [32mBuilding CXX object kdecore/CMakeFiles/kdecore.dir/config/kconfigbackend.o
[0m[34m[1mGenerating runnermanager.moc
[0m[34m[1mGenerating lineedit.moc
[0m[  0%] [32mBuilding CXX object kdecore/CMakeFiles/kdecore.dir/config/kconfigini.o
[0m[34m[1mGenerating popupapplet.moc
[0m/var/tmp/portage/kde-base/kdelibs-4.3.3-r1/work/kdelibs-4.3.3/kdecore/config/kconfiggroup.cpp: In member function void KConfigGroup::changeGroup(const QString&):
/var/tmp/portage/kde-base/kdelibs-4.3.3-r1/work/kdelibs-4.3.3/kdecore/config/kconfiggroup.cpp:651: warning: void KConfigGroup::changeGroup(const char*) is deprecated (declared at /var/tmp/portage/kde-base/kdelibs-4.3.3-r1/work/kdelibs-4.3.3/kdecore/config/kconfiggroup.h:159)
[  0%] [34m[1mGenerating dataengine.moc
[0m[32mBuilding CXX object kdecore/CMakeFiles/kdecore.dir/config/kdesktopfile.o
[0m[34m[1mGenerating moc_extenderitemmimedata_p.cpp
[0m[  0%] Built target plasma_automoc
[  0%] [32mBuilding CXX object kdecore/CMakeFiles/kdecore.dir/config/ksharedconfig.o
[0m[  0%] [32mBuilding CXX object kdecore/CMakeFiles/kdecore.dir/config/kcoreconfigskeleton.o
[0m[  0%] [32mBuilding CXX object kdecore/CMakeFiles/kdecore.dir/date/kcalendarsystem.o
[0m[  0%] [32mBuilding CXX object kdecore/CMakeFiles/kdecore.dir/date/kcalendarsystemgregorian.o
[0m[  0%] [32mBuilding CXX object kdecore/CMakeFiles/kdecore.dir/date/kcalendarsystemhijri.o
[0m[  0%] [32mBuilding CXX object kdecore/CMakeFiles/kdecore.dir/date/kcalendarsystemhebrew.o
[0m[  0%] [32mBuilding CXX object kdecore/CMakeFiles/kdecore.dir/date/kcalendarsystemjalali.o
[0m[  0%] [32mBuilding CXX object kdecore/CMakeFiles/kdecore.dir/date/kdatetime.o
[0m[  0%] [32mBuilding CXX object kdecore/CMakeFiles/kdecore.dir/date/ktimezone.o
[0m[  1%] [32mBuilding CXX object kdecore/CMakeFiles/kdecore.dir/date/ksystemtimezone.o
[0m[  1%] [32mBuilding CXX object kdecore/CMakeFiles/kdecore.dir/date/ktzfiletimezone.o
[0m/var/tmp/portage/kde-base/kdelibs-4.3.3-r1/work/kdelibs-4.3.3/kdecore/date/kdatetime.cpp:2315: warning: unused parameter newTime
[  1%] [32mBuilding CXX object kdecore/CMakeFiles/kdecore.dir/io/kautosavefile.o
[0m/var/tmp/portage/kde-base/kdelibs-4.3.3-r1/work/kdelibs-4.3.3/kdecore/date/ksystemtimezone.cpp:205: warning: unused parameter tz
[  1%] [32mBuilding CXX object kdecore/CMakeFiles/kdecore.dir/io/kdebug.o
[0m[  1%] [32mBuilding CXX object kdecore/CMakeFiles/kdecore.dir/io/kdebugdbusiface.o
[0m[  1%] [32mBuilding CXX object kdecore/CMakeFiles/kdecore.dir/io/kmessage.o
[0m[  1%] [32mBuilding CXX object kdecore/CMakeFiles/kdecore.dir/io/kprocess.o
[0m[  1%] [32mBuilding CXX object kdecore/CMakeFiles/kdecore.dir/io/ksavefile.o
[0m[  1%] [  1%] [32mBuilding CXX object kdecore/CMakeFiles/kdecore.dir/io/ktempdir.o
[0m[32mBuilding CXX object kdecore/CMakeFiles/kdecore.dir/io/ktemporaryfile.o
[0m[  1%] [32mBuilding CXX object kdecore/CMakeFiles/kdecore.dir/io/kurl.o
[0m[  1%] [32mBuilding CXX object kdecore/CMakeFiles/kdecore.dir/jobs/kcompositejob.o
[0m/var/tmp/portage/kde-base/kdelibs-4.3.3-r1/work/kdelibs-4.3.3/kdecore/io/ktempdir.cpp: In member function bool KTempDir::create(const QString&, int):
/var/tmp/portage/kde-base/kdelibs-4.3.3-r1/work/kdelibs-4.3.3/kdecore/io/ktempdir.cpp:132: warning: ignoring return value of int chown(const char*, __uid_t, __gid_t), declared with attribute warn_unused_result
[  1%] [32mBuilding CXX object kdecore/CMakeFiles/kdecore.dir/jobs/kjob.o
[0m[  1%] [32mBuilding CXX object kdecore/CMakeFiles/kdecore.dir/jobs/kjobuidelegate.o
[0m[  1%] [32mBuilding CXX object kdecore/CMakeFiles/kdecore.dir/jobs/kjobtrackerinterface.o
[0m[  1%] [  1%] [32mBuilding CXX object kdecore/CMakeFiles/kdecore.dir/kernel/kauthorized.o
[0m[32mBuilding CXX object kdecore/CMakeFiles/kdecore.dir/kernel/kautostart.o
[0m[  1%] [32mBuilding CXX object kdecore/CMakeFiles/kdecore.dir/kernel/kaboutdata.o
[0m/var/tmp/portage/kde-base/kdelibs-4.3.3-r1/work/kdelibs-4.3.3/kdecore/kernel/kauthorized.cpp:44:2: warning: #warning used non public api for now
[  1%] [32mBuilding CXX object kdecore/CMakeFiles/kdecore.dir/kernel/kcmdlineargs.o
[0m[  1%] [32mBuilding CXX object kdecore/CMakeFiles/kdecore.dir/kernel/kglobal.o
[0m[  1%] [32mBuilding CXX object kdecore/CMakeFiles/kdecore.dir/kernel/kcomponentdata.o
[0m[  1%] [32mBuilding CXX object kdecore/CMakeFiles/kdecore.dir/kernel/kstandarddirs.o
[0m[  1%] [32mBuilding CXX object kdecore/CMakeFiles/kdecore.dir/kernel/ktoolinvocation.o
[0m[  1%] [32mBuilding CXX object kdecore/CMakeFiles/kdecore.dir/services/kfoldermimetype.o
[0m[  1%] [32mBuilding CXX object kdecore/CMakeFiles/kdecore.dir/services/kmimetypefactory.o
[0m[  1%] [32mBuilding CXX object kdecore/CMakeFiles/kdecore.dir/services/kmimemagicrule.o
[0m[  2%] [32mBuilding CXX object kdecore/CMakeFiles/kdecore.dir/services/kmimetypetrader.o
[0m[  2%] [32mBuilding CXX object kdecore/CMakeFiles/kdecore.dir/services/kmimetype.o
[0m[  2%] [32mBuilding CXX object kdecore/CMakeFiles/kdecore.dir/services/kservice.o
[0m/var/tmp/portage/kde-base/kdelibs-4.3.3-r1/work/kdelibs-4.3.3/kdecore/sycoca/ksycocafactory.h: In instantiation of void KSycocaFactorySingleton<F>::instanceDestroyed(F*) [with F = KMimeTypeFactory]:
/var/tmp/portage/kde-base/kdelibs-4.3.3-r1/work/kdelibs-4.3.3/kdecore/services/kmimetypefactory.cpp:82:   instantiated from here
/var/tmp/portage/kde-base/kdelibs-4.3.3-r1/work/kdelibs-4.3.3/kdecore/sycoca/ksycocafactory.h:192: warning: unused parameter factory
[  2%] [32mBuilding CXX object kdecore/CMakeFiles/kdecore.dir/services/kserviceaction.o
[0m[  2%] [32mBuilding CXX object kdecore/CMakeFiles/kdecore.dir/services/kservicefactory.o
[0m/var/tmp/portage/kde-base/kdelibs-4.3.3-r1/work/kdelibs-4.3.3/kdecore/sycoca/ksycocafactory.h: In instantiation of void KSycocaFactorySingleton<F>::instanceDestroyed(F*) [with F = KServiceFactory]:
/var/tmp/portage/kde-base/kdelibs-4.3.3-r1/work/kdelibs-4.3.3/kdecore/services/kservicefactory.cpp:67:   instantiated from here
/var/tmp/portage/kde-base/kdelibs-4.3.3-r1/work/kdelibs-4.3.3/kdecore/sycoca/ksycocafactory.h:192: warning: unused parameter factory
[  2%] [32mBuilding CXX object kdecore/CMakeFiles/kdecore.dir/services/kservicegroup.o
[0m[  2%] [32mBuilding CXX object kdecore/CMakeFiles/kdecore.dir/services/kservicegroupfactory.o
[0m[  2%] [32mBuilding CXX object kdecore/CMakeFiles/kdecore.dir/services/kserviceoffer.o
[0m/var/tmp/portage/kde-base/kdelibs-4.3.3-r1/work/kdelibs-4.3.3/kdecore/sycoca/ksycocafactory.h: In instantiation of void KSycocaFactorySingleton<F>::instanceDestroyed(F*) [with F = KServiceGroupFactory]:
/var/tmp/portage/kde-base/kdelibs-4.3.3-r1/work/kdelibs-4.3.3/kdecore/services/kservicegroupfactory.cpp:57:   instantiated from here
/var/tmp/portage/kde-base/kdelibs-4.3.3-r1/work/kdelibs-4.3.3/kdecore/sycoca/ksycocafactory.h:192: warning: unused parameter factory
[  2%] [32mBuilding CXX object kdecore/CMakeFiles/kdecore.dir/services/kservicetype.o
[0m[  2%] [32mBuilding CXX object kdecore/CMakeFiles/kdecore.dir/services/kservicetypefactory.o
[0m/var/tmp/portage/kde-base/kdelibs-4.3.3-r1/work/kdelibs-4.3.3/kdecore/sycoca/ksycocafactory.h: In instantiation of void KSycocaFactorySingleton<F>::instanceDestroyed(F*) [with F = KServiceTypeFactory]:
/var/tmp/portage/kde-base/kdelibs-4.3.3-r1/work/kdelibs-4.3.3/kdecore/services/kservicetypefactory.cpp:60:   instantiated from here
/var/tmp/portage/kde-base/kdelibs-4.3.3-r1/work/kdelibs-4.3.3/kdecore/sycoca/ksycocafactory.h:192: warning: unused parameter factory
[  2%] [32mBuilding CXX object kdecore/CMakeFiles/kdecore.dir/services/kservicetypeprofile.o
[0m[  2%] [32mBuilding CXX object kdecore/CMakeFiles/kdecore.dir/services/kservicetypetrader.o
[0m[  2%] [32mBuilding CXX object kdecore/CMakeFiles/kdecore.dir/services/ktraderparse.o
[0m[  2%] [32mBuilding CXX object kdecore/CMakeFiles/kdecore.dir/services/ktraderparsetree.o
[0m[  2%] [32mBuilding C object kdecore/CMakeFiles/kdecore.dir/services/yacc.o
[0m[  2%] [32mBuilding C object kdecore/CMakeFiles/kdecore.dir/services/lex.o
[0m[  2%] [32mBuilding CXX object kdecore/CMakeFiles/kdecore.dir/services/kplugininfo.o
[0mlex.c: In function yy_fatal_error:
lex.c:1811: warning: unused parameter yyscanner
lex.c: In function kiotraderalloc:
lex.c:2143: warning: unused parameter yyscanner
lex.c: In function kiotraderrealloc:
lex.c:2148: warning: unused parameter yyscanner
lex.c: In function kiotraderfree:
lex.c:2160: warning: unused parameter yyscanner
lex.l: At top level:
lex.c:1337: warning: yyunput defined but not used
lex.c:1381: warning: input defined but not used
[  2%] [32mBuilding CXX object kdecore/CMakeFiles/kdecore.dir/sonnet/loader.o
[0m[  2%] [32mBuilding CXX object kdecore/CMakeFiles/kdecore.dir/sonnet/client.o
[0m[  2%] [32mBuilding CXX object kdecore/CMakeFiles/kdecore.dir/sonnet/spellerplugin.o
[0m[  2%] [32mBuilding CXX object kdecore/CMakeFiles/kdecore.dir/sonnet/speller.o
[0m[  2%] [32mBuilding CXX object kdecore/CMakeFiles/kdecore.dir/sonnet/filter.o
[0m[  2%] [32mBuilding CXX object kdecore/CMakeFiles/kdecore.dir/sonnet/settings.o
[0m[  2%] [32mBuilding CXX object kdecore/CMakeFiles/kdecore.dir/sonnet/backgroundchecker.o
[0m[  2%] [32mBuilding CXX object kdecore/CMakeFiles/kdecore.dir/sonnet/backgroundengine.o
[0m[  2%] [32mBuilding CXX object kdecore/CMakeFiles/kdecore.dir/sonnet/globals.o
[0m[  3%] [32mBuilding CXX object kdecore/CMakeFiles/kdecore.dir/network/k3socketdevice.o
[0m[  3%] [32mBuilding CXX object kdecore/CMakeFiles/kdecore.dir/network/k3bufferedsocket.o
[0m[  3%] [32mBuilding CXX object kdecore/CMakeFiles/kdecore.dir/network/k3clientsocketbase.o
[0mIn file included from /var/tmp/portage/kde-base/kdelibs-4.3.3-r1/work/kdelibs-4.3.3/kdecore/network/k3streamsocket.h:31,
                 from /var/tmp/portage/kde-base/kdelibs-4.3.3-r1/work/kdelibs-4.3.3/kdecore/network/k3bufferedsocket.h:30,
                 from /var/tmp/portage/kde-base/kdelibs-4.3.3-r1/work/kdelibs-4.3.3/kdecore/network/k3bufferedsocket.cpp:26:
/var/tmp/portage/kde-base/kdelibs-4.3.3-r1/work/kdelibs-4.3.3/kdecore/network/k3socketbase.h:701: warning: virtual qint64 KNetwork::KActiveSocketBase::readData(char*, qint64) was hidden
/var/tmp/portage/kde-base/kdelibs-4.3.3-r1/work/kdelibs-4.3.3/kdecore/network/k3clientsocketbase.h:452: warning:   by virtual qint64 KNetwork::KClientSocketBase::readData(char*, qint64, KNetwork::KSocketAddress*)
/var/tmp/portage/kde-base/kdelibs-4.3.3-r1/work/kdelibs-4.3.3/kdecore/network/k3socketbase.h:736: warning: virtual qint64 KNetwork::KActiveSocketBase::writeData(const char*, qint64) was hidden
/var/tmp/portage/kde-base/kdelibs-4.3.3-r1/work/kdelibs-4.3.3/kdecore/network/k3clientsocketbase.h:463: warning:   by virtual qint64 KNetwork::KClientSocketBase::writeData(const char*, qint64, const KNetwork::KSocketAddress*)
In file included from /var/tmp/portage/kde-base/kdelibs-4.3.3-r1/work/kdelibs-4.3.3/kdecore/network/k3bufferedsocket.cpp:34:
/var/tmp/portage/kde-base/kdelibs-4.3.3-r1/work/kdelibs-4.3.3/kdecore/network/k3socketbase.h:701: warning: virtual qint64 KNetwork::KActiveSocketBase::readData(char*, qint64) was hidden
/var/tmp/portage/kde-base/kdelibs-4.3.3-r1/work/kdelibs-4.3.3/kdecore/network/k3socketdevice.h:265: warning:   by virtual qint64 KNetwork::KSocketDevice::readData(char*, qint64, KNetwork::KSocketAddress*)
/var/tmp/portage/kde-base/kdelibs-4.3.3-r1/work/kdelibs-4.3.3/kdecore/network/k3socketbase.h:736: warning: virtual qint64 KNetwork::KActiveSocketBase::writeData(const char*, qint64) was hidden
/var/tmp/portage/kde-base/kdelibs-4.3.3-r1/work/kdelibs-4.3.3/kdecore/network/k3socketdevice.h:276: warning:   by virtual qint64 KNetwork::KSocketDevice::writeData(const char*, qint64, const KNetwork::KSocketAddress*)
[  3%] [32mBuilding CXX object kdecore/CMakeFiles/kdecore.dir/network/k3datagramsocket.o
[0mIn file included from /var/tmp/portage/kde-base/kdelibs-4.3.3-r1/work/kdelibs-4.3.3/kdecore/network/k3socketdevice.cpp:29:
/var/tmp/portage/kde-base/kdelibs-4.3.3-r1/work/kdelibs-4.3.3/kdecore/network/k3socketbase.h:701: warning: virtual qint64 KNetwork::KActiveSocketBase::readData(char*, qint64) was hidden
/var/tmp/portage/kde-base/kdelibs-4.3.3-r1/work/kdelibs-4.3.3/kdecore/network/k3socketdevice.h:265: warning:   by virtual qint64 KNetwork::KSocketDevice::readData(char*, qint64, KNetwork::KSocketAddress*)
/var/tmp/portage/kde-base/kdelibs-4.3.3-r1/work/kdelibs-4.3.3/kdecore/network/k3socketbase.h:736: warning: virtual qint64 KNetwork::KActiveSocketBase::writeData(const char*, qint64) was hidden
/var/tmp/portage/kde-base/kdelibs-4.3.3-r1/work/kdelibs-4.3.3/kdecore/network/k3socketdevice.h:276: warning:   by virtual qint64 KNetwork::KSocketDevice::writeData(const char*, qint64, const KNetwork::KSocketAddress*)
[  3%] [32mBuilding CXX object kdecore/CMakeFiles/kdecore.dir/network/k3resolver.o
[0mIn file included from /var/tmp/portage/kde-base/kdelibs-4.3.3-r1/work/kdelibs-4.3.3/kdecore/network/k3datagramsocket.h:32,
                 from /var/tmp/portage/kde-base/kdelibs-4.3.3-r1/work/kdelibs-4.3.3/kdecore/network/k3datagramsocket.cpp:26:
/var/tmp/portage/kde-base/kdelibs-4.3.3-r1/work/kdelibs-4.3.3/kdecore/network/k3socketbase.h:701: warning: virtual qint64 KNetwork::KActiveSocketBase::readData(char*, qint64) was hidden
/var/tmp/portage/kde-base/kdelibs-4.3.3-r1/work/kdelibs-4.3.3/kdecore/network/k3clientsocketbase.h:452: warning:   by virtual qint64 KNetwork::KClientSocketBase::readData(char*, qint64, KNetwork::KSocketAddress*)
/var/tmp/portage/kde-base/kdelibs-4.3.3-r1/work/kdelibs-4.3.3/kdecore/network/k3socketbase.h:736: warning: virtual qint64 KNetwork::KActiveSocketBase::writeData(const char*, qint64) was hidden
/var/tmp/portage/kde-base/kdelibs-4.3.3-r1/work/kdelibs-4.3.3/kdecore/network/k3clientsocketbase.h:463: warning:   by virtual qint64 KNetwork::KClientSocketBase::writeData(const char*, qint64, const KNetwork::KSocketAddress*)
In file included from /var/tmp/portage/kde-base/kdelibs-4.3.3-r1/work/kdelibs-4.3.3/kdecore/network/k3datagramsocket.cpp:36:
/var/tmp/portage/kde-base/kdelibs-4.3.3-r1/work/kdelibs-4.3.3/kdecore/network/k3socketbase.h:701: warning: virtual qint64 KNetwork::KActiveSocketBase::readData(char*, qint64) was hidden
/var/tmp/portage/kde-base/kdelibs-4.3.3-r1/work/kdelibs-4.3.3/kdecore/network/k3socketdevice.h:265: warning:   by virtual qint64 KNetwork::KSocketDevice::readData(char*, qint64, KNetwork::KSocketAddress*)
/var/tmp/portage/kde-base/kdelibs-4.3.3-r1/work/kdelibs-4.3.3/kdecore/network/k3socketbase.h:736: warning: virtual qint64 KNetwork::KActiveSocketBase::writeData(const char*, qint64) was hidden
/var/tmp/portage/kde-base/kdelibs-4.3.3-r1/work/kdelibs-4.3.3/kdecore/network/k3socketdevice.h:276: warning:   by virtual qint64 KNetwork::KSocketDevice::writeData(const char*, qint64, const KNetwork::KSocketAddress*)
[  3%] [32mBuilding CXX object kdecore/CMakeFiles/kdecore.dir/network/k3resolvermanager.o
[0mIn file included from /var/tmp/portage/kde-base/kdelibs-4.3.3-r1/work/kdelibs-4.3.3/kdecore/network/k3clientsocketbase.cpp:26:
/var/tmp/portage/kde-base/kdelibs-4.3.3-r1/work/kdelibs-4.3.3/kdecore/network/k3socketbase.h:701: warning: virtual qint64 KNetwork::KActiveSocketBase::readData(char*, qint64) was hidden
/var/tmp/portage/kde-base/kdelibs-4.3.3-r1/work/kdelibs-4.3.3/kdecore/network/k3clientsocketbase.h:452: warning:   by virtual qint64 KNetwork::KClientSocketBase::readData(char*, qint64, KNetwork::KSocketAddress*)
/var/tmp/portage/kde-base/kdelibs-4.3.3-r1/work/kdelibs-4.3.3/kdecore/network/k3socketbase.h:736: warning: virtual qint64 KNetwork::KActiveSocketBase::writeData(const char*, qint64) was hidden
/var/tmp/portage/kde-base/kdelibs-4.3.3-r1/work/kdelibs-4.3.3/kdecore/network/k3clientsocketbase.h:463: warning:   by virtual qint64 KNetwork::KClientSocketBase::writeData(const char*, qint64, const KNetwork::KSocketAddress*)
In file included from /var/tmp/portage/kde-base/kdelibs-4.3.3-r1/work/kdelibs-4.3.3/kdecore/network/k3clientsocketbase.cpp:38:
/var/tmp/portage/kde-base/kdelibs-4.3.3-r1/work/kdelibs-4.3.3/kdecore/network/k3socketbase.h:701: warning: virtual qint64 KNetwork::KActiveSocketBase::readData(char*, qint64) was hidden
/var/tmp/portage/kde-base/kdelibs-4.3.3-r1/work/kdelibs-4.3.3/kdecore/network/k3socketdevice.h:265: warning:   by virtual qint64 KNetwork::KSocketDevice::readData(char*, qint64, KNetwork::KSocketAddress*)
/var/tmp/portage/kde-base/kdelibs-4.3.3-r1/work/kdelibs-4.3.3/kdecore/network/k3socketbase.h:736: warning: virtual qint64 KNetwork::KActiveSocketBase::writeData(const char*, qint64) was hidden
/var/tmp/portage/kde-base/kdelibs-4.3.3-r1/work/kdelibs-4.3.3/kdecore/network/k3socketdevice.h:276: warning:   by virtual qint64 KNetwork::KSocketDevice::writeData(const char*, qint64, const KNetwork::KSocketAddress*)
[  3%] [32mBuilding CXX object kdecore/CMakeFiles/kdecore.dir/network/k3resolverworkerbase.o
[0m[  3%] [32mBuilding CXX object kdecore/CMakeFiles/kdecore.dir/network/k3resolverstandardworkers.o
[0m[  3%] [  3%] [32mBuilding CXX object kdecore/CMakeFiles/kdecore.dir/network/k3reverseresolver.o
[0m[32mBuilding CXX object kdecore/CMakeFiles/kdecore.dir/network/k3serversocket.o
[0m[  3%] [32mBuilding CXX object kdecore/CMakeFiles/kdecore.dir/network/k3socketaddress.o
[0m[  3%] [32mBuilding CXX object kdecore/CMakeFiles/kdecore.dir/network/k3socketbase.o
[0mIn file included from /var/tmp/portage/kde-base/kdelibs-4.3.3-r1/work/kdelibs-4.3.3/kdecore/network/k3streamsocket.h:31,
                 from /var/tmp/portage/kde-base/kdelibs-4.3.3-r1/work/kdelibs-4.3.3/kdecore/network/k3serversocket.h:31,
                 from /var/tmp/portage/kde-base/kdelibs-4.3.3-r1/work/kdelibs-4.3.3/kdecore/network/k3serversocket.cpp:26:
/var/tmp/portage/kde-base/kdelibs-4.3.3-r1/work/kdelibs-4.3.3/kdecore/network/k3socketbase.h:701: warning: virtual qint64 KNetwork::KActiveSocketBase::readData(char*, qint64) was hidden
/var/tmp/portage/kde-base/kdelibs-4.3.3-r1/work/kdelibs-4.3.3/kdecore/network/k3clientsocketbase.h:452: warning:   by virtual qint64 KNetwork::KClientSocketBase::readData(char*, qint64, KNetwork::KSocketAddress*)
/var/tmp/portage/kde-base/kdelibs-4.3.3-r1/work/kdelibs-4.3.3/kdecore/network/k3socketbase.h:736: warning: virtual qint64 KNetwork::KActiveSocketBase::writeData(const char*, qint64) was hidden
/var/tmp/portage/kde-base/kdelibs-4.3.3-r1/work/kdelibs-4.3.3/kdecore/network/k3clientsocketbase.h:463: warning:   by virtual qint64 KNetwork::KClientSocketBase::writeData(const char*, qint64, const KNetwork::KSocketAddress*)
In file included from /var/tmp/portage/kde-base/kdelibs-4.3.3-r1/work/kdelibs-4.3.3/kdecore/network/k3serversocket.cpp:37:
/var/tmp/portage/kde-base/kdelibs-4.3.3-r1/work/kdelibs-4.3.3/kdecore/network/k3socketbase.h:701: warning: virtual qint64 KNetwork::KActiveSocketBase::readData(char*, qint64) was hidden
/var/tmp/portage/kde-base/kdelibs-4.3.3-r1/work/kdelibs-4.3.3/kdecore/network/k3socketdevice.h:265: warning:   by virtual qint64 KNetwork::KSocketDevice::readData(char*, qint64, KNetwork::KSocketAddress*)
/var/tmp/portage/kde-base/kdelibs-4.3.3-r1/work/kdelibs-4.3.3/kdecore/network/k3socketbase.h:736: warning: virtual qint64 KNetwork::KActiveSocketBase::writeData(const char*, qint64) was hidden
/var/tmp/portage/kde-base/kdelibs-4.3.3-r1/work/kdelibs-4.3.3/kdecore/network/k3socketdevice.h:276: warning:   by virtual qint64 KNetwork::KSocketDevice::writeData(const char*, qint64, const KNetwork::KSocketAddress*)
[  3%] [32mBuilding CXX object kdecore/CMakeFiles/kdecore.dir/network/k3streamsocket.o
[0mIn file included from /var/tmp/portage/kde-base/kdelibs-4.3.3-r1/work/kdelibs-4.3.3/kdecore/network/k3streamsocket.h:31,
                 from /var/tmp/portage/kde-base/kdelibs-4.3.3-r1/work/kdelibs-4.3.3/kdecore/network/k3streamsocket.cpp:26:
/var/tmp/portage/kde-base/kdelibs-4.3.3-r1/work/kdelibs-4.3.3/kdecore/network/k3socketbase.h:701: warning: virtual qint64 KNetwork::KActiveSocketBase::readData(char*, qint64) was hidden
/var/tmp/portage/kde-base/kdelibs-4.3.3-r1/work/kdelibs-4.3.3/kdecore/network/k3clientsocketbase.h:452: warning:   by virtual qint64 KNetwork::KClientSocketBase::readData(char*, qint64, KNetwork::KSocketAddress*)
/var/tmp/portage/kde-base/kdelibs-4.3.3-r1/work/kdelibs-4.3.3/kdecore/network/k3socketbase.h:736: warning: virtual qint64 KNetwork::KActiveSocketBase::writeData(const char*, qint64) was hidden
/var/tmp/portage/kde-base/kdelibs-4.3.3-r1/work/kdelibs-4.3.3/kdecore/network/k3clientsocketbase.h:463: warning:   by virtual qint64 KNetwork::KClientSocketBase::writeData(const char*, qint64, const KNetwork::KSocketAddress*)
In file included from /var/tmp/portage/kde-base/kdelibs-4.3.3-r1/work/kdelibs-4.3.3/kdecore/network/k3streamsocket.cpp:38:
/var/tmp/portage/kde-base/kdelibs-4.3.3-r1/work/kdelibs-4.3.3/kdecore/network/k3socketbase.h:701: warning: virtual qint64 KNetwork::KActiveSocketBase::readData(char*, qint64) was hidden
/var/tmp/portage/kde-base/kdelibs-4.3.3-r1/work/kdelibs-4.3.3/kdecore/network/k3socketdevice.h:265: warning:   by virtual qint64 KNetwork::KSocketDevice::readData(char*, qint64, KNetwork::KSocketAddress*)
/var/tmp/portage/kde-base/kdelibs-4.3.3-r1/work/kdelibs-4.3.3/kdecore/network/k3socketbase.h:736: warning: virtual qint64 KNetwork::KActiveSocketBase::writeData(const char*, qint64) was hidden
/var/tmp/portage/kde-base/kdelibs-4.3.3-r1/work/kdelibs-4.3.3/kdecore/network/k3socketdevice.h:276: warning:   by virtual qint64 KNetwork::KSocketDevice::writeData(const char*, qint64, const KNetwork::KSocketAddress*)
[  3%] [32mBuilding CXX object kdecore/CMakeFiles/kdecore.dir/network/k3socketbuffer.o
[0m[  3%] In file included from /var/tmp/portage/kde-base/kdelibs-4.3.3-r1/work/kdelibs-4.3.3/kdecore/network/k3socketbase.cpp:33:
/var/tmp/portage/kde-base/kdelibs-4.3.3-r1/work/kdelibs-4.3.3/kdecore/network/k3socketbase.h:701: warning: virtual qint64 KNetwork::KActiveSocketBase::readData(char*, qint64) was hidden
/var/tmp/portage/kde-base/kdelibs-4.3.3-r1/work/kdelibs-4.3.3/kdecore/network/k3socketdevice.h:265: warning:   by virtual qint64 KNetwork::KSocketDevice::readData(char*, qint64, KNetwork::KSocketAddress*)
/var/tmp/portage/kde-base/kdelibs-4.3.3-r1/work/kdelibs-4.3.3/kdecore/network/k3socketbase.h:736: warning: virtual qint64 KNetwork::KActiveSocketBase::writeData(const char*, qint64) was hidden
/var/tmp/portage/kde-base/kdelibs-4.3.3-r1/work/kdelibs-4.3.3/kdecore/network/k3socketdevice.h:276: warning:   by virtual qint64 KNetwork::KSocketDevice::writeData(const char*, qint64, const KNetwork::KSocketAddress*)
[  3%] [32mBuilding CXX object kdecore/CMakeFiles/kdecore.dir/network/klocalsocket.o
[0m[32mBuilding CXX object kdecore/CMakeFiles/kdecore.dir/network/ksocketfactory.o
[0m[  3%] [32mBuilding CXX object kdecore/CMakeFiles/kdecore.dir/network/ksslcertificatemanager.o
[0m[  3%] [32mBuilding CXX object kdecore/CMakeFiles/kdecore.dir/network/ktcpsocket.o
[0m[  3%] [32mBuilding CXX object kdecore/CMakeFiles/kdecore.dir/localization/kcatalog.o
[0m[  3%] [32mBuilding CXX object kdecore/CMakeFiles/kdecore.dir/localization/kcharsets.o
[0m/var/tmp/portage/kde-base/kdelibs-4.3.3-r1/work/kdelibs-4.3.3/kdecore/network/ktcpsocket.cpp:707: warning: unused parameter ciphers
/var/tmp/portage/kde-base/kdelibs-4.3.3-r1/work/kdelibs-4.3.3/kdecore/network/ktcpsocket.cpp:730: warning: unused parameter key
/var/tmp/portage/kde-base/kdelibs-4.3.3-r1/work/kdelibs-4.3.3/kdecore/network/ktcpsocket.cpp:737: warning: unused parameter fileName
/var/tmp/portage/kde-base/kdelibs-4.3.3-r1/work/kdelibs-4.3.3/kdecore/network/ktcpsocket.cpp:737: warning: unused parameter algorithm
/var/tmp/portage/kde-base/kdelibs-4.3.3-r1/work/kdelibs-4.3.3/kdecore/network/ktcpsocket.cpp:737: warning: unused parameter format
/var/tmp/portage/kde-base/kdelibs-4.3.3-r1/work/kdelibs-4.3.3/kdecore/network/ktcpsocket.cpp:737: warning: unused parameter passPhrase
[  3%] [32mBuilding CXX object kdecore/CMakeFiles/kdecore.dir/localization/kencodingdetector.o
[0m/var/tmp/portage/kde-base/kdelibs-4.3.3-r1/work/kdelibs-4.3.3/kdecore/localization/kcharsets.cpp:814:2: warning: #warning is it still useful with Qt4 ?
[  3%] [  3%] [32mBuilding CXX object kdecore/CMakeFiles/kdecore.dir/localization/guess_ja.o
[0m[32mBuilding CXX object kdecore/CMakeFiles/kdecore.dir/localization/kencodingprober.o
[0m[  3%] [32mBuilding CXX object kdecore/CMakeFiles/kdecore.dir/localization/probers/CharDistribution.o
[0m[  3%] [32mBuilding CXX object kdecore/CMakeFiles/kdecore.dir/localization/probers/ChineseGroupProber.o
[0m[  3%] [32mBuilding CXX object kdecore/CMakeFiles/kdecore.dir/localization/probers/JapaneseGroupProber.o
[0m[  5%] [32mBuilding CXX object kdecore/CMakeFiles/kdecore.dir/localization/probers/JpCntx.o
[0m[  5%] [32mBuilding CXX object kdecore/CMakeFiles/kdecore.dir/localization/probers/LangBulgarianModel.o
[0m[  5%] [32mBuilding CXX object kdecore/CMakeFiles/kdecore.dir/localization/probers/LangCyrillicModel.o
[0m[  5%] [32mBuilding CXX object kdecore/CMakeFiles/kdecore.dir/localization/probers/LangGreekModel.o
[0m[  5%] [32mBuilding CXX object kdecore/CMakeFiles/kdecore.dir/localization/probers/LangHebrewModel.o
[0m[  5%] [32mBuilding CXX object kdecore/CMakeFiles/kdecore.dir/localization/probers/LangHungarianModel.o
[0m[  5%] [32mBuilding CXX object kdecore/CMakeFiles/kdecore.dir/localization/probers/LangThaiModel.o
[0m[  5%] [32mBuilding CXX object kdecore/CMakeFiles/kdecore.dir/localization/probers/UnicodeGroupProber.o
[0m[  5%] [32mBuilding CXX object kdecore/CMakeFiles/kdecore.dir/localization/probers/nsBig5Prober.o
[0m[  5%] [32mBuilding CXX object kdecore/CMakeFiles/kdecore.dir/localization/probers/nsCharSetProber.o
[0m[  5%] [32mBuilding CXX object kdecore/CMakeFiles/kdecore.dir/localization/probers/nsEUCJPProber.o
[0m[  5%] [32mBuilding CXX object kdecore/CMakeFiles/kdecore.dir/localization/probers/nsEUCKRProber.o
[0m[  5%] [  5%] [32mBuilding CXX object kdecore/CMakeFiles/kdecore.dir/localization/probers/nsEUCTWProber.o
[0m[32mBuilding CXX object kdecore/CMakeFiles/kdecore.dir/localization/probers/nsEscCharsetProber.o
[0m[  5%] [32mBuilding CXX object kdecore/CMakeFiles/kdecore.dir/localization/probers/nsEscSM.o
[0m[  5%] [32mBuilding CXX object kdecore/CMakeFiles/kdecore.dir/localization/probers/nsGB2312Prober.o
[0m[  5%] [  5%] [32mBuilding CXX object kdecore/CMakeFiles/kdecore.dir/localization/probers/nsHebrewProber.o
[0m[32mBuilding CXX object kdecore/CMakeFiles/kdecore.dir/localization/probers/nsLatin1Prober.o
[0m[  5%] [32mBuilding CXX object kdecore/CMakeFiles/kdecore.dir/localization/probers/nsMBCSGroupProber.o
[0m[  5%] [32mBuilding CXX object kdecore/CMakeFiles/kdecore.dir/localization/probers/nsMBCSSM.o
[0m[  5%] [32mBuilding CXX object kdecore/CMakeFiles/kdecore.dir/localization/probers/nsSBCSGroupProber.o
[0m[  5%] [32mBuilding CXX object kdecore/CMakeFiles/kdecore.dir/localization/probers/nsSBCharSetProber.o
[0m[  5%] [32mBuilding CXX object kdecore/CMakeFiles/kdecore.dir/localization/probers/nsSJISProber.o
[0m[  5%] [32mBuilding CXX object kdecore/CMakeFiles/kdecore.dir/localization/probers/nsUniversalDetector.o
[0m[  5%] [32mBuilding CXX object kdecore/CMakeFiles/kdecore.dir/localization/klocale.o
[0m[  5%] [32mBuilding CXX object kdecore/CMakeFiles/kdecore.dir/localization/klocalizedstring.o
[0m[  6%] [32mBuilding CXX object kdecore/CMakeFiles/kdecore.dir/localization/ktranslit.o
[0m[  6%] [32mBuilding CXX object kdecore/CMakeFiles/kdecore.dir/localization/kuitsemantics.o
[0m/var/tmp/portage/kde-base/kdelibs-4.3.3-r1/work/kdelibs-4.3.3/kdecore/localization/klocale.cpp: In member function QString KLocale::formatByteSize(double) const:
/var/tmp/portage/kde-base/kdelibs-4.3.3-r1/work/kdelibs-4.3.3/kdecore/localization/klocale.cpp:1379: warning: suggest a space before ; or explicit braces around empty body in while statement
/var/tmp/portage/kde-base/kdelibs-4.3.3-r1/work/kdelibs-4.3.3/kdecore/localization/klocale.cpp:1381: warning: suggest a space before ; or explicit braces around empty body in while statement
/var/tmp/portage/kde-base/kdelibs-4.3.3-r1/work/kdelibs-4.3.3/kdecore/localization/klocale.cpp:1383: warning: suggest a space before ; or explicit braces around empty body in while statement
/var/tmp/portage/kde-base/kdelibs-4.3.3-r1/work/kdelibs-4.3.3/kdecore/localization/klocale.cpp:1385: warning: suggest a space before ; or explicit braces around empty body in while statement
/var/tmp/portage/kde-base/kdelibs-4.3.3-r1/work/kdelibs-4.3.3/kdecore/localization/klocale.cpp:1387: warning: suggest a space before ; or explicit braces around empty body in while statement
[  6%] [32mBuilding CXX object kdecore/CMakeFiles/kdecore.dir/localization/kuitformats.o
[0m[  6%] [32mBuilding CXX object kdecore/CMakeFiles/kdecore.dir/localization/common_helpers.o
[0m[  6%] [32mBuilding CXX object kdecore/CMakeFiles/kdecore.dir/sycoca/ksycoca.o
[0m[  6%] [32mBuilding CXX object kdecore/CMakeFiles/kdecore.dir/sycoca/ksycocadict.o
[0m[  6%] [32mBuilding CXX object kdecore/CMakeFiles/kdecore.dir/sycoca/ksycocaentry.o
[0m[  6%] [32mBuilding CXX object kdecore/CMakeFiles/kdecore.dir/sycoca/ksycocafactory.o
[0m/var/tmp/portage/kde-base/kdelibs-4.3.3-r1/work/kdelibs-4.3.3/kdecore/sycoca/ksycoca.cpp: In member function bool KSycocaPrivate::tryMmap():
/var/tmp/portage/kde-base/kdelibs-4.3.3-r1/work/kdelibs-4.3.3/kdecore/sycoca/ksycoca.cpp:126: warning: unused variable canRead
[  6%] [32mBuilding CXX object kdecore/CMakeFiles/kdecore.dir/sycoca/kprotocolinfo.o
[0m[  6%] [32mBuilding CXX object kdecore/CMakeFiles/kdecore.dir/sycoca/kprotocolinfofactory.o
[0m/var/tmp/portage/kde-base/kdelibs-4.3.3-r1/work/kdelibs-4.3.3/kdecore/sycoca/ksycocafactory.h: In instantiation of void KSycocaFactorySingleton<F>::instanceDestroyed(F*) [with F = KProtocolInfoFactory]:
/var/tmp/portage/kde-base/kdelibs-4.3.3-r1/work/kdelibs-4.3.3/kdecore/sycoca/kprotocolinfofactory.cpp:37:   instantiated from here
/var/tmp/portage/kde-base/kdelibs-4.3.3-r1/work/kdelibs-4.3.3/kdecore/sycoca/ksycocafactory.h:192: warning: unused parameter factory
[  6%] [32mBuilding CXX object kdecore/CMakeFiles/kdecore.dir/sycoca/kmemfile.o
[0m[  6%] [32mBuilding CXX object kdecore/CMakeFiles/kdecore.dir/text/kascii.o
[0m[  6%] [32mBuilding CXX object kdecore/CMakeFiles/kdecore.dir/text/kcodecs.o
[0m[  6%] [32mBuilding CXX object kdecore/CMakeFiles/kdecore.dir/text/kstringhandler.o
[0m[  6%] [32mBuilding CXX object kdecore/CMakeFiles/kdecore.dir/util/kallocator.o
[0m/var/tmp/portage/kde-base/kdelibs-4.3.3-r1/work/kdelibs-4.3.3/kdecore/text/kcodecs.cpp: In function void KCodecs::base64Encode(const QByteArray&, QByteArray&, bool):
/var/tmp/portage/kde-base/kdelibs-4.3.3-r1/work/kdelibs-4.3.3/kdecore/text/kcodecs.cpp:390: warning: suggest parentheses around arithmetic in operand of |
/var/tmp/portage/kde-base/kdelibs-4.3.3-r1/work/kdelibs-4.3.3/kdecore/text/kcodecs.cpp:392: warning: suggest parentheses around arithmetic in operand of |
/var/tmp/portage/kde-base/kdelibs-4.3.3-r1/work/kdelibs-4.3.3/kdecore/text/kcodecs.cpp:407: warning: suggest parentheses around arithmetic in operand of |
/var/tmp/portage/kde-base/kdelibs-4.3.3-r1/work/kdelibs-4.3.3/kdecore/text/kcodecs.cpp: In function void KCodecs::uuencode(const QByteArray&, QByteArray&):
/var/tmp/portage/kde-base/kdelibs-4.3.3-r1/work/kdelibs-4.3.3/kdecore/text/kcodecs.cpp:546: warning: suggest parentheses around arithmetic in operand of |
/var/tmp/portage/kde-base/kdelibs-4.3.3-r1/work/kdelibs-4.3.3/kdecore/text/kcodecs.cpp:548: warning: suggest parentheses around arithmetic in operand of |
/var/tmp/portage/kde-base/kdelibs-4.3.3-r1/work/kdelibs-4.3.3/kdecore/text/kcodecs.cpp:566: warning: suggest parentheses around arithmetic in operand of |
/var/tmp/portage/kde-base/kdelibs-4.3.3-r1/work/kdelibs-4.3.3/kdecore/text/kcodecs.cpp:568: warning: suggest parentheses around arithmetic in operand of |
/var/tmp/portage/kde-base/kdelibs-4.3.3-r1/work/kdelibs-4.3.3/kdecore/text/kcodecs.cpp:577: warning: suggest parentheses around arithmetic in operand of |
[  6%] [  6%] [32mBuilding CXX object kdecore/CMakeFiles/kdecore.dir/util/kdedmodule.o
[0m[32mBuilding CXX object kdecore/CMakeFiles/kdecore.dir/util/kdeversion.o
[0m[  6%] [32mBuilding CXX object kdecore/CMakeFiles/kdecore.dir/util/klauncher_iface.o
[0m[  6%] [32mBuilding CXX object kdecore/CMakeFiles/kdecore.dir/util/klibloader.o
[0m[  6%] [32mBuilding CXX object kdecore/CMakeFiles/kdecore.dir/util/klibrary.o
[0m/var/tmp/portage/kde-base/kdelibs-4.3.3-r1/work/kdelibs-4.3.3/kdecore/util/klibloader.cpp: In member function KPluginFactory* KLibLoader::factory(const QString&, QFlags<QLibrary::LoadHint>):
/var/tmp/portage/kde-base/kdelibs-4.3.3-r1/work/kdelibs-4.3.3/kdecore/util/klibloader.cpp:133: warning: KPluginFactory* KLibrary::factory(const char*) is deprecated (declared at /var/tmp/portage/kde-base/kdelibs-4.3.3-r1/work/kdelibs-4.3.3/kdecore/util/klibrary.h:59)
[  6%] [32mBuilding CXX object kdecore/CMakeFiles/kdecore.dir/util/kmacroexpander.o
[0m[  6%] [32mBuilding CXX object kdecore/CMakeFiles/kdecore.dir/util/kpluginfactory.o
[0m[  6%] [32mBuilding CXX object kdecore/CMakeFiles/kdecore.dir/util/kpluginloader.o
[0m[  6%] [32mBuilding CXX object kdecore/CMakeFiles/kdecore.dir/util/kshell.o
[0m[  6%] /var/tmp/portage/kde-base/kdelibs-4.3.3-r1/work/kdelibs-4.3.3/kdecore/util/kpluginloader.cpp: In member function KPluginFactory* KPluginLoader::factory():
/var/tmp/portage/kde-base/kdelibs-4.3.3-r1/work/kdelibs-4.3.3/kdecore/util/kpluginloader.cpp:191: warning: KPluginFactory* KLibrary::factory(const char*) is deprecated (declared at /var/tmp/portage/kde-base/kdelibs-4.3.3-r1/work/kdelibs-4.3.3/kdecore/util/klibrary.h:59)
[  6%] [32mBuilding CXX object kdecore/CMakeFiles/kdecore.dir/util/krandomsequence.o
[0m[32mBuilding CXX object kdecore/CMakeFiles/kdecore.dir/util/krandom.o
[0m/var/tmp/portage/kde-base/kdelibs-4.3.3-r1/work/kdelibs-4.3.3/kdecore/util/kpluginfactory.cpp: In member function virtual QObject* KPluginFactory::create(const char*, QWidget*, QObject*, const QVariantList&, const QString&):
/var/tmp/portage/kde-base/kdelibs-4.3.3-r1/work/kdelibs-4.3.3/kdecore/util/kpluginfactory.cpp:171: warning: virtual KParts::Part* KPluginFactory::createPartObject(QWidget*, QObject*, const char*, const QStringList&) is deprecated (declared at /var/tmp/portage/kde-base/kdelibs-4.3.3-r1/work/kdelibs-4.3.3/kdecore/util/kpluginfactory.cpp:142)
/var/tmp/portage/kde-base/kdelibs-4.3.3-r1/work/kdelibs-4.3.3/kdecore/util/kpluginfactory.cpp:176: warning: virtual QObject* KPluginFactory::createObject(QObject*, const char*, const QStringList&) is deprecated (declared at /var/tmp/portage/kde-base/kdelibs-4.3.3-r1/work/kdelibs-4.3.3/kdecore/util/kpluginfactory.cpp:134)
[  7%] [32mBuilding CXX object kdecore/CMakeFiles/kdecore.dir/util/qtest_kde.o
[0m[  7%] [32mBuilding CXX object kdecore/CMakeFiles/kdecore.dir/compression/kbzip2filter.o
[0m[  7%] [32mBuilding CXX object kdecore/CMakeFiles/kdecore.dir/kernel/ktoolinvocation_x11.o
[0m[  7%] [32mBuilding CXX object kdecore/CMakeFiles/kdecore.dir/kernel/kstandarddirs_unix.o
[0m[  7%] [32mBuilding CXX object kdecore/CMakeFiles/kdecore.dir/network/k3httpproxysocketdevice.o
[0m[  7%] [32mBuilding CXX object kdecore/CMakeFiles/kdecore.dir/network/k3socks.o
[0mIn file included from /var/tmp/portage/kde-base/kdelibs-4.3.3-r1/work/kdelibs-4.3.3/kdecore/network/k3httpproxysocketdevice.h:29,
                 from /var/tmp/portage/kde-base/kdelibs-4.3.3-r1/work/kdelibs-4.3.3/kdecore/network/k3httpproxysocketdevice.cpp:26:
/var/tmp/portage/kde-base/kdelibs-4.3.3-r1/work/kdelibs-4.3.3/kdecore/network/k3socketbase.h:701: warning: virtual qint64 KNetwork::KActiveSocketBase::readData(char*, qint64) was hidden
/var/tmp/portage/kde-base/kdelibs-4.3.3-r1/work/kdelibs-4.3.3/kdecore/network/k3socketdevice.h:265: warning:   by virtual qint64 KNetwork::KSocketDevice::readData(char*, qint64, KNetwork::KSocketAddress*)
/var/tmp/portage/kde-base/kdelibs-4.3.3-r1/work/kdelibs-4.3.3/kdecore/network/k3socketbase.h:736: warning: virtual qint64 KNetwork::KActiveSocketBase::writeData(const char*, qint64) was hidden
/var/tmp/portage/kde-base/kdelibs-4.3.3-r1/work/kdelibs-4.3.3/kdecore/network/k3socketdevice.h:276: warning:   by virtual qint64 KNetwork::KSocketDevice::writeData(const char*, qint64, const KNetwork::KSocketAddress*)
In file included from /var/tmp/portage/kde-base/kdelibs-4.3.3-r1/work/kdelibs-4.3.3/kdecore/network/k3httpproxysocketdevice.cpp:26:
/var/tmp/portage/kde-base/kdelibs-4.3.3-r1/work/kdelibs-4.3.3/kdecore/network/k3socketdevice.h:184: warning: virtual bool KNetwork::KSocketDevice::connect(const KNetwork::KResolverEntry&, QFlags<QIODevice::OpenModeFlag>) was hidden
/var/tmp/portage/kde-base/kdelibs-4.3.3-r1/work/kdelibs-4.3.3/kdecore/network/k3httpproxysocketdevice.h:91: warning:   by KNetwork::KHttpProxySocketDevice::connect
/var/tmp/portage/kde-base/kdelibs-4.3.3-r1/work/kdelibs-4.3.3/kdecore/network/k3httpproxysocketdevice.cpp: In member function bool KNetwork::KHttpProxySocketDevice::parseServerReply():
/var/tmp/portage/kde-base/kdelibs-4.3.3-r1/work/kdelibs-4.3.3/kdecore/network/k3httpproxysocketdevice.cpp:175: warning: suggest explicit braces to avoid ambiguous else
[  7%] [32mBuilding CXX object kdecore/CMakeFiles/kdecore.dir/network/k3sockssocketdevice.o
[0mIn file included from /var/tmp/portage/kde-base/kdelibs-4.3.3-r1/work/kdelibs-4.3.3/kdecore/network/k3sockssocketdevice.h:24,
                 from /var/tmp/portage/kde-base/kdelibs-4.3.3-r1/work/kdelibs-4.3.3/kdecore/network/k3sockssocketdevice.cpp:21:
/var/tmp/portage/kde-base/kdelibs-4.3.3-r1/work/kdelibs-4.3.3/kdecore/network/k3socketbase.h:701: warning: virtual qint64 KNetwork::KActiveSocketBase::readData(char*, qint64) was hidden
/var/tmp/portage/kde-base/kdelibs-4.3.3-r1/work/kdelibs-4.3.3/kdecore/network/k3socketdevice.h:265: warning:   by virtual qint64 KNetwork::KSocketDevice::readData(char*, qint64, KNetwork::KSocketAddress*)
/var/tmp/portage/kde-base/kdelibs-4.3.3-r1/work/kdelibs-4.3.3/kdecore/network/k3socketbase.h:736: warning: virtual qint64 KNetwork::KActiveSocketBase::writeData(const char*, qint64) was hidden
/var/tmp/portage/kde-base/kdelibs-4.3.3-r1/work/kdelibs-4.3.3/kdecore/network/k3socketdevice.h:276: warning:   by virtual qint64 KNetwork::KSocketDevice::writeData(const char*, qint64, const KNetwork::KSocketAddress*)
In file included from /var/tmp/portage/kde-base/kdelibs-4.3.3-r1/work/kdelibs-4.3.3/kdecore/network/k3sockssocketdevice.cpp:21:
/var/tmp/portage/kde-base/kdelibs-4.3.3-r1/work/kdelibs-4.3.3/kdecore/network/k3socketdevice.h:184: warning: virtual bool KNetwork::KSocketDevice::connect(const KNetwork::KResolverEntry&, QFlags<QIODevice::OpenModeFlag>) was hidden
/var/tmp/portage/kde-base/kdelibs-4.3.3-r1/work/kdelibs-4.3.3/kdecore/network/k3sockssocketdevice.h:78: warning:   by virtual bool KNetwork::KSocksSocketDevice::connect(const KNetwork::KResolverEntry&)
[  7%] [32mBuilding CXX object kdecore/CMakeFiles/kdecore.dir/network/klocalsocket_unix.o
[0m[  7%] [32mBuilding CXX object kdecore/CMakeFiles/kdecore.dir/network/netsupp.o
[0m[  7%] [32mBuilding CXX object kdecore/CMakeFiles/kdecore.dir/io/klockfile_unix.o
[0m[  7%] [32mBuilding CXX object kdecore/CMakeFiles/kdecore.dir/util/kshell_unix.o
[0m[  7%] [32mBuilding CXX object kdecore/CMakeFiles/kdecore.dir/util/kuser_unix.o
[0m[  7%] [32mBuilding CXX object kdecore/CMakeFiles/kdecore.dir/util/kmacroexpander_unix.o
[0m[  7%] [32mBuilding C object kdecore/CMakeFiles/kdecore.dir/fakes.o
[0m/var/tmp/portage/kde-base/kdelibs-4.3.3-r1/work/kdelibs-4.3.3/kdecore/network/k3socks.cpp: In constructor KSocks::KSocks(const KConfigGroup*):
/var/tmp/portage/kde-base/kdelibs-4.3.3-r1/work/kdelibs-4.3.3/kdecore/network/k3socks.cpp:302: warning: static KLibLoader* KLibLoader::self() is deprecated (declared at /var/tmp/portage/kde-base/kdelibs-4.3.3-r1/work/kdelibs-4.3.3/kdecore/util/klibloader.h:142)
[31m[1mLinking CXX shared library ../lib/libkdecore.so
[0m[  7%] Built target kdecore
make: *** [all] Error 2
 [31;01m*[0m 
 [31;01m*[0m ERROR: kde-base/kdelibs-4.3.3-r1 failed.
 [31;01m*[0m Call stack:
 [31;01m*[0m               ebuild.sh, line   49:  Called src_compile
 [31;01m*[0m             environment, line 3768:  Called kde4-base_src_compile
 [31;01m*[0m             environment, line 2873:  Called cmake-utils_src_compile
 [31;01m*[0m             environment, line 1033:  Called _execute_optionaly 'src_compile'
 [31;01m*[0m             environment, line  413:  Called enable_cmake-utils_src_compile
 [31;01m*[0m             environment, line 1402:  Called cmake-utils_src_make
 [31;01m*[0m             environment, line 1052:  Called die
 [31;01m*[0m The specific snippet of code:
 [31;01m*[0m           emake "$@" || die "Make failed!";
 [31;01m*[0m  The die message:
 [31;01m*[0m   Make failed!
 [31;01m*[0m 
 [31;01m*[0m If you need support, post the topmost build error, and the call stack if relevant.
 [31;01m*[0m A complete build log is located at '/var/tmp/portage/kde-base/kdelibs-4.3.3-r1/temp/build.log'.
 [31;01m*[0m The ebuild environment file is located at '/var/tmp/portage/kde-base/kdelibs-4.3.3-r1/temp/environment'.
 [31;01m*[0m