gtspbx:/usr/src/zaptel# make
gcc -Iir/include -O6 -DMODULE -D__KERNEL__ -DEXPORT_SYMTAB -Iir/drivers/net -Wall -I. -Wstrict-prototypes -fomit-frame-pointer -Iir/drivers/net/wan -Iir/include/net -DSTANDALONE_ZAPATA -o zaptel.o -c zaptel.c
In file included from zaptel.c:42:
/usr/include/linux/kernel.h:72: error: syntax error before "size_t"
/usr/include/linux/kernel.h:74: error: syntax error before "size_t"
In file included from /usr/include/linux/timex.h:186,
from /usr/include/linux/sched.h:11,
from /usr/include/linux/module.h:10,
from zaptel.c:44:
/usr/include/linux/time.h:14: error: syntax error before "time_t"
/usr/include/linux/time.h:16: error: syntax error before '}' token
/usr/include/linux/time.h:20: error: syntax error before "time_t"
In file included from /usr/include/linux/timex.h:186,
from /usr/include/linux/sched.h:11,
from /usr/include/linux/module.h:10,
from zaptel.c:44:
/usr/include/linux/time.h: In function `timespec_to_jiffies':
/usr/include/linux/time.h:198: error: dereferencing pointer to incomplete type
/usr/include/linux/time.h:199: error: dereferencing pointer to incomplete type
/usr/include/linux/time.h: In function `jiffies_to_timespec':
/usr/include/linux/time.h:219: error: dereferencing pointer to incomplete type
/usr/include/linux/time.h:219: error: dereferencing pointer to incomplete type
/usr/include/linux/time.h: In function `timeval_to_jiffies':
/usr/include/linux/time.h:237: error: dereferencing pointer to incomplete type
/usr/include/linux/time.h:238: error: dereferencing pointer to incomplete type
/usr/include/linux/time.h: In function `jiffies_to_timeval':
/usr/include/linux/time.h:257: error: dereferencing pointer to incomplete type
/usr/include/linux/time.h:257: error: dereferencing pointer to incomplete type
/usr/include/linux/time.h:258: error: dereferencing pointer to incomplete type
/usr/include/linux/time.h: In function `timespec_equal':
/usr/include/linux/time.h:263: error: dereferencing pointer to incomplete type
/usr/include/linux/time.h:263: error: dereferencing pointer to incomplete type
/usr/include/linux/time.h:263: error: dereferencing pointer to incomplete type
/usr/include/linux/time.h:263: error: dereferencing pointer to incomplete type
/usr/include/linux/time.h: In function `get_seconds':
/usr/include/linux/time.h:305: error: invalid use of undefined type `struct timespec'
/usr/include/linux/time.h: At top level:
/usr/include/linux/time.h:329: error: syntax error before "time_t"
/usr/include/linux/time.h: In function `set_normalized_timespec':
/usr/include/linux/time.h:331: error: `nsec' undeclared (first use in this function)
/usr/include/linux/time.h:331: error: (Each undeclared identifier is reported only once
/usr/include/linux/time.h:331: error: for each function it appears in.)
/usr/include/linux/time.h:333: error: `sec' undeclared (first use in this function)
/usr/include/linux/time.h:339: error: `ts' undeclared (first use in this function)
/usr/include/linux/time.h: At top level:
/usr/include/linux/time.h:359: error: field `it_interval' has incomplete type
/usr/include/linux/time.h:360: error: field `it_value' has incomplete type
/usr/include/linux/time.h:364: error: field `it_interval' has incomplete type
/usr/include/linux/time.h:365: error: field `it_value' has incomplete type
In file included from /usr/include/linux/sched.h:11,
from /usr/include/linux/module.h:10,
from zaptel.c:44:
/usr/include/linux/timex.h:203: error: field `time' has incomplete type
In file included from /usr/include/linux/string.h:23,
from /usr/include/linux/bitmap.h:11,
from /usr/include/linux/cpumask.h:8,
from /usr/include/linux/sched.h:15,
from /usr/include/linux/module.h:10,
from zaptel.c:44:
/usr/include/asm/string.h:41: error: syntax error before "size_t"
/usr/include/asm/string.h: In function `strncpy':
/usr/include/asm/string.h:55: error: `src' undeclared (first use in this function)
/usr/include/asm/string.h:55: error: `dest' undeclared (first use in this function)
/usr/include/asm/string.h:55: error: `count' undeclared (first use in this function)
/usr/include/asm/string.h: At top level:
/usr/include/asm/string.h:77: error: syntax error before "size_t"
/usr/include/asm/string.h: In function `strncat':
/usr/include/asm/string.h:94: error: `src' undeclared (first use in this function)
/usr/include/asm/string.h:94: error: `dest' undeclared (first use in this function)
/usr/include/asm/string.h:94: error: `count' undeclared (first use in this function)
/usr/include/asm/string.h: At top level:
/usr/include/asm/string.h:121: error: syntax error before "size_t"
/usr/include/asm/string.h: In function `strncmp':
/usr/include/asm/string.h:139: error: `cs' undeclared (first use in this function)
/usr/include/asm/string.h:139: error: `ct' undeclared (first use in this function)
/usr/include/asm/string.h:139: error: `count' undeclared (first use in this function)
/usr/include/asm/string.h: At top level:
/usr/include/asm/string.h:180: error: syntax error before "strlen"
/usr/include/asm/string.h:193: error: syntax error before "size_t"
/usr/include/asm/string.h: In function `__memcpy':
/usr/include/asm/string.h:206: error: `n' undeclared (first use in this function)
/usr/include/asm/string.h:206: error: `to' undeclared (first use in this function)
/usr/include/asm/string.h:206: error: `from' undeclared (first use in this function)
/usr/include/asm/string.h: At top level:
/usr/include/asm/string.h:215: error: syntax error before "size_t"
/usr/include/asm/string.h: In function `__constant_memcpy':
/usr/include/asm/string.h:217: error: `n' undeclared (first use in this function)
/usr/include/asm/string.h:218: error: `to' undeclared (first use in this function)
/usr/include/asm/string.h:218: error: `from' undeclared (first use in this function)
/usr/include/asm/string.h: At top level:
/usr/include/asm/string.h:299: error: syntax error before "size_t"
/usr/include/asm/string.h: In function `memmove':
/usr/include/asm/string.h:302: error: `dest' undeclared (first use in this function)
/usr/include/asm/string.h:302: error: `src' undeclared (first use in this function)
/usr/include/asm/string.h:307: error: `n' undeclared (first use in this function)
/usr/include/asm/string.h: At top level:
/usr/include/asm/string.h:326: error: syntax error before "size_t"
/usr/include/asm/string.h: In function `memchr':
/usr/include/asm/string.h:330: error: `count' undeclared (first use in this function)
/usr/include/asm/string.h:338: error: `c' undeclared (first use in this function)
/usr/include/asm/string.h:338: error: `cs' undeclared (first use in this function)
/usr/include/asm/string.h: At top level:
/usr/include/asm/string.h:342: error: syntax error before "size_t"
/usr/include/asm/string.h: In function `__memset_generic':
/usr/include/asm/string.h:349: error: `c' undeclared (first use in this function)
/usr/include/asm/string.h:349: error: `s' undeclared (first use in this function)
/usr/include/asm/string.h:349: error: `count' undeclared (first use in this function)
/usr/include/asm/string.h: At top level:
/usr/include/asm/string.h:362: error: syntax error before "size_t"
/usr/include/asm/string.h: In function `__constant_c_memset':
/usr/include/asm/string.h:375: error: `c' undeclared (first use in this function)
/usr/include/asm/string.h:375: error: `count' undeclared (first use in this function)
/usr/include/asm/string.h:375: error: `s' undeclared (first use in this function)
/usr/include/asm/string.h: At top level:
/usr/include/asm/string.h:382: error: syntax error before "strnlen"
/usr/include/asm/string.h:382: error: syntax error before "size_t"
/usr/include/asm/string.h: In function `strnlen':
/usr/include/asm/string.h:397: error: `s' undeclared (first use in this function)
/usr/include/asm/string.h:397: error: `count' undeclared (first use in this function)
/usr/include/asm/string.h: At top level:
/usr/include/asm/string.h:410: error: syntax error before "size_t"
/usr/include/asm/string.h: In function `__constant_c_and_count_memset':
/usr/include/asm/string.h:412: error: `count' undeclared (first use in this function)
/usr/include/asm/string.h:414: error: `s' undeclared (first use in this function)
/usr/include/asm/string.h:416: error: `pattern' undeclared (first use in this function)
/usr/include/asm/string.h: At top level:
/usr/include/asm/string.h:469: error: syntax error before "size_t"
/usr/include/asm/string.h: In function `memscan':
/usr/include/asm/string.h:471: error: `size' undeclared (first use in this function)
/usr/include/asm/string.h:472: error: `addr' undeclared (first use in this function)
/usr/include/asm/string.h:478: error: `c' undeclared (first use in this function)
In file included from /usr/include/linux/bitmap.h:11,
from /usr/include/linux/cpumask.h:8,
from /usr/include/linux/sched.h:15,
from /usr/include/linux/module.h:10,
from zaptel.c:44:
/usr/include/linux/string.h: At top level:
/usr/include/linux/string.h:32: error: syntax error before "strlcpy"
/usr/include/linux/string.h:32: error: syntax error before "size_t"
/usr/include/linux/string.h:41: error: syntax error before "strlcat"
In file included from /usr/include/asm/smp.h:18,
from /usr/include/linux/smp.h:17,
from /usr/include/linux/sched.h:23,
from /usr/include/linux/module.h:10,
from zaptel.c:44:
/usr/include/asm/mpspec.h:6:25: mach_mpspec.h: No such file or directory
In file included from /usr/include/asm/smp.h:18,
from /usr/include/linux/smp.h:17,
from /usr/include/linux/sched.h:23,
from /usr/include/linux/module.h:10,
from zaptel.c:44:
/usr/include/asm/mpspec.h:8: error: `MAX_MP_BUSSES' undeclared here (not in a function)
/usr/include/asm/mpspec.h:9: error: `MAX_MP_BUSSES' undeclared here (not in a function)
/usr/include/asm/mpspec.h:10: error: `MAX_MP_BUSSES' undeclared here (not in a function)
/usr/include/asm/mpspec.h:12: error: `MAX_MP_BUSSES' undeclared here (not in a function)
/usr/include/asm/mpspec.h:19: error: `MAX_APICS' undeclared here (not in a function)
/usr/include/asm/mpspec.h:20: error: `MAX_MP_BUSSES' undeclared here (not in a function)
/usr/include/asm/mpspec.h:20: error: conflicting types for `mp_bus_id_to_type'
/usr/include/asm/mpspec.h:8: error: previous declaration of `mp_bus_id_to_type'
/usr/include/asm/mpspec.h:22: error: `MAX_IRQ_SOURCES' undeclared here (not in a function)
/usr/include/asm/mpspec.h:24: error: `MAX_MP_BUSSES' undeclared here (not in a function)
/usr/include/asm/mpspec.h:24: error: conflicting types for `mp_bus_id_to_pci_bus'
/usr/include/asm/mpspec.h:12: error: previous declaration of `mp_bus_id_to_pci_bus'
/usr/include/asm/mpspec.h:54: error: `MAX_APICS' undeclared here (not in a function)
In file included from /usr/include/asm/smp.h:20,
from /usr/include/linux/smp.h:17,
from /usr/include/linux/sched.h:23,
from /usr/include/linux/module.h:10,
from zaptel.c:44:
/usr/include/asm/io_apic.h:120: error: `MAX_IRQ_SOURCES' undeclared here (not in a function)
/usr/include/asm/io_apic.h:120: error: conflicting types for `mp_irqs'
/usr/include/asm/mpspec.h:22: error: previous declaration of `mp_irqs'
In file included from /usr/include/linux/smp.h:17,
from /usr/include/linux/sched.h:23,
from /usr/include/linux/module.h:10,
from zaptel.c:44:
/usr/include/asm/smp.h:73:26: mach_apicdef.h: No such file or directory
In file included from /usr/include/linux/sem.h:4,
from /usr/include/linux/sched.h:24,
from /usr/include/linux/module.h:10,
from zaptel.c:44:
/usr/include/linux/ipc.h:61: error: syntax error before "key_t"
/usr/include/linux/ipc.h:63: error: syntax error before "gid"
/usr/include/linux/ipc.h:64: error: syntax error before "cuid"
/usr/include/linux/ipc.h:65: error: syntax error before "cgid"
/usr/include/linux/ipc.h:66: error: syntax error before "mode"
/usr/include/linux/ipc.h:69: error: syntax error before '}' token
In file included from /usr/include/linux/sched.h:24,
from /usr/include/linux/module.h:10,
from zaptel.c:44:
/usr/include/linux/sem.h:90: error: field `sem_perm' has incomplete type
/usr/include/linux/sem.h:91: error: syntax error before "time_t"
/usr/include/linux/sem.h:98: error: syntax error before '}' token
/usr/include/linux/sem.h:137: error: syntax error before "key"
In file included from /usr/include/linux/signal.h:6,
from /usr/include/linux/sched.h:25,
from /usr/include/linux/module.h:10,
from zaptel.c:44:
/usr/include/asm/signal.h:176: error: syntax error before "size_t"
In file included from /usr/include/asm/siginfo.h:4,
from /usr/include/linux/signal.h:7,
from /usr/include/linux/sched.h:25,
from /usr/include/linux/module.h:10,
from zaptel.c:44:
/usr/include/asm-generic/siginfo.h:45: error: syntax error before "pid_t"
/usr/include/asm-generic/siginfo.h:51: error: syntax error before "timer_t"
/usr/include/asm-generic/siginfo.h:53: error: `uid_t' undeclared here (not in a function)
/usr/include/asm-generic/siginfo.h:53: error: size of array `_pad' is too large
/usr/include/asm-generic/siginfo.h:56: error: syntax error before '}' token
/usr/include/asm-generic/siginfo.h:60: error: syntax error before "pid_t"
/usr/include/asm-generic/siginfo.h:63: error: syntax error before '}' token
/usr/include/asm-generic/siginfo.h:67: error: syntax error before "pid_t"
/usr/include/asm-generic/siginfo.h:70: error: syntax error before "_utime"
/usr/include/asm-generic/siginfo.h:71: error: syntax error before "_stime"
/usr/include/asm-generic/siginfo.h:87: error: syntax error before '}' token
/usr/include/asm-generic/siginfo.h:88: error: syntax error before '}' token
/usr/include/asm-generic/siginfo.h: In function `copy_siginfo':
/usr/include/asm-generic/siginfo.h:274: error: dereferencing pointer to incomplete type
/usr/include/asm-generic/siginfo.h:275: error: dereferencing pointer to incomplete type
/usr/include/asm-generic/siginfo.h:275: error: dereferencing pointer to incomplete type
/usr/include/asm-generic/siginfo.h:275: error: dereferencing pointer to incomplete type
/usr/include/asm-generic/siginfo.h:278: error: dereferencing pointer to incomplete type
/usr/include/asm-generic/siginfo.h:278: error: dereferencing pointer to incomplete type
/usr/include/asm-generic/siginfo.h:278: error: dereferencing pointer to incomplete type
In file included from /usr/include/linux/sched.h:25,
from /usr/include/linux/module.h:10,
from zaptel.c:44:
/usr/include/linux/signal.h: At top level:
/usr/include/linux/signal.h:18: error: syntax error before "siginfo_t"
/usr/include/linux/signal.h:215: error: syntax error before '*' token
In file included from /usr/include/linux/gfp.h:4,
from /usr/include/linux/slab.h:15,
from /usr/include/linux/percpu.h:4,
from /usr/include/linux/sched.h:31,
from /usr/include/linux/module.h:10,
from zaptel.c:44:
/usr/include/linux/mmzone.h:286: error: syntax error before "size_t"
In file included from /usr/include/linux/percpu.h:4,
from /usr/include/linux/sched.h:31,
from /usr/include/linux/module.h:10,
from zaptel.c:44:
/usr/include/linux/slab.h:58: error: syntax error before "int"
/usr/include/linux/slab.h:59: error: syntax error before "size_t"
/usr/include/linux/slab.h:60: error: `kmem_cache_create' declared as function returning a function
/usr/include/linux/slab.h:61: error: syntax error before "void"
/usr/include/linux/slab.h:70: error: syntax error before "size_t"
/usr/include/linux/slab.h:73: error: syntax error before '}' token
/usr/include/linux/slab.h:75: error: syntax error before "int"
/usr/include/linux/slab.h:77: error: syntax error before "size"
/usr/include/linux/slab.h: In function `kmalloc':
/usr/include/linux/slab.h:79: error: `size' undeclared (first use in this function)
In file included from /usr/include/linux/percpu.h:4,
from /usr/include/linux/sched.h:31,
from /usr/include/linux/module.h:10,
from zaptel.c:44:
/usr/include/linux/slab.h:93: error: `flags' undeclared (first use in this function)
/usr/include/linux/slab.h:94: error: invalid use of undefined type `struct cache_sizes'
/usr/include/linux/slab.h:95: error: invalid use of undefined type `struct cache_sizes'
In file included from /usr/include/linux/sched.h:31,
from /usr/include/linux/module.h:10,
from zaptel.c:44:
/usr/include/linux/percpu.h: At top level:
/usr/include/linux/percpu.h:36: error: syntax error before "size"
In file included from /usr/include/linux/sched.h:101,
from /usr/include/linux/module.h:10,
from zaptel.c:44:
/usr/include/linux/resource.h:22: error: field `ru_utime' has incomplete type
/usr/include/linux/resource.h:23: error: field `ru_stime' has incomplete type
In file included from /usr/include/linux/sched.h:183,
from /usr/include/linux/module.h:10,
from zaptel.c:44:
/usr/include/linux/aio.h:64: error: syntax error before "loff_t"
/usr/include/linux/aio.h:67: error: syntax error before '}' token
/usr/include/linux/aio.h:143: error: syntax error before "wait_on_sync_kiocb"
/usr/include/linux/aio.h: In function `list_kiocb':
/usr/include/linux/aio.h:166: error: dereferencing pointer to incomplete type
/usr/include/linux/aio.h:166: error: `size_t' undeclared (first use in this function)
/usr/include/linux/aio.h:166: error: dereferencing pointer to incomplete type
In file included from /usr/include/linux/module.h:10,
from zaptel.c:44:
/usr/include/linux/sched.h: At top level:
/usr/include/linux/sched.h:299: error: syntax error before "uid_t"
/usr/include/linux/sched.h:315: error: syntax error before "clockid_t"
/usr/include/linux/sched.h:327: error: syntax error before '}' token
/usr/include/linux/sched.h:368: error: syntax error before "pid_t"
/usr/include/linux/sched.h:370: error: syntax error before "tty_old_pgrp"
/usr/include/linux/sched.h:371: error: syntax error before "session"
/usr/include/linux/sched.h:372: error: syntax error before "tgid"
/usr/include/linux/sched.h:405: error: syntax error before "uid"
/usr/include/linux/sched.h:406: error: syntax error before "gid"
/usr/include/linux/sched.h:408: error: syntax error before "groups"
/usr/include/linux/sched.h:410: error: syntax error before ':' token
/usr/include/linux/sched.h:437: error: syntax error before "sas_ss_size"
/usr/include/linux/sched.h:466: error: syntax error before '*' token
/usr/include/linux/sched.h:467: error: syntax error before '}' token
/usr/include/linux/sched.h:469: error: syntax error before "process_group"
/usr/include/linux/sched.h: In function `process_group':
/usr/include/linux/sched.h:471: error: dereferencing pointer to incomplete type
/usr/include/linux/sched.h: At top level:
/usr/include/linux/sched.h:560: error: syntax error before "session"
/usr/include/linux/sched.h:561: error: syntax error before "session"
In file included from /usr/include/linux/module.h:10,
from zaptel.c:44:
/usr/include/linux/sched.h:580: error: syntax error before "pid"
/usr/include/linux/sched.h:588: error: syntax error before "siginfo_t"
/usr/include/linux/sched.h:590: error: syntax error before "siginfo_t"
/usr/include/linux/sched.h: In function `dequeue_signal_lock':
/usr/include/linux/sched.h:595: error: `tsk' undeclared (first use in this function)
/usr/include/linux/sched.h:596: error: `mask' undeclared (first use in this function)
/usr/include/linux/sched.h:596: error: `info' undeclared (first use in this function)
/usr/include/linux/sched.h: At top level:
/usr/include/linux/sched.h:609: error: syntax error before "pid_t"
/usr/include/linux/sched.h:610: error: syntax error before "pid_t"
/usr/include/linux/sched.h:611: error: syntax error before "pid_t"
/usr/include/linux/sched.h:612: error: syntax error before "pid_t"
/usr/include/linux/sched.h:619: error: syntax error before "int"
/usr/include/linux/sched.h:620: error: syntax error before "int"
/usr/include/linux/sched.h:621: error: syntax error before "int"
/usr/include/linux/sched.h:627: error: syntax error before '*' token
/usr/include/linux/sched.h: In function `on_sig_stack':
/usr/include/linux/sched.h:638: error: dereferencing pointer to incomplete type
/usr/include/linux/sched.h:638: error: dereferencing pointer to incomplete type
/usr/include/linux/sched.h: In function `sas_ss_flags':
/usr/include/linux/sched.h:643: error: dereferencing pointer to incomplete type
/usr/include/linux/sched.h: In function `capable':
/usr/include/linux/sched.h:654: error: dereferencing pointer to incomplete type
/usr/include/linux/sched.h:655: error: dereferencing pointer to incomplete type
/usr/include/linux/sched.h: In function `thread_group_empty':
/usr/include/linux/sched.h:749: error: dereferencing pointer to incomplete type
/usr/include/linux/sched.h: In function `task_lock':
/usr/include/linux/sched.h:766: error: dereferencing pointer to incomplete type
/usr/include/linux/sched.h:766: error: dereferencing pointer to incomplete type
/usr/include/linux/sched.h: In function `task_unlock':
/usr/include/linux/sched.h:771: error: dereferencing pointer to incomplete type
/usr/include/linux/sched.h: In function `get_task_mm':
/usr/include/linux/sched.h:785: error: dereferencing pointer to incomplete type
/usr/include/linux/sched.h: In function `set_tsk_thread_flag':
/usr/include/linux/sched.h:799: error: dereferencing pointer to incomplete type
/usr/include/linux/sched.h: In function `clear_tsk_thread_flag':
/usr/include/linux/sched.h:804: error: dereferencing pointer to incomplete type
/usr/include/linux/sched.h: In function `test_and_set_tsk_thread_flag':
/usr/include/linux/sched.h:809: error: dereferencing pointer to incomplete type
/usr/include/linux/sched.h: In function `test_and_clear_tsk_thread_flag':
/usr/include/linux/sched.h:814: error: dereferencing pointer to incomplete type
/usr/include/linux/sched.h: In function `test_tsk_thread_flag':
/usr/include/linux/sched.h:819: error: dereferencing pointer to incomplete type
/usr/include/linux/sched.h: In function `task_cpu':
/usr/include/linux/sched.h:883: error: dereferencing pointer to incomplete type
/usr/include/linux/sched.h: In function `set_task_cpu':
/usr/include/linux/sched.h:888: error: dereferencing pointer to incomplete type
In file included from /usr/include/linux/module.h:13,
from zaptel.c:44:
/usr/include/linux/stat.h: At top level:
/usr/include/linux/stat.h:61: error: syntax error before "dev_t"
/usr/include/linux/stat.h:62: error: conflicting types for `mode'
/usr/include/linux/ipc.h:66: error: previous declaration of `mode'
/usr/include/linux/stat.h:63: error: syntax error before "nlink"
/usr/include/linux/stat.h:64: error: syntax error before "uid"
/usr/include/linux/stat.h:65: error: syntax error before "gid"
/usr/include/linux/stat.h:66: error: syntax error before "rdev"
/usr/include/linux/stat.h:67: error: syntax error before "size"
/usr/include/linux/stat.h:67: error: `size' used prior to declaration
/usr/include/linux/stat.h:73: error: syntax error before '}' token
In file included from /usr/include/linux/fs.h:14,
from /usr/include/linux/proc_fs.h:6,
from zaptel.c:45:
/usr/include/linux/kdev_t.h:21: error: syntax error before "dev"
/usr/include/linux/kdev_t.h: In function `old_valid_dev':
/usr/include/linux/kdev_t.h:23: error: `dev' undeclared (first use in this function)
/usr/include/linux/kdev_t.h: At top level:
/usr/include/linux/kdev_t.h:26: error: syntax error before "dev"
/usr/include/linux/kdev_t.h: In function `old_encode_dev':
/usr/include/linux/kdev_t.h:28: error: `dev' undeclared (first use in this function)
/usr/include/linux/kdev_t.h: At top level:
/usr/include/linux/kdev_t.h:31: error: syntax error before "old_decode_dev"
/usr/include/linux/kdev_t.h:36: error: syntax error before "dev"
/usr/include/linux/kdev_t.h:41: error: syntax error before "dev"
/usr/include/linux/kdev_t.h: In function `new_encode_dev':
/usr/include/linux/kdev_t.h:43: error: `dev' undeclared (first use in this function)
/usr/include/linux/kdev_t.h: At top level:
/usr/include/linux/kdev_t.h:48: error: syntax error before "new_decode_dev"
/usr/include/linux/kdev_t.h:55: error: syntax error before "dev"
/usr/include/linux/kdev_t.h:60: error: syntax error before "dev"
/usr/include/linux/kdev_t.h: In function `huge_encode_dev':
/usr/include/linux/kdev_t.h:62: error: `dev' undeclared (first use in this function)
/usr/include/linux/kdev_t.h: At top level:
/usr/include/linux/kdev_t.h:65: error: syntax error before "huge_decode_dev"
/usr/include/linux/kdev_t.h:70: error: syntax error before "dev"
/usr/include/linux/kdev_t.h: In function `sysv_valid_dev':
/usr/include/linux/kdev_t.h:72: error: `dev' undeclared (first use in this function)
/usr/include/linux/kdev_t.h: At top level:
/usr/include/linux/kdev_t.h:75: error: syntax error before "dev"
/usr/include/linux/kdev_t.h: In function `sysv_encode_dev':
/usr/include/linux/kdev_t.h:77: error: `dev' undeclared (first use in this function)
In file included from /usr/include/linux/kobject.h:20,
from /usr/include/linux/fs.h:21,
from /usr/include/linux/proc_fs.h:6,
from zaptel.c:45:
/usr/include/linux/sysfs.h: At top level:
/usr/include/linux/sysfs.h:18: error: syntax error before "mode_t"
/usr/include/linux/sysfs.h:22: error: field `attr' has incomplete type
/usr/include/linux/sysfs.h:23: error: syntax error before "size_t"
/usr/include/linux/sysfs.h:24: error: syntax error before '*' token
/usr/include/linux/sysfs.h:24: error: syntax error before "loff_t"
/usr/include/linux/sysfs.h:24: error: `ssize_t' declared as function returning a function
/usr/include/linux/sysfs.h:25: error: syntax error before '*' token
/usr/include/linux/sysfs.h:25: error: syntax error before "loff_t"
/usr/include/linux/sysfs.h:25: error: `ssize_t' declared as function returning a function
/usr/include/linux/sysfs.h:32: error: syntax error before "ssize_t"
/usr/include/linux/sysfs.h:33: error: syntax error before '*' token
/usr/include/linux/sysfs.h:33: error: syntax error before "size_t"
/usr/include/linux/sysfs.h:33: error: `ssize_t' declared as function returning a function
In file included from /usr/include/linux/fs.h:21,
from /usr/include/linux/proc_fs.h:6,
from zaptel.c:45:
/usr/include/linux/kobject.h: In function `to_kset':
/usr/include/linux/kobject.h:108: error: `size_t' undeclared (first use in this function)
/usr/include/linux/kobject.h: In function `subsys_get':
/usr/include/linux/kobject.h:206: error: `size_t' undeclared (first use in this function)
/usr/include/linux/kobject.h: At top level:
/usr/include/linux/kobject.h:215: error: field `attr' has incomplete type
/usr/include/linux/kobject.h:216: error: syntax error before "ssize_t"
/usr/include/linux/kobject.h:217: error: syntax error before '*' token
/usr/include/linux/kobject.h:217: error: syntax error before "size_t"
/usr/include/linux/kobject.h:217: error: `ssize_t' declared as function returning a function
In file included from /usr/include/linux/proc_fs.h:6,
from zaptel.c:45:
/usr/include/linux/fs.h:226: error: syntax error before "loff_t"
/usr/include/linux/fs.h:259: error: syntax error before "uid_t"
/usr/include/linux/fs.h:261: error: syntax error before "ia_size"
/usr/include/linux/fs.h:266: error: syntax error before '}' token
In file included from /usr/include/linux/fs.h:280,
from /usr/include/linux/proc_fs.h:6,
from zaptel.c:45:
/usr/include/linux/quota.h:151: error: syntax error before "time_t"
/usr/include/linux/quota.h:223: error: syntax error before "loff_t"
/usr/include/linux/quota.h:227: error: syntax error before '}' token
In file included from /usr/include/linux/proc_fs.h:6,
from zaptel.c:45:
/usr/include/linux/fs.h:315: error: syntax error before "loff_t"
/usr/include/linux/fs.h:342: error: syntax error before "dev_t"
/usr/include/linux/fs.h:356: error: syntax error before '}' token
/usr/include/linux/fs.h:377: error: syntax error before "uid_t"
/usr/include/linux/fs.h:379: error: syntax error before "i_rdev"
/usr/include/linux/fs.h:380: error: syntax error before "i_size"
/usr/include/linux/fs.h:422: error: syntax error before '}' token
/usr/include/linux/fs.h:434: error: syntax error before "i_size_read"
/usr/include/linux/fs.h: In function `i_size_read':
/usr/include/linux/fs.h:437: error: `loff_t' undeclared (first use in this function)
/usr/include/linux/fs.h:437: error: syntax error before "i_size"
/usr/include/linux/fs.h:441: error: dereferencing pointer to incomplete type
/usr/include/linux/fs.h:442: error: dereferencing pointer to incomplete type
/usr/include/linux/fs.h:443: error: dereferencing pointer to incomplete type
/usr/include/linux/fs.h: At top level:
/usr/include/linux/fs.h:458: error: syntax error before "loff_t"
/usr/include/linux/fs.h: In function `i_size_write':
/usr/include/linux/fs.h:461: error: `inode' undeclared (first use in this function)
/usr/include/linux/fs.h: In function `iminor':
/usr/include/linux/fs.h:475: error: dereferencing pointer to incomplete type
/usr/include/linux/fs.h: In function `imajor':
/usr/include/linux/fs.h:480: error: dereferencing pointer to incomplete type
/usr/include/linux/fs.h: At top level:
/usr/include/linux/fs.h:486: error: syntax error before "uid_t"
/usr/include/linux/fs.h:489: error: syntax error before '}' token
/usr/include/linux/fs.h:513: error: syntax error before "mode_t"
/usr/include/linux/fs.h:529: error: syntax error before '}' token
In file included from /usr/include/linux/proc_fs.h:6,
from zaptel.c:45:
/usr/include/linux/fs.h:581: error: syntax error before "loff_t"
/usr/include/linux/fs.h:594: error: syntax error before '}' token
In file included from /usr/include/linux/fcntl.h:4,
from /usr/include/linux/fs.h:605,
from /usr/include/linux/proc_fs.h:6,
from zaptel.c:45:
/usr/include/asm/fcntl.h:72: error: syntax error before "off_t"
/usr/include/asm/fcntl.h:74: error: syntax error before "l_pid"
/usr/include/asm/fcntl.h:80: error: syntax error before "loff_t"
/usr/include/asm/fcntl.h:82: error: syntax error before "l_pid"
In file included from /usr/include/linux/proc_fs.h:6,
from zaptel.c:45:
/usr/include/linux/fs.h:631: error: syntax error before "loff_t"
/usr/include/linux/fs.h:632: error: syntax error before "loff_t"
/usr/include/linux/fs.h:668: error: syntax error before "dev_t"
/usr/include/linux/fs.h:709: error: syntax error before '}' token
/usr/include/linux/fs.h: In function `lock_super':
/usr/include/linux/fs.h:716: error: dereferencing pointer to incomplete type
/usr/include/linux/fs.h: In function `unlock_super':
/usr/include/linux/fs.h:721: error: dereferencing pointer to incomplete type
/usr/include/linux/fs.h: At top level:
/usr/include/linux/fs.h:729: error: syntax error before "dev_t"
/usr/include/linux/fs.h:758: error: syntax error before "loff_t"
/usr/include/linux/fs.h:779: error: syntax error before "size_t"
/usr/include/linux/fs.h:780: error: `count' used prior to declaration
/usr/include/linux/fs.h:783: error: syntax error before '}' token
/usr/include/linux/fs.h:785: error: syntax error before '*' token
/usr/include/linux/fs.h:794: error: syntax error before "loff_t"
/usr/include/linux/fs.h:795: error: syntax error before '*' token
/usr/include/linux/fs.h:795: error: syntax error before "size_t"
/usr/include/linux/fs.h:795: error: `ssize_t' declared as function returning a function
/usr/include/linux/fs.h:796: error: syntax error before '*' token
/usr/include/linux/fs.h:796: error: syntax error before "size_t"
/usr/include/linux/fs.h:796: error: `ssize_t' declared as function returning a function
/usr/include/linux/fs.h:797: error: syntax error before '*' token
/usr/include/linux/fs.h:797: error: syntax error before "size_t"
/usr/include/linux/fs.h:797: error: `ssize_t' declared as function returning a function
/usr/include/linux/fs.h:798: error: syntax error before '*' token
/usr/include/linux/fs.h:798: error: syntax error before "size_t"
/usr/include/linux/fs.h:798: error: `ssize_t' declared as function returning a function
/usr/include/linux/fs.h:810: error: syntax error before '*' token
/usr/include/linux/fs.h:810: error: syntax error before "loff_t"
/usr/include/linux/fs.h:810: error: `ssize_t' declared as function returning a function
/usr/include/linux/fs.h:811: error: syntax error before '*' token
/usr/include/linux/fs.h:811: error: syntax error before "loff_t"
/usr/include/linux/fs.h:811: error: `ssize_t' declared as function returning a function
/usr/include/linux/fs.h:812: error: syntax error before '*' token
/usr/include/linux/fs.h:812: error: syntax error before "loff_t"
/usr/include/linux/fs.h:812: error: `ssize_t' declared as function returning a function
/usr/include/linux/fs.h:813: error: syntax error before '*' token
/usr/include/linux/fs.h:813: error: syntax error before "size_t"
/usr/include/linux/fs.h:813: error: `ssize_t' declared as function returning a function
/usr/include/linux/fs.h:815: error: syntax error before '}' token
/usr/include/linux/fs.h:825: error: syntax error before "dev_t"
/usr/include/linux/fs.h:834: error: syntax error before "size_t"
/usr/include/linux/fs.h:836: error: syntax error before '*' token
/usr/include/linux/fs.h:836: error: syntax error before "size_t"
/usr/include/linux/fs.h:836: error: `ssize_t' declared as function returning a function
/usr/include/linux/fs.h:838: error: syntax error before '}' token
/usr/include/linux/fs.h:842: error: syntax error before "vfs_read"
/usr/include/linux/fs.h:842: error: syntax error before "size_t"
/usr/include/linux/fs.h:843: error: syntax error before "vfs_write"
/usr/include/linux/fs.h:843: error: syntax error before "size_t"
/usr/include/linux/fs.h:844: error: syntax error before "vfs_readv"
/usr/include/linux/fs.h:845: error: syntax error before "loff_t"
/usr/include/linux/fs.h:846: error: syntax error before "vfs_writev"
/usr/include/linux/fs.h:847: error: syntax error before "loff_t"
/usr/include/linux/fs.h:1059: error: syntax error before "loff_t"
/usr/include/linux/fs.h: In function `locks_verify_locked':
/usr/include/linux/fs.h:1070: error: dereferencing pointer to incomplete type
/usr/include/linux/fs.h:1070: error: dereferencing pointer to incomplete type
/usr/include/linux/fs.h: At top level:
/usr/include/linux/fs.h:1076: error: syntax error before "loff_t"
/usr/include/linux/fs.h: In function `locks_verify_area':
/usr/include/linux/fs.h:1079: error: `inode' undeclared (first use in this function)
/usr/include/linux/fs.h:1080: error: `read_write' undeclared (first use in this function)
/usr/include/linux/fs.h:1080: error: `filp' undeclared (first use in this function)
/usr/include/linux/fs.h:1080: error: `offset' undeclared (first use in this function)
/usr/include/linux/fs.h: At top level:
/usr/include/linux/fs.h:1086: error: syntax error before "loff_t"
/usr/include/linux/fs.h: In function `locks_verify_truncate':
/usr/include/linux/fs.h:1088: error: `inode' undeclared (first use in this function)
/usr/include/linux/fs.h:1090: error: `filp' undeclared (first use in this function)
/usr/include/linux/fs.h: In function `break_lease':
/usr/include/linux/fs.h:1100: error: dereferencing pointer to incomplete type
/usr/include/linux/fs.h: At top level:
/usr/include/linux/fs.h:1109: error: syntax error before "loff_t"
/usr/include/linux/fs.h:1131: error: syntax error before "unsigned"
/usr/include/linux/fs.h:1139: error: syntax error before "mode_t"
/usr/include/linux/fs.h:1146: error: syntax error before '*' token
/usr/include/linux/fs.h:1147: error: syntax error before "unsigned"
/usr/include/linux/fs.h:1151: error: syntax error before "unsigned"
/usr/include/linux/fs.h:1156: error: syntax error before "char"
/usr/include/linux/fs.h:1162: error: syntax error before "dev_t"
/usr/include/linux/fs.h:1192: error: syntax error before "pgoff_t"
/usr/include/linux/fs.h: In function `invalidate_remote_inode':
/usr/include/linux/fs.h:1196: error: dereferencing pointer to incomplete type
/usr/include/linux/fs.h:1196: error: dereferencing pointer to incomplete type
/usr/include/linux/fs.h:1197: error: dereferencing pointer to incomplete type
/usr/include/linux/fs.h:1198: error: dereferencing pointer to incomplete type
/usr/include/linux/fs.h: In function `put_write_access':
/usr/include/linux/fs.h:1220: error: dereferencing pointer to incomplete type
/usr/include/linux/fs.h: In function `allow_write_access':
/usr/include/linux/fs.h:1225: error: dereferencing pointer to incomplete type
/usr/include/linux/fs.h: At top level:
/usr/include/linux/fs.h:1237: error: syntax error before "find_inode_number"
In file included from /usr/include/linux/proc_fs.h:6,
from zaptel.c:45:
/usr/include/linux/fs.h:1242: error: syntax error before "default_llseek"
/usr/include/linux/fs.h:1242: error: syntax error before "loff_t"
/usr/include/linux/fs.h:1247: error: syntax error before "iunique"
/usr/include/linux/fs.h:1247: error: syntax error before "ino_t"
/usr/include/linux/fs.h: In function `iget':
/usr/include/linux/fs.h:1263: error: dereferencing pointer to incomplete type
/usr/include/linux/fs.h:1264: error: dereferencing pointer to incomplete type
/usr/include/linux/fs.h: In function `insert_inode_hash':
/usr/include/linux/fs.h:1280: error: dereferencing pointer to incomplete type
/usr/include/linux/fs.h: At top level:
/usr/include/linux/fs.h:1295: error: syntax error before '*' token
/usr/include/linux/fs.h:1296: error: syntax error before '*' token
/usr/include/linux/fs.h:1297: error: syntax error before "generic_file_read"
/usr/include/linux/fs.h:1297: error: syntax error before "size_t"
/usr/include/linux/fs.h:1299: error: syntax error before "loff_t"
/usr/include/linux/fs.h:1300: error: syntax error before "generic_file_write"
/usr/include/linux/fs.h:1300: error: syntax error before "size_t"
/usr/include/linux/fs.h:1301: error: syntax error before "generic_file_aio_read"
/usr/include/linux/fs.h:1301: error: syntax error before "size_t"
/usr/include/linux/fs.h:1302: error: syntax error before "__generic_file_aio_read"
/usr/include/linux/fs.h:1302: error: syntax error before "loff_t"
/usr/include/linux/fs.h:1303: error: syntax error before "generic_file_aio_write"
/usr/include/linux/fs.h:1303: error: syntax error before "size_t"
/usr/include/linux/fs.h:1304: error: syntax error before "generic_file_aio_write_nolock"
/usr/include/linux/fs.h:1305: error: syntax error before "loff_t"
/usr/include/linux/fs.h:1306: error: syntax error before "do_sync_read"
/usr/include/linux/fs.h:1306: error: syntax error before "size_t"
/usr/include/linux/fs.h:1307: error: syntax error before "do_sync_write"
/usr/include/linux/fs.h:1307: error: syntax error before "size_t"
/usr/include/linux/fs.h:1308: error: syntax error before "generic_file_write_nolock"
/usr/include/linux/fs.h:1309: error: syntax error before "loff_t"
/usr/include/linux/fs.h:1310: error: syntax error before "generic_file_sendfile"
/usr/include/linux/fs.h:1310: error: syntax error before "loff_t"
/usr/include/linux/fs.h:1312: error: syntax error before "loff_t"
/usr/include/linux/fs.h:1315: error: syntax error before "generic_file_direct_IO"
/usr/include/linux/fs.h:1316: error: syntax error before "loff_t"
/usr/include/linux/fs.h:1318: error: syntax error before "loff_t"
/usr/include/linux/fs.h:1320: error: syntax error before "generic_file_readv"
/usr/include/linux/fs.h:1321: error: syntax error before "loff_t"
/usr/include/linux/fs.h:1322: error: syntax error before "generic_file_writev"
/usr/include/linux/fs.h:1323: error: syntax error before "loff_t"
/usr/include/linux/fs.h:1324: error: syntax error before "no_llseek"
/usr/include/linux/fs.h:1324: error: syntax error before "loff_t"
/usr/include/linux/fs.h:1325: error: syntax error before "generic_file_llseek"
/usr/include/linux/fs.h:1325: error: syntax error before "loff_t"
/usr/include/linux/fs.h:1326: error: syntax error before "remote_llseek"
/usr/include/linux/fs.h:1326: error: syntax error before "loff_t"
/usr/include/linux/fs.h:1329: error: syntax error before "loff_t"
/usr/include/linux/fs.h: In function `do_generic_file_read':
/usr/include/linux/fs.h:1333: error: `filp' undeclared (first use in this function)
/usr/include/linux/fs.h:1336: error: `ppos' undeclared (first use in this function)
/usr/include/linux/fs.h:1337: error: `desc' undeclared (first use in this function)
/usr/include/linux/fs.h:1338: error: `actor' undeclared (first use in this function)
/usr/include/linux/fs.h: At top level:
/usr/include/linux/fs.h:1353: error: syntax error before "loff_t"
/usr/include/linux/fs.h:1354: error: syntax error before "loff_t"
/usr/include/linux/fs.h:1355: error: syntax error before "inode_get_bytes"
/usr/include/linux/fs.h:1356: error: syntax error before "loff_t"
/usr/include/linux/fs.h:1371: error: syntax error before "dcache_dir_lseek"
/usr/include/linux/fs.h:1371: error: syntax error before "loff_t"
/usr/include/linux/fs.h:1388: error: syntax error before "generic_read_dir"
/usr/include/linux/fs.h:1388: error: syntax error before "size_t"
/usr/include/linux/fs.h:1401: error: syntax error before "parent_ino"
/usr/include/linux/fs.h: In function `parent_ino':
/usr/include/linux/fs.h:1403: error: `ino_t' undeclared (first use in this function)
/usr/include/linux/fs.h:1403: error: syntax error before "res"
/usr/include/linux/fs.h:1406: error: `res' undeclared (first use in this function)
/usr/include/linux/fs.h:1406: error: dereferencing pointer to incomplete type
In file included from zaptel.c:45:
/usr/include/linux/proc_fs.h: At top level:
/usr/include/linux/proc_fs.h:49: error: syntax error before "off_t"
/usr/include/linux/proc_fs.h:53: error: syntax error before "off_t"
/usr/include/linux/proc_fs.h:59: error: syntax error before "mode_t"
/usr/include/linux/proc_fs.h:61: error: syntax error before "uid"
/usr/include/linux/proc_fs.h:62: error: syntax error before "gid"
/usr/include/linux/proc_fs.h:63: error: conflicting types for `size'
/usr/include/linux/stat.h:67: error: previous declaration of `size'
/usr/include/linux/proc_fs.h:68: error: conflicting types for `parent'
/usr/include/linux/sched.h:381: error: previous declaration of `parent'
/usr/include/linux/proc_fs.h:72: error: conflicting types for `count'
/usr/include/linux/fs.h:780: error: previous declaration of `count'
/usr/include/linux/proc_fs.h:74: error: syntax error before '}' token
/usr/include/linux/proc_fs.h:79: error: syntax error before "size_t"
/usr/include/linux/proc_fs.h:99: error: syntax error before "mode_t"
/usr/include/linux/proc_fs.h:146: error: syntax error before "mode_t"
/usr/include/linux/proc_fs.h: In function `create_proc_read_entry':
/usr/include/linux/proc_fs.h:149: error: `name' undeclared (first use in this function)
/usr/include/linux/proc_fs.h:149: error: `base' undeclared (first use in this function)
/usr/include/linux/proc_fs.h:151: error: dereferencing pointer to incomplete type
/usr/include/linux/proc_fs.h:152: error: dereferencing pointer to incomplete type
/usr/include/linux/proc_fs.h: At top level:
/usr/include/linux/proc_fs.h:158: error: syntax error before "mode_t"
/usr/include/linux/proc_fs.h: In function `create_proc_info_entry':
/usr/include/linux/proc_fs.h:160: error: `name' undeclared (first use in this function)
/usr/include/linux/proc_fs.h:160: error: `base' undeclared (first use in this function)
/usr/include/linux/proc_fs.h:161: error: dereferencing pointer to incomplete type
/usr/include/linux/proc_fs.h: At top level:
/usr/include/linux/proc_fs.h:166: error: syntax error before "mode_t"
/usr/include/linux/proc_fs.h: In function `proc_net_create':
/usr/include/linux/proc_fs.h:168: error: `name' undeclared (first use in this function)
/usr/include/linux/proc_fs.h: At top level:
/usr/include/linux/proc_fs.h:172: error: syntax error before "mode_t"
/usr/include/linux/proc_fs.h: In function `proc_net_fops_create':
/usr/include/linux/proc_fs.h:174: error: `name' undeclared (first use in this function)
/usr/include/linux/proc_fs.h:176: error: dereferencing pointer to incomplete type
/usr/include/linux/proc_fs.h:176: error: `fops' undeclared (first use in this function)
/usr/include/linux/proc_fs.h: At top level:
/usr/include/linux/proc_fs.h:232: error: syntax error before "size_t"
/usr/include/linux/proc_fs.h:244: error: field `vfs_inode' has incomplete type
/usr/include/linux/proc_fs.h: In function `PROC_I':
/usr/include/linux/proc_fs.h:249: error: `size_t' undeclared (first use in this function)
In file included from /usr/include/linux/pci.h:347,
from zaptel.c:46:
/usr/include/linux/device.h: At top level:
/usr/include/linux/device.h:87: error: field `attr' has incomplete type
/usr/include/linux/device.h:88: error: syntax error before "ssize_t"
/usr/include/linux/device.h:89: error: syntax error before '*' token
/usr/include/linux/device.h:89: error: syntax error before "size_t"
/usr/include/linux/device.h:89: error: `ssize_t' declared as function returning a function
/usr/include/linux/device.h:128: error: field `attr' has incomplete type
/usr/include/linux/device.h:129: error: syntax error before "ssize_t"
/usr/include/linux/device.h:130: error: syntax error before '*' token
/usr/include/linux/device.h:130: error: syntax error before "size_t"
/usr/include/linux/device.h:130: error: `ssize_t' declared as function returning a function
/usr/include/linux/device.h:168: error: field `attr' has incomplete type
/usr/include/linux/device.h:169: error: syntax error before "ssize_t"
/usr/include/linux/device.h:170: error: syntax error before '*' token
/usr/include/linux/device.h:170: error: syntax error before "size_t"
/usr/include/linux/device.h:170: error: `ssize_t' declared as function returning a function
/usr/include/linux/device.h:220: error: field `attr' has incomplete type
/usr/include/linux/device.h:221: error: syntax error before "ssize_t"
/usr/include/linux/device.h:222: error: syntax error before '*' token
/usr/include/linux/device.h:222: error: syntax error before "size_t"
/usr/include/linux/device.h:222: error: `ssize_t' declared as function returning a function
/usr/include/linux/device.h: In function `list_to_dev':
/usr/include/linux/device.h:285: error: `size_t' undeclared (first use in this function)
/usr/include/linux/device.h: At top level:
/usr/include/linux/device.h:324: error: field `attr' has incomplete type
/usr/include/linux/device.h:325: error: syntax error before "ssize_t"
/usr/include/linux/device.h:326: error: syntax error before '*' token
/usr/include/linux/device.h:326: error: syntax error before "size_t"
/usr/include/linux/device.h:326: error: `ssize_t' declared as function returning a function
In file included from zaptel.c:46:
/usr/include/linux/pci.h:690: error: syntax error before "size_t"
In file included from /usr/include/asm/pci.h:7,
from /usr/include/linux/pci.h:704,
from zaptel.c:46:
/usr/include/linux/mm.h:409: error: syntax error before "loff_t"
/usr/include/linux/mm.h:427: error: syntax error before "loff_t"
/usr/include/linux/mm.h:429: error: syntax error before "loff_t"
/usr/include/linux/mm.h:439: error: syntax error before "loff_t"
/usr/include/linux/mm.h:518: error: `get_unmapped_area' redeclared as different kind of symbol
/usr/include/linux/fs.h:814: error: previous declaration of `get_unmapped_area'
/usr/include/linux/mm.h:537: error: syntax error before "size_t"
/usr/include/linux/mm.h:563: error: syntax error before "loff_t"
/usr/include/linux/mm.h:584: error: syntax error before "pgoff_t"
In file included from /usr/include/linux/pci.h:704,
from zaptel.c:46:
/usr/include/asm/pci.h:80: error: syntax error before "size_t"
In file included from /usr/include/linux/dma-mapping.h:13,
from /usr/include/asm-generic/pci-dma-compat.h:7,
from /usr/include/asm/pci.h:92,
from /usr/include/linux/pci.h:704,
from zaptel.c:46:
/usr/include/asm/dma-mapping.h:9: error: syntax error before "size_t"
/usr/include/asm/dma-mapping.h:12: error: syntax error before "size_t"
/usr/include/asm/dma-mapping.h:16: error: syntax error before "size_t"
/usr/include/asm/dma-mapping.h: In function `dma_map_single':
/usr/include/asm/dma-mapping.h:19: error: `direction' undeclared (first use in this function)
/usr/include/asm/dma-mapping.h:21: error: `ptr' undeclared (first use in this function)
/usr/include/asm/dma-mapping.h: At top level:
/usr/include/asm/dma-mapping.h:25: error: syntax error before "size_t"
/usr/include/asm/dma-mapping.h: In function `dma_unmap_single':
/usr/include/asm/dma-mapping.h:28: error: `direction' undeclared (first use in this function)
/usr/include/asm/dma-mapping.h: At top level:
/usr/include/asm/dma-mapping.h:51: error: syntax error before "size_t"
/usr/include/asm/dma-mapping.h: In function `dma_map_page':
/usr/include/asm/dma-mapping.h:53: error: `direction' undeclared (first use in this function)
/usr/include/asm/dma-mapping.h:54: error: `page' undeclared (first use in this function)
/usr/include/asm/dma-mapping.h:54: error: `offset' undeclared (first use in this function)
/usr/include/asm/dma-mapping.h: At top level:
/usr/include/asm/dma-mapping.h:58: error: syntax error before "size_t"
/usr/include/asm/dma-mapping.h: In function `dma_unmap_page':
/usr/include/asm/dma-mapping.h:61: error: `direction' undeclared (first use in this function)
/usr/include/asm/dma-mapping.h: At top level:
/usr/include/asm/dma-mapping.h:73: error: syntax error before "size_t"
/usr/include/asm/dma-mapping.h:81: error: syntax error before "size_t"
/usr/include/asm/dma-mapping.h:131: error: syntax error before "size_t"
In file included from /usr/include/asm/pci.h:92,
from /usr/include/linux/pci.h:704,
from zaptel.c:46:
/usr/include/asm-generic/pci-dma-compat.h:19: error: syntax error before "size_t"
/usr/include/asm-generic/pci-dma-compat.h: In function `pci_alloc_consistent':
/usr/include/asm-generic/pci-dma-compat.h:22: error: `hwdev' undeclared (first use in this function)
/usr/include/asm-generic/pci-dma-compat.h:22: error: `dma_handle' undeclared (first use in this function)
/usr/include/asm-generic/pci-dma-compat.h: At top level:
/usr/include/asm-generic/pci-dma-compat.h:26: error: syntax error before "size_t"
/usr/include/asm-generic/pci-dma-compat.h: In function `pci_free_consistent':
/usr/include/asm-generic/pci-dma-compat.h:29: error: `hwdev' undeclared (first use in this function)
/usr/include/asm-generic/pci-dma-compat.h:29: error: `vaddr' undeclared (first use in this function)
/usr/include/asm-generic/pci-dma-compat.h:29: error: `dma_handle' undeclared (first use in this function)
/usr/include/asm-generic/pci-dma-compat.h: At top level:
/usr/include/asm-generic/pci-dma-compat.h:33: error: syntax error before "size_t"
/usr/include/asm-generic/pci-dma-compat.h: In function `pci_map_single':
/usr/include/asm-generic/pci-dma-compat.h:35: error: `hwdev' undeclared (first use in this function)
/usr/include/asm-generic/pci-dma-compat.h:35: error: `ptr' undeclared (first use in this function)
/usr/include/asm-generic/pci-dma-compat.h:35: error: `direction' undeclared (first use in this function)
/usr/include/asm-generic/pci-dma-compat.h: At top level:
/usr/include/asm-generic/pci-dma-compat.h:40: error: syntax error before "size_t"
/usr/include/asm-generic/pci-dma-compat.h: In function `pci_unmap_single':
/usr/include/asm-generic/pci-dma-compat.h:42: error: `hwdev' undeclared (first use in this function)
/usr/include/asm-generic/pci-dma-compat.h:42: error: `dma_addr' undeclared (first use in this function)
/usr/include/asm-generic/pci-dma-compat.h:42: error: `direction' undeclared (first use in this function)
/usr/include/asm-generic/pci-dma-compat.h: At top level:
/usr/include/asm-generic/pci-dma-compat.h:47: error: syntax error before "size_t"
/usr/include/asm-generic/pci-dma-compat.h: In function `pci_map_page':
/usr/include/asm-generic/pci-dma-compat.h:49: error: `hwdev' undeclared (first use in this function)
/usr/include/asm-generic/pci-dma-compat.h:49: error: `page' undeclared (first use in this function)
/usr/include/asm-generic/pci-dma-compat.h:49: error: `offset' undeclared (first use in this function)
/usr/include/asm-generic/pci-dma-compat.h:49: error: `direction' undeclared (first use in this function)
/usr/include/asm-generic/pci-dma-compat.h: At top level:
/usr/include/asm-generic/pci-dma-compat.h:54: error: syntax error before "size_t"
/usr/include/asm-generic/pci-dma-compat.h: In function `pci_unmap_page':
/usr/include/asm-generic/pci-dma-compat.h:56: error: `hwdev' undeclared (first use in this function)
/usr/include/asm-generic/pci-dma-compat.h:56: error: `dma_address' undeclared (first use in this function)
/usr/include/asm-generic/pci-dma-compat.h:56: error: `direction' undeclared (first use in this function)
/usr/include/asm-generic/pci-dma-compat.h: At top level:
/usr/include/asm-generic/pci-dma-compat.h:75: error: syntax error before "size_t"
/usr/include/asm-generic/pci-dma-compat.h: In function `pci_dma_sync_single':
/usr/include/asm-generic/pci-dma-compat.h:77: error: `hwdev' undeclared (first use in this function)
/usr/include/asm-generic/pci-dma-compat.h:77: error: `dma_handle' undeclared (first use in this function)
/usr/include/asm-generic/pci-dma-compat.h:77: error: `direction' undeclared (first use in this function)
In file included from zaptel.c:56:
/usr/include/linux/ppp_defs.h: At top level:
/usr/include/linux/ppp_defs.h:176: error: syntax error before "time_t"
In file included from ecdis.h:30,
from zaptel.h:51,
from zaptel.c:82:
biquad.h:31: error: syntax error before "int32_t"
biquad.h:31: warning: no semicolon at end of struct or union
biquad.h:32: warning: type defaults to `int' in declaration of `a1'
biquad.h:32: warning: data definition has no type or storage class
biquad.h:33: error: syntax error before "a2"
biquad.h:33: warning: type defaults to `int' in declaration of `a2'
biquad.h:33: warning: data definition has no type or storage class
biquad.h:34: error: syntax error before "b1"
biquad.h:34: warning: type defaults to `int' in declaration of `b1'
biquad.h:34: warning: data definition has no type or storage class
biquad.h:35: error: syntax error before "b2"
biquad.h:35: warning: type defaults to `int' in declaration of `b2'
biquad.h:35: warning: data definition has no type or storage class
biquad.h:37: error: syntax error before "z1"
biquad.h:37: warning: type defaults to `int' in declaration of `z1'
biquad.h:37: warning: data definition has no type or storage class
biquad.h:38: error: syntax error before "z2"
biquad.h:38: warning: type defaults to `int' in declaration of `z2'
biquad.h:38: warning: data definition has no type or storage class
biquad.h:39: warning: type defaults to `int' in declaration of `biquad2_state_t'
biquad.h:39: warning: data definition has no type or storage class
biquad.h:41: error: syntax error before '*' token
biquad.h:47: warning: function declaration isn't a prototype
biquad.h: In function `biquad2_init':
biquad.h:48: error: `bq' undeclared (first use in this function)
biquad.h:48: error: `gain' undeclared (first use in this function)
biquad.h: At top level:
biquad.h:59: error: syntax error before "biquad2"
biquad.h:59: error: syntax error before '*' token
biquad.h:60: warning: return type defaults to `int'
biquad.h:60: warning: function declaration isn't a prototype
biquad.h: In function `biquad2':
biquad.h:61: error: `int32_t' undeclared (first use in this function)
biquad.h:61: error: syntax error before "y"
biquad.h:64: error: `z0' undeclared (first use in this function)
biquad.h:64: error: `sample' undeclared (first use in this function)
biquad.h:64: error: `bq' undeclared (first use in this function)
biquad.h:65: error: `y' undeclared (first use in this function)
In file included from zaptel.h:51,
from zaptel.c:82:
ecdis.h: At top level:
ecdis.h:34: error: syntax error before "biquad2_state_t"
ecdis.h:34: warning: no semicolon at end of struct or union
ecdis.h:41: error: syntax error before '}' token
ecdis.h:41: warning: type defaults to `int' in declaration of `echo_can_disable_detector_state_t'
ecdis.h:41: warning: data definition has no type or storage class
ecdis.h:47: error: syntax error before '*' token
ecdis.h:48: warning: function declaration isn't a prototype
ecdis.h: In function `echo_can_disable_detector_init':
ecdis.h:52: error: `det' undeclared (first use in this function)
ecdis.h:53: error: `int32_t' undeclared (first use in this function)
ecdis.h: At top level:
ecdis.h:68: error: syntax error before '*' token
ecdis.h:70: warning: function declaration isn't a prototype
ecdis.h: In function `echo_can_disable_detector_update':
ecdis.h:71: error: `int16_t' undeclared (first use in this function)
ecdis.h:71: error: syntax error before "notched"
ecdis.h:73: error: `notched' undeclared (first use in this function)
ecdis.h:73: error: `det' undeclared (first use in this function)
ecdis.h:73: error: `amp' undeclared (first use in this function)
In file included from zaptel.c:82:
zaptel.h: At top level:
zaptel.h:934: error: syntax error before "u_char"
zaptel.h:934: warning: no semicolon at end of struct or union
zaptel.h:935: warning: type defaults to `int' in declaration of `buf'
zaptel.h:935: error: conflicting types for `buf'
/usr/include/linux/fs.h:781: error: previous declaration of `buf'
zaptel.h:935: warning: data definition has no type or storage class
zaptel.h:938: error: syntax error before '}' token
zaptel.h:986: error: syntax error before "u_char"
zaptel.h:986: warning: no semicolon at end of struct or union
zaptel.h:987: warning: type defaults to `int' in declaration of `swritechunk'
zaptel.h:987: warning: data definition has no type or storage class
zaptel.h:988: error: syntax error before '*' token
zaptel.h:988: warning: type defaults to `int' in declaration of `readchunk'
zaptel.h:988: warning: data definition has no type or storage class
zaptel.h:989: error: syntax error before "sreadchunk"
zaptel.h:989: warning: type defaults to `int' in declaration of `sreadchunk'
zaptel.h:989: warning: data definition has no type or storage class
zaptel.h:992: error: syntax error before '*' token
zaptel.h:992: warning: type defaults to `int' in declaration of `rxgain'
zaptel.h:992: warning: data definition has no type or storage class
zaptel.h:993: error: syntax error before '*' token
zaptel.h:993: warning: type defaults to `int' in declaration of `txgain'
zaptel.h:993: warning: data definition has no type or storage class
zaptel.h:1010: error: syntax error before '*' token
zaptel.h:1010: warning: type defaults to `int' in declaration of `readbuf'
zaptel.h:1010: warning: data definition has no type or storage class
zaptel.h:1015: error: syntax error before '*' token
zaptel.h:1015: warning: type defaults to `int' in declaration of `writebuf'
zaptel.h:1015: warning: data definition has no type or storage class
zaptel.h:1046: error: `ts' used prior to declaration
zaptel.h:1096: error: syntax error before "txecdis"
zaptel.h:1096: warning: type defaults to `int' in declaration of `txecdis'
zaptel.h:1096: warning: data definition has no type or storage class
zaptel.h:1097: error: syntax error before "rxecdis"
zaptel.h:1097: warning: type defaults to `int' in declaration of `rxecdis'
zaptel.h:1097: warning: data definition has no type or storage class
zaptel.h:1158: error: syntax error before '}' token
zaptel.h:1398: error: syntax error before "__zt_lin2mu"
zaptel.h:1398: warning: type defaults to `int' in declaration of `__zt_lin2mu'
zaptel.h:1398: warning: data definition has no type or storage class
zaptel.h:1399: error: syntax error before "__zt_lin2a"
zaptel.h:1399: warning: type defaults to `int' in declaration of `__zt_lin2a'
zaptel.h:1399: warning: data definition has no type or storage class
zaptel.h: In function `zt_txtone_nextsample':
zaptel.h:1450: error: dereferencing pointer to incomplete type
zaptel.h:1450: error: dereferencing pointer to incomplete type
zaptel.h:1451: error: dereferencing pointer to incomplete type
zaptel.h:1451: error: dereferencing pointer to incomplete type
zaptel.h:1452: error: dereferencing pointer to incomplete type
zaptel.h:1452: error: dereferencing pointer to incomplete type
zaptel.h:1452: error: dereferencing pointer to incomplete type
zaptel.h:1452: error: dereferencing pointer to incomplete type
zaptel.h:1453: error: dereferencing pointer to incomplete type
zaptel.c: At top level:
zaptel.c:352: error: syntax error before "__zt_lin2mu"
zaptel.c:352: warning: type defaults to `int' in declaration of `__zt_lin2mu'
zaptel.c:352: warning: data definition has no type or storage class
zaptel.c:354: error: syntax error before "__zt_lin2a"
zaptel.c:354: warning: type defaults to `int' in declaration of `__zt_lin2a'
zaptel.c:354: warning: data definition has no type or storage class
zaptel.c:357: error: syntax error before "defgain"
zaptel.c:357: warning: type defaults to `int' in declaration of `defgain'
zaptel.c:357: warning: data definition has no type or storage class
zaptel.c: In function `zt_q_sig':
zaptel.c:397: error: dereferencing pointer to incomplete type
zaptel.c:399: error: dereferencing pointer to incomplete type
zaptel.c:400: error: dereferencing pointer to incomplete type
zaptel.c:401: error: dereferencing pointer to incomplete type
zaptel.c:406: error: dereferencing pointer to incomplete type
zaptel.c:409: error: dereferencing pointer to incomplete type
zaptel.c: At top level:
zaptel.c:458: error: syntax error before "off_t"
zaptel.c:459: warning: function declaration isn't a prototype
zaptel.c: In function `zaptel_proc_read':
zaptel.c:465: error: `off' undeclared (first use in this function)
zaptel.c:474: error: `page' undeclared (first use in this function)
zaptel.c:536: error: dereferencing pointer to incomplete type
zaptel.c:536: error: dereferencing pointer to incomplete type
zaptel.c:537: error: dereferencing pointer to incomplete type
zaptel.c:538: error: dereferencing pointer to incomplete type
zaptel.c:539: error: dereferencing pointer to incomplete type
zaptel.c:540: error: dereferencing pointer to incomplete type
zaptel.c:541: error: dereferencing pointer to incomplete type
zaptel.c:543: error: dereferencing pointer to incomplete type
zaptel.c:544: error: dereferencing pointer to incomplete type
zaptel.c:544: error: dereferencing pointer to incomplete type
zaptel.c:548: error: dereferencing pointer to incomplete type
zaptel.c: In function `zt_check_conf':
zaptel.c:633: error: dereferencing pointer to incomplete type
zaptel.c:633: error: dereferencing pointer to incomplete type
zaptel.c: In function `__qevent':
zaptel.c:649: error: dereferencing pointer to incomplete type
zaptel.c:649: error: dereferencing pointer to incomplete type
zaptel.c:652: error: dereferencing pointer to incomplete type
zaptel.c:652: error: dereferencing pointer to incomplete type
zaptel.c:654: error: dereferencing pointer to incomplete type
zaptel.c:654: error: dereferencing pointer to incomplete type
zaptel.c:656: error: dereferencing pointer to incomplete type
zaptel.c:656: error: dereferencing pointer to incomplete type
zaptel.c:658: error: dereferencing pointer to incomplete type
zaptel.c:658: error: dereferencing pointer to incomplete type
zaptel.c:659: error: dereferencing pointer to incomplete type
zaptel.c:660: error: dereferencing pointer to incomplete type
zaptel.c:661: error: dereferencing pointer to incomplete type
zaptel.c: In function `zt_qevent_lock':
zaptel.c:673: error: dereferencing pointer to incomplete type
zaptel.c:675: error: dereferencing pointer to incomplete type
zaptel.c: In function `schluffen':
zaptel.c:683: error: dereferencing pointer to incomplete type
zaptel.c:685: error: dereferencing pointer to incomplete type
zaptel.c: In function `calc_fcs':
zaptel.c:695: error: dereferencing pointer to incomplete type
zaptel.c:695: error: dereferencing pointer to incomplete type
zaptel.c:696: error: dereferencing pointer to incomplete type
zaptel.c:696: error: dereferencing pointer to incomplete type
zaptel.c: In function `zt_reallocbufs':
zaptel.c:727: error: dereferencing pointer to incomplete type
zaptel.c:728: error: dereferencing pointer to incomplete type
zaptel.c:729: error: dereferencing pointer to incomplete type
zaptel.c:730: error: dereferencing pointer to incomplete type
zaptel.c:733: error: dereferencing pointer to incomplete type
zaptel.c:734: error: dereferencing pointer to incomplete type
zaptel.c:738: error: dereferencing pointer to incomplete type
zaptel.c:739: error: dereferencing pointer to incomplete type
zaptel.c:744: error: dereferencing pointer to incomplete type
zaptel.c:745: error: dereferencing pointer to incomplete type
zaptel.c:746: error: dereferencing pointer to incomplete type
zaptel.c:747: error: dereferencing pointer to incomplete type
zaptel.c:752: error: dereferencing pointer to incomplete type
zaptel.c:753: error: dereferencing pointer to incomplete type
zaptel.c:755: error: dereferencing pointer to incomplete type
zaptel.c:756: error: dereferencing pointer to incomplete type
zaptel.c:758: error: dereferencing pointer to incomplete type
zaptel.c:759: error: dereferencing pointer to incomplete type
zaptel.c:760: error: dereferencing pointer to incomplete type
zaptel.c:761: error: dereferencing pointer to incomplete type
zaptel.c:762: error: dereferencing pointer to incomplete type
zaptel.c:764: error: dereferencing pointer to incomplete type
zaptel.c:766: error: dereferencing pointer to incomplete type
zaptel.c:767: error: dereferencing pointer to incomplete type
zaptel.c:769: error: dereferencing pointer to incomplete type
zaptel.c:771: error: dereferencing pointer to incomplete type
zaptel.c: At top level:
zaptel.c:783: error: syntax error before "u_char"
zaptel.c:784: warning: function declaration isn't a prototype
zaptel.c: In function `__buf_pull':
zaptel.c:785: error: `q' undeclared (first use in this function)
zaptel.c:789: error: `c' undeclared (first use in this function)
zaptel.c: At top level:
zaptel.c:811: error: syntax error before '*' token
zaptel.c:812: warning: return type defaults to `int'
zaptel.c: In function `__buf_pushpeek':
zaptel.c:813: error: dereferencing pointer to incomplete type
zaptel.c:815: error: dereferencing pointer to incomplete type
zaptel.c:815: error: dereferencing pointer to incomplete type
zaptel.c: At top level:
zaptel.c:818: error: syntax error before '*' token
zaptel.c:819: warning: return type defaults to `int'
zaptel.c: In function `__buf_peek':
zaptel.c:820: error: dereferencing pointer to incomplete type
zaptel.c:822: error: dereferencing pointer to incomplete type
zaptel.c:822: error: dereferencing pointer to incomplete type
zaptel.c: At top level:
zaptel.c:854: error: syntax error before "u_char"
zaptel.c:855: warning: function declaration isn't a prototype
zaptel.c: In function `__buf_push':
zaptel.c:856: error: `q' undeclared (first use in this function)
zaptel.c: In function `reset_conf':
zaptel.c:884: error: dereferencing pointer to incomplete type
zaptel.c:884: error: dereferencing pointer to incomplete type
zaptel.c:885: error: dereferencing pointer to incomplete type
zaptel.c:886: error: dereferencing pointer to incomplete type
zaptel.c:889: error: dereferencing pointer to incomplete type
zaptel.c:889: error: dereferencing pointer to incomplete type
zaptel.c:890: error: dereferencing pointer to incomplete type
zaptel.c:891: error: dereferencing pointer to incomplete type
zaptel.c: In function `close_channel':
zaptel.c:906: error: dereferencing pointer to incomplete type
zaptel.c:911: error: dereferencing pointer to incomplete type
zaptel.c:912: error: dereferencing pointer to incomplete type
zaptel.c:913: error: dereferencing pointer to incomplete type
zaptel.c:914: error: dereferencing pointer to incomplete type
zaptel.c:915: error: dereferencing pointer to incomplete type
zaptel.c:916: error: dereferencing pointer to incomplete type
zaptel.c:918: error: dereferencing pointer to incomplete type
zaptel.c:918: error: dereferencing pointer to incomplete type
zaptel.c:919: error: dereferencing pointer to incomplete type
zaptel.c:920: error: dereferencing pointer to incomplete type
zaptel.c:921: error: dereferencing pointer to incomplete type
zaptel.c:922: error: dereferencing pointer to incomplete type
zaptel.c:923: error: dereferencing pointer to incomplete type
zaptel.c:924: error: dereferencing pointer to incomplete type
zaptel.c:925: error: dereferencing pointer to incomplete type
zaptel.c:926: error: dereferencing pointer to incomplete type
zaptel.c:927: error: dereferencing pointer to incomplete type
zaptel.c:928: error: dereferencing pointer to incomplete type
zaptel.c:929: error: dereferencing pointer to incomplete type
zaptel.c:930: error: dereferencing pointer to incomplete type
zaptel.c:932: error: dereferencing pointer to incomplete type
zaptel.c:934: error: dereferencing pointer to incomplete type
zaptel.c:936: error: dereferencing pointer to incomplete type
zaptel.c:937: error: dereferencing pointer to incomplete type
zaptel.c:938: error: dereferencing pointer to incomplete type
zaptel.c:939: error: dereferencing pointer to incomplete type
zaptel.c:941: error: dereferencing pointer to incomplete type
zaptel.c:944: error: dereferencing pointer to incomplete type
zaptel.c:947: error: dereferencing pointer to incomplete type
zaptel.c:947: error: dereferencing pointer to incomplete type
zaptel.c:948: error: dereferencing pointer to incomplete type
zaptel.c:950: error: dereferencing pointer to incomplete type
zaptel.c:951: error: dereferencing pointer to incomplete type
zaptel.c:952: error: dereferencing pointer to incomplete type
zaptel.c:953: error: dereferencing pointer to incomplete type
zaptel.c:953: error: dereferencing pointer to incomplete type
zaptel.c:954: error: dereferencing pointer to incomplete type
zaptel.c:958: error: dereferencing pointer to incomplete type
zaptel.c:958: error: dereferencing pointer to incomplete type
zaptel.c:958: error: dereferencing pointer to incomplete type
zaptel.c:958: error: dereferencing pointer to incomplete type
zaptel.c:958: error: dereferencing pointer to incomplete type
zaptel.c:958: error: dereferencing pointer to incomplete type
zaptel.c:958: error: dereferencing pointer to incomplete type
zaptel.c:958: error: dereferencing pointer to incomplete type
zaptel.c:958: error: dereferencing pointer to incomplete type
zaptel.c:958: error: dereferencing pointer to incomplete type
zaptel.c:959: error: dereferencing pointer to incomplete type
zaptel.c:959: error: dereferencing pointer to incomplete type
zaptel.c:959: error: dereferencing pointer to incomplete type
zaptel.c:959: error: dereferencing pointer to incomplete type
zaptel.c:959: error: dereferencing pointer to incomplete type
zaptel.c:959: error: dereferencing pointer to incomplete type
zaptel.c:959: error: dereferencing pointer to incomplete type
zaptel.c:959: error: dereferencing pointer to incomplete type
zaptel.c:959: error: dereferencing pointer to incomplete type
zaptel.c:959: error: dereferencing pointer to incomplete type
zaptel.c:960: error: dereferencing pointer to incomplete type
zaptel.c:960: error: dereferencing pointer to incomplete type
zaptel.c:960: error: dereferencing pointer to incomplete type
zaptel.c:960: error: dereferencing pointer to incomplete type
zaptel.c:960: error: dereferencing pointer to incomplete type
zaptel.c:960: error: dereferencing pointer to incomplete type
zaptel.c:960: error: dereferencing pointer to incomplete type
zaptel.c:960: error: dereferencing pointer to incomplete type
zaptel.c:960: error: dereferencing pointer to incomplete type
zaptel.c:960: error: dereferencing pointer to incomplete type
zaptel.c:962: error: dereferencing pointer to incomplete type
zaptel.c:962: error: dereferencing pointer to incomplete type
zaptel.c:963: error: dereferencing pointer to incomplete type
zaptel.c:964: error: dereferencing pointer to incomplete type
zaptel.c:964: error: dereferencing pointer to incomplete type
zaptel.c:965: error: dereferencing pointer to incomplete type
zaptel.c:967: error: dereferencing pointer to incomplete type
zaptel.c: In function `start_tone':
zaptel.c:1028: error: dereferencing pointer to incomplete type
zaptel.c:1029: error: dereferencing pointer to incomplete type
zaptel.c:1030: error: dereferencing pointer to incomplete type
zaptel.c:1031: error: dereferencing pointer to incomplete type
zaptel.c:1032: error: dereferencing pointer to incomplete type
zaptel.c:1038: error: dereferencing pointer to incomplete type
zaptel.c:1040: error: dereferencing pointer to incomplete type
zaptel.c:1041: error: dereferencing pointer to incomplete type
zaptel.c:1041: error: dereferencing pointer to incomplete type
zaptel.c:1047: error: dereferencing pointer to incomplete type
zaptel.c:1048: error: dereferencing pointer to incomplete type
zaptel.c:1048: error: dereferencing pointer to incomplete type
zaptel.c: In function `set_tone_zone':
zaptel.c:1064: error: dereferencing pointer to incomplete type
zaptel.c:1065: error: dereferencing pointer to incomplete type
zaptel.c:1066: error: dereferencing pointer to incomplete type
zaptel.c:1066: error: dereferencing pointer to incomplete type
zaptel.c:1066: error: dereferencing pointer to incomplete type
zaptel.c:1066: error: dereferencing pointer to incomplete type
zaptel.c:1066: error: dereferencing pointer to incomplete type
zaptel.c:1066: error: dereferencing pointer to incomplete type
zaptel.c:1066: error: dereferencing pointer to incomplete type
zaptel.c: In function `zt_set_law':
zaptel.c:1078: error: dereferencing pointer to incomplete type
zaptel.c:1079: error: dereferencing pointer to incomplete type
zaptel.c:1081: error: dereferencing pointer to incomplete type
zaptel.c:1081: error: dereferencing pointer to incomplete type
zaptel.c:1085: error: dereferencing pointer to incomplete type
zaptel.c:1089: error: dereferencing pointer to incomplete type
zaptel.c:1092: error: dereferencing pointer to incomplete type
zaptel.c:1096: error: dereferencing pointer to incomplete type
zaptel.c: In function `zt_chan_reg':
zaptel.c:1155: error: dereferencing pointer to incomplete type
zaptel.c:1159: error: dereferencing pointer to incomplete type
zaptel.c:1160: error: dereferencing pointer to incomplete type
zaptel.c:1161: error: dereferencing pointer to incomplete type
zaptel.c:1162: error: dereferencing pointer to incomplete type
zaptel.c:1163: error: dereferencing pointer to incomplete type
zaptel.c:1163: error: dereferencing pointer to incomplete type
zaptel.c:1164: error: dereferencing pointer to incomplete type
zaptel.c:1165: error: dereferencing pointer to incomplete type
zaptel.c:1165: error: dereferencing pointer to incomplete type
zaptel.c:1170: error: dereferencing pointer to incomplete type
zaptel.c: In function `zt_chan_unreg':
zaptel.c:1548: error: dereferencing pointer to incomplete type
zaptel.c:1549: error: dereferencing pointer to incomplete type
zaptel.c:1550: error: dereferencing pointer to incomplete type
zaptel.c:1563: error: dereferencing pointer to incomplete type
zaptel.c:1564: error: dereferencing pointer to incomplete type
zaptel.c:1566: error: dereferencing pointer to incomplete type
zaptel.c:1566: error: dereferencing pointer to incomplete type
zaptel.c:1567: error: dereferencing pointer to incomplete type
zaptel.c:1568: error: dereferencing pointer to incomplete type
zaptel.c:1569: error: dereferencing pointer to incomplete type
zaptel.c:1572: error: dereferencing pointer to incomplete type
zaptel.c:1573: error: dereferencing pointer to incomplete type
zaptel.c:1574: error: dereferencing pointer to incomplete type
zaptel.c:1574: error: dereferencing pointer to incomplete type
zaptel.c:1575: error: dereferencing pointer to incomplete type
zaptel.c:1577: error: dereferencing pointer to incomplete type
zaptel.c:1578: error: dereferencing pointer to incomplete type
zaptel.c:1579: error: dereferencing pointer to incomplete type
zaptel.c:1582: error: dereferencing pointer to incomplete type
zaptel.c: At top level:
zaptel.c:1586: error: syntax error before "zt_chan_read"
zaptel.c:1586: error: syntax error before "size_t"
zaptel.c:1587: warning: return type defaults to `int'
zaptel.c:1587: warning: function declaration isn't a prototype
zaptel.c: In function `zt_chan_read':
zaptel.c:1588: error: `unit' undeclared (first use in this function)
zaptel.c:1594: error: invalid operands to binary &
zaptel.c:1597: error: invalid operands to binary <
zaptel.c:1600: error: dereferencing pointer to incomplete type
zaptel.c:1601: error: dereferencing pointer to incomplete type
zaptel.c:1601: error: dereferencing pointer to incomplete type
zaptel.c:1602: error: dereferencing pointer to incomplete type
zaptel.c:1605: error: dereferencing pointer to incomplete type
zaptel.c:1606: error: dereferencing pointer to incomplete type
zaptel.c:1608: error: dereferencing pointer to incomplete type
zaptel.c:1610: error: dereferencing pointer to incomplete type
zaptel.c:1612: error: dereferencing pointer to incomplete type
zaptel.c:1615: error: incompatible types in assignment
zaptel.c:1616: error: dereferencing pointer to incomplete type
zaptel.c:1617: error: dereferencing pointer to incomplete type
zaptel.c:1617: error: dereferencing pointer to incomplete type
zaptel.c:1618: error: dereferencing pointer to incomplete type
zaptel.c:1618: error: dereferencing pointer to incomplete type
zaptel.c:1631: error: dereferencing pointer to incomplete type
zaptel.c:1631: error: dereferencing pointer to incomplete type
zaptel.c:1631: error: dereferencing pointer to incomplete type
zaptel.c:1632: error: `usrbuf' undeclared (first use in this function)
zaptel.c:1639: error: dereferencing pointer to incomplete type
zaptel.c:1639: error: dereferencing pointer to incomplete type
zaptel.c:1640: error: dereferencing pointer to incomplete type
zaptel.c:1640: error: dereferencing pointer to incomplete type
zaptel.c:1642: error: dereferencing pointer to incomplete type
zaptel.c:1642: error: dereferencing pointer to incomplete type
zaptel.c:1646: error: dereferencing pointer to incomplete type
zaptel.c:1647: error: dereferencing pointer to incomplete type
zaptel.c:1647: error: dereferencing pointer to incomplete type
zaptel.c:1648: error: dereferencing pointer to incomplete type
zaptel.c:1648: error: dereferencing pointer to incomplete type
zaptel.c:1649: error: dereferencing pointer to incomplete type
zaptel.c:1650: error: dereferencing pointer to incomplete type
zaptel.c:1650: error: dereferencing pointer to incomplete type
zaptel.c:1650: error: dereferencing pointer to incomplete type
zaptel.c:1651: error: dereferencing pointer to incomplete type
zaptel.c:1651: error: dereferencing pointer to incomplete type
zaptel.c:1653: error: dereferencing pointer to incomplete type
zaptel.c:1654: error: dereferencing pointer to incomplete type
zaptel.c:1655: error: dereferencing pointer to incomplete type
zaptel.c:1657: error: dereferencing pointer to incomplete type
zaptel.c:1659: error: dereferencing pointer to incomplete type
zaptel.c:1661: error: dereferencing pointer to incomplete type
zaptel.c: At top level:
zaptel.c:1666: error: syntax error before "zt_chan_write"
zaptel.c:1666: error: syntax error before "size_t"
zaptel.c:1667: warning: return type defaults to `int'
zaptel.c:1667: warning: function declaration isn't a prototype
zaptel.c: In function `zt_chan_write':
zaptel.c:1669: error: `unit' undeclared (first use in this function)
zaptel.c:1672: error: invalid operands to binary &
zaptel.c:1675: error: invalid operands to binary <
zaptel.c:1678: error: dereferencing pointer to incomplete type
zaptel.c:1679: error: dereferencing pointer to incomplete type
zaptel.c:1679: error: dereferencing pointer to incomplete type
zaptel.c:1679: error: dereferencing pointer to incomplete type
zaptel.c:1680: error: dereferencing pointer to incomplete type
zaptel.c:1681: error: dereferencing pointer to incomplete type
zaptel.c:1682: error: dereferencing pointer to incomplete type
zaptel.c:1683: error: dereferencing pointer to incomplete type
zaptel.c:1684: error: dereferencing pointer to incomplete type
zaptel.c:1686: error: dereferencing pointer to incomplete type
zaptel.c:1686: error: dereferencing pointer to incomplete type
zaptel.c:1687: error: dereferencing pointer to incomplete type
zaptel.c:1690: error: dereferencing pointer to incomplete type
zaptel.c:1691: error: dereferencing pointer to incomplete type
zaptel.c:1694: error: dereferencing pointer to incomplete type
zaptel.c:1697: error: dereferencing pointer to incomplete type
zaptel.c:1702: error: incompatible types in assignment
zaptel.c:1703: error: dereferencing pointer to incomplete type
zaptel.c:1704: error: dereferencing pointer to incomplete type
zaptel.c:1705: error: dereferencing pointer to incomplete type
zaptel.c:1707: error: dereferencing pointer to incomplete type
zaptel.c:1708: error: dereferencing pointer to incomplete type
zaptel.c:1717: error: dereferencing pointer to incomplete type
zaptel.c:1728: error: `usrbuf' undeclared (first use in this function)
zaptel.c:1732: error: dereferencing pointer to incomplete type
zaptel.c:1732: error: dereferencing pointer to incomplete type
zaptel.c:1732: error: dereferencing pointer to incomplete type
zaptel.c:1735: error: dereferencing pointer to incomplete type
zaptel.c:1735: error: dereferencing pointer to incomplete type
zaptel.c:1737: error: dereferencing pointer to incomplete type
zaptel.c:1737: error: dereferencing pointer to incomplete type
zaptel.c:1738: error: dereferencing pointer to incomplete type
zaptel.c:1738: error: dereferencing pointer to incomplete type
zaptel.c:1740: error: dereferencing pointer to incomplete type
zaptel.c:1740: error: dereferencing pointer to incomplete type
zaptel.c:1741: error: dereferencing pointer to incomplete type
zaptel.c:1743: error: dereferencing pointer to incomplete type
zaptel.c:1744: error: dereferencing pointer to incomplete type
zaptel.c:1745: error: dereferencing pointer to incomplete type
zaptel.c:1745: error: dereferencing pointer to incomplete type
zaptel.c:1745: error: dereferencing pointer to incomplete type
zaptel.c:1746: error: dereferencing pointer to incomplete type
zaptel.c:1746: error: dereferencing pointer to incomplete type
zaptel.c:1749: error: dereferencing pointer to incomplete type
zaptel.c:1751: error: dereferencing pointer to incomplete type
zaptel.c:1753: error: dereferencing pointer to incomplete type
zaptel.c:1755: error: dereferencing pointer to incomplete type
zaptel.c:1757: error: dereferencing pointer to incomplete type
zaptel.c: In function `set_txtone':
zaptel.c:1802: error: dereferencing pointer to incomplete type
zaptel.c:1803: error: dereferencing pointer to incomplete type
zaptel.c:1806: error: dereferencing pointer to incomplete type
zaptel.c:1807: error: dereferencing pointer to incomplete type
zaptel.c:1808: error: dereferencing pointer to incomplete type
zaptel.c:1809: error: dereferencing pointer to incomplete type
zaptel.c: In function `zt_rbs_sethook':
zaptel.c:1849: error: dereferencing pointer to incomplete type
zaptel.c:1850: error: dereferencing pointer to incomplete type
zaptel.c:1851: error: dereferencing pointer to incomplete type
zaptel.c:1855: error: dereferencing pointer to incomplete type
zaptel.c:1858: error: dereferencing pointer to incomplete type
zaptel.c:1858: error: dereferencing pointer to incomplete type
zaptel.c:1860: error: dereferencing pointer to incomplete type
zaptel.c:1860: error: dereferencing pointer to incomplete type
zaptel.c:1864: error: dereferencing pointer to incomplete type
zaptel.c:1866: error: dereferencing pointer to incomplete type
zaptel.c:1869: error: dereferencing pointer to incomplete type
zaptel.c:1871: error: dereferencing pointer to incomplete type
zaptel.c:1872: error: dereferencing pointer to incomplete type
zaptel.c:1874: error: dereferencing pointer to incomplete type
zaptel.c:1875: error: dereferencing pointer to incomplete type
zaptel.c:1877: error: dereferencing pointer to incomplete type
zaptel.c:1877: error: dereferencing pointer to incomplete type
zaptel.c:1877: error: dereferencing pointer to incomplete type
zaptel.c:1884: error: dereferencing pointer to incomplete type
zaptel.c:1887: error: dereferencing pointer to incomplete type
zaptel.c:1888: error: dereferencing pointer to incomplete type
zaptel.c:1889: error: dereferencing pointer to incomplete type
zaptel.c:1890: error: dereferencing pointer to incomplete type
zaptel.c:1892: error: dereferencing pointer to incomplete type
zaptel.c:1896: error: dereferencing pointer to incomplete type
zaptel.c:1900: error: dereferencing pointer to incomplete type
zaptel.c:1901: error: dereferencing pointer to incomplete type
zaptel.c:1902: error: dereferencing pointer to incomplete type
zaptel.c:1902: error: dereferencing pointer to incomplete type
zaptel.c:1903: error: dereferencing pointer to incomplete type
zaptel.c:1908: error: dereferencing pointer to incomplete type
zaptel.c:1908: error: dereferencing pointer to incomplete type
zaptel.c: In function `zt_cas_setbits':
zaptel.c:1914: error: dereferencing pointer to incomplete type
zaptel.c:1915: error: dereferencing pointer to incomplete type
zaptel.c:1916: error: dereferencing pointer to incomplete type
zaptel.c:1917: error: dereferencing pointer to incomplete type
zaptel.c: In function `zt_hangup':
zaptel.c:1929: error: dereferencing pointer to incomplete type
zaptel.c:1932: error: dereferencing pointer to incomplete type
zaptel.c:1935: error: dereferencing pointer to incomplete type
zaptel.c:1938: error: dereferencing pointer to incomplete type
zaptel.c:1938: error: dereferencing pointer to incomplete type
zaptel.c:1939: error: dereferencing pointer to incomplete type
zaptel.c:1939: error: dereferencing pointer to incomplete type
zaptel.c:1941: error: dereferencing pointer to incomplete type
zaptel.c:1942: error: dereferencing pointer to incomplete type
zaptel.c:1943: error: dereferencing pointer to incomplete type
zaptel.c:1944: error: dereferencing pointer to incomplete type
zaptel.c:1944: error: dereferencing pointer to incomplete type
zaptel.c:1951: error: dereferencing pointer to incomplete type
zaptel.c:1952: error: dereferencing pointer to incomplete type
zaptel.c:1953: error: dereferencing pointer to incomplete type
zaptel.c:1954: error: dereferencing pointer to incomplete type
zaptel.c:1960: error: dereferencing pointer to incomplete type
zaptel.c:1962: error: dereferencing pointer to incomplete type
zaptel.c:1963: error: dereferencing pointer to incomplete type
zaptel.c:1964: error: dereferencing pointer to incomplete type
zaptel.c:1965: error: dereferencing pointer to incomplete type
zaptel.c:1966: error: dereferencing pointer to incomplete type
zaptel.c:1968: error: dereferencing pointer to incomplete type
zaptel.c:1969: error: dereferencing pointer to incomplete type
zaptel.c:1970: error: dereferencing pointer to incomplete type
zaptel.c:1972: error: dereferencing pointer to incomplete type
zaptel.c:1973: error: dereferencing pointer to incomplete type
zaptel.c:1975: error: dereferencing pointer to incomplete type
zaptel.c:1976: error: dereferencing pointer to incomplete type
zaptel.c:1977: error: dereferencing pointer to incomplete type
zaptel.c:1978: error: dereferencing pointer to incomplete type
zaptel.c:1979: error: dereferencing pointer to incomplete type
zaptel.c:1980: error: dereferencing pointer to incomplete type
zaptel.c:1981: error: dereferencing pointer to incomplete type
zaptel.c:1982: error: dereferencing pointer to incomplete type
zaptel.c: In function `initialize_channel':
zaptel.c:1995: error: dereferencing pointer to incomplete type
zaptel.c:1997: error: dereferencing pointer to incomplete type
zaptel.c:1998: error: dereferencing pointer to incomplete type
zaptel.c:2001: error: dereferencing pointer to incomplete type
zaptel.c:2002: error: dereferencing pointer to incomplete type
zaptel.c:2003: error: dereferencing pointer to incomplete type
zaptel.c:2004: error: dereferencing pointer to incomplete type
zaptel.c:2005: error: dereferencing pointer to incomplete type
zaptel.c:2006: error: dereferencing pointer to incomplete type
zaptel.c:2008: error: dereferencing pointer to incomplete type
zaptel.c:2009: error: dereferencing pointer to incomplete type
zaptel.c:2011: error: dereferencing pointer to incomplete type
zaptel.c:2012: error: dereferencing pointer to incomplete type
zaptel.c:2013: error: dereferencing pointer to incomplete type
zaptel.c:2015: error: dereferencing pointer to incomplete type
zaptel.c:2016: error: dereferencing pointer to incomplete type
zaptel.c:2019: error: dereferencing pointer to incomplete type
zaptel.c:2020: error: dereferencing pointer to incomplete type
zaptel.c:2021: error: dereferencing pointer to incomplete type
zaptel.c:2024: error: dereferencing pointer to incomplete type
zaptel.c:2025: error: dereferencing pointer to incomplete type
zaptel.c:2026: error: dereferencing pointer to incomplete type
zaptel.c:2027: error: dereferencing pointer to incomplete type
zaptel.c:2029: error: dereferencing pointer to incomplete type
zaptel.c:2030: error: dereferencing pointer to incomplete type
zaptel.c:2032: error: dereferencing pointer to incomplete type
zaptel.c:2033: error: dereferencing pointer to incomplete type
zaptel.c:2034: error: dereferencing pointer to incomplete type
zaptel.c:2035: error: dereferencing pointer to incomplete type
zaptel.c:2036: error: dereferencing pointer to incomplete type
zaptel.c:2037: error: dereferencing pointer to incomplete type
zaptel.c:2038: error: dereferencing pointer to incomplete type
zaptel.c:2041: error: dereferencing pointer to incomplete type
zaptel.c:2041: error: dereferencing pointer to incomplete type
zaptel.c:2041: error: dereferencing pointer to incomplete type
zaptel.c:2042: error: dereferencing pointer to incomplete type
zaptel.c:2044: error: dereferencing pointer to incomplete type
zaptel.c:2045: error: dereferencing pointer to incomplete type
zaptel.c:2046: error: dereferencing pointer to incomplete type
zaptel.c:2047: error: dereferencing pointer to incomplete type
zaptel.c:2048: error: dereferencing pointer to incomplete type
zaptel.c:2054: error: dereferencing pointer to incomplete type
zaptel.c:2056: error: dereferencing pointer to incomplete type
zaptel.c:2056: error: dereferencing pointer to incomplete type
zaptel.c:2057: error: dereferencing pointer to incomplete type
zaptel.c:2058: error: dereferencing pointer to incomplete type
zaptel.c:2059: error: dereferencing pointer to incomplete type
zaptel.c:2060: error: dereferencing pointer to incomplete type
zaptel.c:2060: error: dereferencing pointer to incomplete type
zaptel.c:2061: error: dereferencing pointer to incomplete type
zaptel.c:2063: error: dereferencing pointer to incomplete type
zaptel.c:2064: error: dereferencing pointer to incomplete type
zaptel.c:2064: error: dereferencing pointer to incomplete type
zaptel.c:2064: error: dereferencing pointer to incomplete type
zaptel.c:2064: error: dereferencing pointer to incomplete type
zaptel.c:2064: error: dereferencing pointer to incomplete type
zaptel.c:2064: error: dereferencing pointer to incomplete type
zaptel.c:2064: error: dereferencing pointer to incomplete type
zaptel.c:2064: error: dereferencing pointer to incomplete type
zaptel.c:2064: error: dereferencing pointer to incomplete type
zaptel.c:2064: error: dereferencing pointer to incomplete type
zaptel.c:2065: error: dereferencing pointer to incomplete type
zaptel.c:2065: error: dereferencing pointer to incomplete type
zaptel.c:2065: error: dereferencing pointer to incomplete type
zaptel.c:2065: error: dereferencing pointer to incomplete type
zaptel.c:2065: error: dereferencing pointer to incomplete type
zaptel.c:2065: error: dereferencing pointer to incomplete type
zaptel.c:2065: error: dereferencing pointer to incomplete type
zaptel.c:2065: error: dereferencing pointer to incomplete type
zaptel.c:2065: error: dereferencing pointer to incomplete type
zaptel.c:2065: error: dereferencing pointer to incomplete type
zaptel.c:2066: error: dereferencing pointer to incomplete type
zaptel.c:2066: error: dereferencing pointer to incomplete type
zaptel.c:2066: error: dereferencing pointer to incomplete type
zaptel.c:2066: error: dereferencing pointer to incomplete type
zaptel.c:2066: error: dereferencing pointer to incomplete type
zaptel.c:2066: error: dereferencing pointer to incomplete type
zaptel.c:2066: error: dereferencing pointer to incomplete type
zaptel.c:2066: error: dereferencing pointer to incomplete type
zaptel.c:2066: error: dereferencing pointer to incomplete type
zaptel.c:2066: error: dereferencing pointer to incomplete type
zaptel.c:2067: error: dereferencing pointer to incomplete type
zaptel.c:2068: error: dereferencing pointer to incomplete type
zaptel.c:2069: error: dereferencing pointer to incomplete type
zaptel.c:2070: error: dereferencing pointer to incomplete type
zaptel.c:2071: error: dereferencing pointer to incomplete type
zaptel.c:2073: error: dereferencing pointer to incomplete type
zaptel.c:2073: error: dereferencing pointer to incomplete type
zaptel.c:2074: error: dereferencing pointer to incomplete type
zaptel.c:2075: error: dereferencing pointer to incomplete type
zaptel.c:2076: error: dereferencing pointer to incomplete type
zaptel.c:2077: error: dereferencing pointer to incomplete type
zaptel.c:2078: error: dereferencing pointer to incomplete type
zaptel.c:2078: error: dereferencing pointer to incomplete type
zaptel.c:2083: error: dereferencing pointer to incomplete type
zaptel.c:2084: error: dereferencing pointer to incomplete type
zaptel.c:2086: error: dereferencing pointer to incomplete type
zaptel.c:2087: error: dereferencing pointer to incomplete type
zaptel.c:2089: error: dereferencing pointer to incomplete type
zaptel.c:2090: error: dereferencing pointer to incomplete type
zaptel.c:2092: error: dereferencing pointer to incomplete type
zaptel.c:2092: error: dereferencing pointer to incomplete type
zaptel.c:2092: error: dereferencing pointer to incomplete type
zaptel.c:2092: error: dereferencing pointer to incomplete type
zaptel.c:2092: error: dereferencing pointer to incomplete type
zaptel.c:2092: error: dereferencing pointer to incomplete type
zaptel.c:2092: error: dereferencing pointer to incomplete type
zaptel.c:2095: error: dereferencing pointer to incomplete type
zaptel.c:2095: error: dereferencing pointer to incomplete type
zaptel.c:2095: error: dereferencing pointer to incomplete type
zaptel.c:2095: error: dereferencing pointer to incomplete type
zaptel.c:2095: error: dereferencing pointer to incomplete type
zaptel.c:2095: error: dereferencing pointer to incomplete type
zaptel.c:2095: error: dereferencing pointer to incomplete type
zaptel.c:2095: error: dereferencing pointer to incomplete type
zaptel.c:2095: error: dereferencing pointer to incomplete type
zaptel.c:2095: error: dereferencing pointer to incomplete type
zaptel.c:2096: error: dereferencing pointer to incomplete type
zaptel.c:2096: error: dereferencing pointer to incomplete type
zaptel.c:2097: error: dereferencing pointer to incomplete type
zaptel.c:2099: error: dereferencing pointer to incomplete type
zaptel.c:2099: error: dereferencing pointer to incomplete type
zaptel.c:2100: error: dereferencing pointer to incomplete type
zaptel.c:2101: error: dereferencing pointer to incomplete type
zaptel.c: In function `zt_timing_open':
zaptel.c:2120: error: dereferencing pointer to incomplete type
zaptel.c: In function `zt_timer_release':
zaptel.c:2135: error: dereferencing pointer to incomplete type
zaptel.c: In function `zt_specchan_open':
zaptel.c:2169: error: dereferencing pointer to incomplete type
zaptel.c:2171: error: dereferencing pointer to incomplete type
zaptel.c:2173: error: dereferencing pointer to incomplete type
zaptel.c:2175: error: dereferencing pointer to incomplete type
zaptel.c:2177: error: dereferencing pointer to incomplete type
zaptel.c:2182: error: dereferencing pointer to incomplete type
zaptel.c:2183: error: dereferencing pointer to incomplete type
zaptel.c:2184: error: dereferencing pointer to incomplete type
zaptel.c:2184: error: dereferencing pointer to incomplete type
zaptel.c:2185: error: dereferencing pointer to incomplete type
zaptel.c:2187: error: dereferencing pointer to incomplete type
zaptel.c:2192: error: dereferencing pointer to incomplete type
zaptel.c: In function `zt_specchan_release':
zaptel.c:2206: error: dereferencing pointer to incomplete type
zaptel.c:2207: error: dereferencing pointer to incomplete type
zaptel.c:2209: error: dereferencing pointer to incomplete type
zaptel.c:2209: error: dereferencing pointer to incomplete type
zaptel.c:2210: error: dereferencing pointer to incomplete type
zaptel.c: In function `zt_alloc_pseudo':
zaptel.c:2226: error: invalid application of `sizeof' to an incomplete type
zaptel.c:2229: error: invalid application of `sizeof' to an incomplete type
zaptel.c:2229: error: invalid application of `sizeof' to an incomplete type
zaptel.c:2229: error: invalid application of `sizeof' to an incomplete type
zaptel.c:2229: error: invalid application of `sizeof' to an incomplete type
zaptel.c:2229: error: invalid application of `sizeof' to an incomplete type
zaptel.c:2229: error: invalid application of `sizeof' to an incomplete type
zaptel.c:2230: error: dereferencing pointer to incomplete type
zaptel.c:2231: error: dereferencing pointer to incomplete type
zaptel.c:2232: error: dereferencing pointer to incomplete type
zaptel.c:2238: error: dereferencing pointer to incomplete type
zaptel.c:2238: error: dereferencing pointer to incomplete type
zaptel.c: In function `zt_open':
zaptel.c:2256: error: dereferencing pointer to incomplete type
zaptel.c:2274: error: dereferencing pointer to incomplete type
zaptel.c:2275: error: dereferencing pointer to incomplete type
zaptel.c: At top level:
zaptel.c:2297: error: syntax error before "zt_read"
zaptel.c:2297: error: syntax error before "size_t"
zaptel.c:2298: warning: return type defaults to `int'
zaptel.c:2298: warning: function declaration isn't a prototype
zaptel.c: In function `zt_read':
zaptel.c:2299: error: dereferencing pointer to incomplete type
zaptel.c:2311: error: dereferencing pointer to incomplete type
zaptel.c:2314: error: `usrbuf' undeclared (first use in this function)
zaptel.c:2314: error: dereferencing pointer to incomplete type
zaptel.c:2318: error: dereferencing pointer to incomplete type
zaptel.c:2323: error: dereferencing pointer to incomplete type
zaptel.c:2325: error: invalid operands to binary <
zaptel.c: At top level:
zaptel.c:2331: error: syntax error before "zt_write"
zaptel.c:2331: error: syntax error before "size_t"
zaptel.c:2332: warning: return type defaults to `int'
zaptel.c:2332: warning: function declaration isn't a prototype
zaptel.c: In function `zt_write':
zaptel.c:2333: error: dereferencing pointer to incomplete type
zaptel.c:2338: error: invalid operands to binary <
zaptel.c:2343: error: dereferencing pointer to incomplete type
zaptel.c:2346: error: `usrbuf' undeclared (first use in this function)
zaptel.c:2346: error: dereferencing pointer to incomplete type
zaptel.c:2349: error: dereferencing pointer to incomplete type
zaptel.c:2354: error: dereferencing pointer to incomplete type
zaptel.c: In function `__do_dtmf':
zaptel.c:2523: error: dereferencing pointer to incomplete type
zaptel.c:2524: error: dereferencing pointer to incomplete type
zaptel.c:2526: error: dereferencing pointer to incomplete type
zaptel.c:2526: error: dereferencing pointer to incomplete type
zaptel.c:2526: error: dereferencing pointer to incomplete type
zaptel.c:2530: error: dereferencing pointer to incomplete type
zaptel.c:2531: error: dereferencing pointer to incomplete type
zaptel.c:2535: error: dereferencing pointer to incomplete type
zaptel.c:2536: error: dereferencing pointer to incomplete type
zaptel.c:2540: error: dereferencing pointer to incomplete type
zaptel.c:2541: error: dereferencing pointer to incomplete type
zaptel.c:2544: error: dereferencing pointer to incomplete type
zaptel.c:2546: error: dereferencing pointer to incomplete type
zaptel.c:2548: error: dereferencing pointer to incomplete type
zaptel.c:2550: error: dereferencing pointer to incomplete type
zaptel.c:2550: error: dereferencing pointer to incomplete type
zaptel.c:2552: error: dereferencing pointer to incomplete type
zaptel.c:2556: error: dereferencing pointer to incomplete type
zaptel.c:2556: error: dereferencing pointer to incomplete type
zaptel.c:2557: error: dereferencing pointer to incomplete type
zaptel.c:2559: error: dereferencing pointer to incomplete type
zaptel.c:2560: error: dereferencing pointer to incomplete type
zaptel.c:2560: error: dereferencing pointer to incomplete type
zaptel.c:2567: error: dereferencing pointer to incomplete type
zaptel.c: In function `zt_release':
zaptel.c:2573: error: dereferencing pointer to incomplete type
zaptel.c:2583: error: dereferencing pointer to incomplete type
zaptel.c:2587: error: dereferencing pointer to incomplete type
zaptel.c:2590: error: dereferencing pointer to incomplete type
zaptel.c:2592: error: dereferencing pointer to incomplete type
zaptel.c: In function `zt_alarm_notify':
zaptel.c:2636: error: invalid use of undefined type `struct zt_chan'
zaptel.c:2636: error: dereferencing pointer to incomplete type
zaptel.c: In function `zt_common_ioctl':
zaptel.c:2746: error: dereferencing pointer to incomplete type
zaptel.c:2748: error: dereferencing pointer to incomplete type
zaptel.c:2751: error: dereferencing pointer to incomplete type
zaptel.c:2754: error: dereferencing pointer to incomplete type
zaptel.c:2755: error: dereferencing pointer to incomplete type
zaptel.c:2758: error: dereferencing pointer to incomplete type
zaptel.c:2758: error: dereferencing pointer to incomplete type
zaptel.c:2758: error: dereferencing pointer to incomplete type
zaptel.c:2759: error: dereferencing pointer to incomplete type
zaptel.c:2760: error: dereferencing pointer to incomplete type
zaptel.c:2761: error: dereferencing pointer to incomplete type
zaptel.c:2767: error: dereferencing pointer to incomplete type
zaptel.c:2767: error: dereferencing pointer to incomplete type
zaptel.c:2767: error: dereferencing pointer to incomplete type
zaptel.c:2768: error: dereferencing pointer to incomplete type
zaptel.c:2769: error: dereferencing pointer to incomplete type
zaptel.c:2770: error: dereferencing pointer to incomplete type
zaptel.c:2775: error: dereferencing pointer to incomplete type
zaptel.c:2776: error: dereferencing pointer to incomplete type
zaptel.c:2777: error: dereferencing pointer to incomplete type
zaptel.c:2778: error: dereferencing pointer to incomplete type
zaptel.c:2779: error: dereferencing pointer to incomplete type
zaptel.c:2780: error: dereferencing pointer to incomplete type
zaptel.c:2781: error: dereferencing pointer to incomplete type
zaptel.c:2782: error: dereferencing pointer to incomplete type
zaptel.c:2783: error: dereferencing pointer to incomplete type
zaptel.c:2784: error: dereferencing pointer to incomplete type
zaptel.c:2785: error: dereferencing pointer to incomplete type
zaptel.c:2786: error: dereferencing pointer to incomplete type
zaptel.c:2787: error: dereferencing pointer to incomplete type
zaptel.c:2787: error: dereferencing pointer to incomplete type
zaptel.c:2789: error: dereferencing pointer to incomplete type
zaptel.c:2790: error: dereferencing pointer to incomplete type
zaptel.c:2792: error: dereferencing pointer to incomplete type
zaptel.c:2810: error: dereferencing pointer to incomplete type
zaptel.c:2811: error: dereferencing pointer to incomplete type
zaptel.c:2812: error: dereferencing pointer to incomplete type
zaptel.c:2813: error: dereferencing pointer to incomplete type
zaptel.c:2814: error: dereferencing pointer to incomplete type
zaptel.c:2816: error: dereferencing pointer to incomplete type
zaptel.c:2817: error: dereferencing pointer to incomplete type
zaptel.c:2817: error: dereferencing pointer to incomplete type
zaptel.c:2818: error: dereferencing pointer to incomplete type
zaptel.c:2819: error: dereferencing pointer to incomplete type
zaptel.c:2820: error: dereferencing pointer to incomplete type
zaptel.c:2821: error: dereferencing pointer to incomplete type
zaptel.c:2822: error: dereferencing pointer to incomplete type
zaptel.c:2823: error: dereferencing pointer to incomplete type
zaptel.c:2834: error: dereferencing pointer to incomplete type
zaptel.c:2837: error: dereferencing pointer to incomplete type
zaptel.c:2838: error: dereferencing pointer to incomplete type
zaptel.c:2851: error: dereferencing pointer to incomplete type
zaptel.c:2852: error: dereferencing pointer to incomplete type
zaptel.c:2853: error: dereferencing pointer to incomplete type
zaptel.c:2854: error: dereferencing pointer to incomplete type
zaptel.c:2855: error: dereferencing pointer to incomplete type
zaptel.c:2858: error: dereferencing pointer to incomplete type
zaptel.c:2859: error: dereferencing pointer to incomplete type
zaptel.c:2859: error: dereferencing pointer to incomplete type
zaptel.c:2864: error: dereferencing pointer to incomplete type
zaptel.c:2865: error: dereferencing pointer to incomplete type
zaptel.c:2867: error: dereferencing pointer to incomplete type
zaptel.c:2868: error: dereferencing pointer to incomplete type
zaptel.c:2871: error: dereferencing pointer to incomplete type
zaptel.c:2872: error: dereferencing pointer to incomplete type
zaptel.c:2873: error: dereferencing pointer to incomplete type
zaptel.c:2874: error: dereferencing pointer to incomplete type
zaptel.c:2875: error: dereferencing pointer to incomplete type
zaptel.c:2888: error: dereferencing pointer to incomplete type
zaptel.c:2909: error: invalid use of undefined type `struct zt_chan'
zaptel.c:2909: error: dereferencing pointer to incomplete type
zaptel.c: In function `recalc_slaves':
zaptel.c:2984: error: dereferencing pointer to incomplete type
zaptel.c:2992: error: dereferencing pointer to incomplete type
zaptel.c:2992: error: dereferencing pointer to incomplete type
zaptel.c:2993: error: dereferencing pointer to incomplete type
zaptel.c:2998: error: dereferencing pointer to incomplete type
zaptel.c:2999: error: dereferencing pointer to incomplete type
zaptel.c:3002: error: dereferencing pointer to incomplete type
zaptel.c: In function `zt_ctl_ioctl':
zaptel.c:3049: error: invalid use of undefined type `struct zt_chan'
zaptel.c:3049: error: dereferencing pointer to incomplete type
zaptel.c:3050: error: invalid use of undefined type `struct zt_chan'
zaptel.c:3050: error: dereferencing pointer to incomplete type
zaptel.c:3051: error: invalid use of undefined type `struct zt_chan'
zaptel.c:3051: error: dereferencing pointer to incomplete type
zaptel.c:3052: error: invalid use of undefined type `struct zt_chan'
zaptel.c:3052: error: dereferencing pointer to incomplete type
zaptel.c:3053: error: invalid use of undefined type `struct zt_chan'
zaptel.c:3053: error: dereferencing pointer to incomplete type
zaptel.c:3054: error: invalid use of undefined type `struct zt_chan'
zaptel.c:3054: error: dereferencing pointer to incomplete type
zaptel.c:3074: error: dereferencing pointer to incomplete type
zaptel.c:3085: error: dereferencing pointer to incomplete type
zaptel.c:3107: error: dereferencing pointer to incomplete type
zaptel.c:3112: error: dereferencing pointer to incomplete type
zaptel.c:3121: error: dereferencing pointer to incomplete type
zaptel.c:3122: error: dereferencing pointer to incomplete type
zaptel.c:3123: error: dereferencing pointer to incomplete type
zaptel.c:3125: error: dereferencing pointer to incomplete type
zaptel.c:3126: error: dereferencing pointer to incomplete type
zaptel.c:3129: error: dereferencing pointer to incomplete type
zaptel.c:3130: error: dereferencing pointer to incomplete type
zaptel.c:3131: error: dereferencing pointer to incomplete type
zaptel.c:3133: error: dereferencing pointer to incomplete type
zaptel.c:3136: error: dereferencing pointer to incomplete type
zaptel.c:3137: error: dereferencing pointer to incomplete type
zaptel.c:3140: error: dereferencing pointer to incomplete type
zaptel.c:3141: error: dereferencing pointer to incomplete type
zaptel.c:3145: error: dereferencing pointer to incomplete type
zaptel.c:3148: error: dereferencing pointer to incomplete type
zaptel.c:3152: error: dereferencing pointer to incomplete type
zaptel.c:3155: error: dereferencing pointer to incomplete type
zaptel.c:3159: error: dereferencing pointer to incomplete type
zaptel.c:3160: error: dereferencing pointer to incomplete type
zaptel.c:3161: error: dereferencing pointer to incomplete type
zaptel.c:3162: error: dereferencing pointer to incomplete type
zaptel.c:3164: error: dereferencing pointer to incomplete type
zaptel.c:3165: error: dereferencing pointer to incomplete type
zaptel.c:3165: error: dereferencing pointer to incomplete type
zaptel.c:3166: error: dereferencing pointer to incomplete type
zaptel.c:3167: error: dereferencing pointer to incomplete type
zaptel.c:3167: error: dereferencing pointer to incomplete type
zaptel.c:3168: error: dereferencing pointer to incomplete type
zaptel.c:3169: error: dereferencing pointer to incomplete type
zaptel.c:3172: error: dereferencing pointer to incomplete type
zaptel.c:3232: error: dereferencing pointer to incomplete type
zaptel.c:3234: error: dereferencing pointer to incomplete type
zaptel.c:3235: error: dereferencing pointer to incomplete type
zaptel.c:3238: error: dereferencing pointer to incomplete type
zaptel.c:3240: error: dereferencing pointer to incomplete type
zaptel.c:3243: error: dereferencing pointer to incomplete type
zaptel.c:3247: error: dereferencing pointer to incomplete type
zaptel.c:3248: error: dereferencing pointer to incomplete type
zaptel.c:3253: error: dereferencing pointer to incomplete type
zaptel.c:3259: error: dereferencing pointer to incomplete type
zaptel.c:3260: error: dereferencing pointer to incomplete type
zaptel.c:3261: error: dereferencing pointer to incomplete type
zaptel.c:3262: error: dereferencing pointer to incomplete type
zaptel.c:3263: error: dereferencing pointer to incomplete type
zaptel.c:3264: error: dereferencing pointer to incomplete type
zaptel.c:3265: error: dereferencing pointer to incomplete type
zaptel.c:3266: error: dereferencing pointer to incomplete type
zaptel.c:3267: error: dereferencing pointer to incomplete type
zaptel.c:3270: error: dereferencing pointer to incomplete type
zaptel.c:3271: error: dereferencing pointer to incomplete type
zaptel.c:3280: error: dereferencing pointer to incomplete type
zaptel.c: In function `zt_chanandpseudo_ioctl':
zaptel.c:3397: error: dereferencing pointer to incomplete type
zaptel.c:3398: error: dereferencing pointer to incomplete type
zaptel.c:3399: error: dereferencing pointer to incomplete type
zaptel.c:3409: error: dereferencing pointer to incomplete type
zaptel.c:3412: error: dereferencing pointer to incomplete type
zaptel.c:3413: error: dereferencing pointer to incomplete type
zaptel.c:3414: error: dereferencing pointer to incomplete type
zaptel.c:3415: error: dereferencing pointer to incomplete type
zaptel.c:3416: error: dereferencing pointer to incomplete type
zaptel.c:3419: error: dereferencing pointer to incomplete type
zaptel.c:3420: error: dereferencing pointer to incomplete type
zaptel.c:3424: error: dereferencing pointer to incomplete type
zaptel.c:3429: error: dereferencing pointer to incomplete type
zaptel.c:3429: error: dereferencing pointer to incomplete type
zaptel.c:3429: error: dereferencing pointer to incomplete type
zaptel.c:3430: error: dereferencing pointer to incomplete type
zaptel.c:3432: error: dereferencing pointer to incomplete type
zaptel.c:3439: error: dereferencing pointer to incomplete type
zaptel.c:3442: error: dereferencing pointer to incomplete type
zaptel.c:3443: error: dereferencing pointer to incomplete type
zaptel.c:3444: error: dereferencing pointer to incomplete type
zaptel.c:3445: error: dereferencing pointer to incomplete type
zaptel.c:3461: error: dereferencing pointer to incomplete type
zaptel.c:3462: error: dereferencing pointer to incomplete type
zaptel.c:3467: error: dereferencing pointer to incomplete type
zaptel.c:3467: error: dereferencing pointer to incomplete type
zaptel.c:3467: error: dereferencing pointer to incomplete type
zaptel.c:3467: error: dereferencing pointer to incomplete type
zaptel.c:3477: error: dereferencing pointer to incomplete type
zaptel.c:3482: error: dereferencing pointer to incomplete type
zaptel.c:3486: error: dereferencing pointer to incomplete type
zaptel.c:3487: error: dereferencing pointer to incomplete type
zaptel.c:3488: error: dereferencing pointer to incomplete type
zaptel.c:3490: error: dereferencing pointer to incomplete type
zaptel.c:3491: error: dereferencing pointer to incomplete type
zaptel.c:3493: error: dereferencing pointer to incomplete type
zaptel.c:3494: error: dereferencing pointer to incomplete type
zaptel.c:3499: error: dereferencing pointer to incomplete type
zaptel.c:3500: error: dereferencing pointer to incomplete type
zaptel.c:3501: error: dereferencing pointer to incomplete type
zaptel.c:3503: error: dereferencing pointer to incomplete type
zaptel.c:3504: error: dereferencing pointer to incomplete type
zaptel.c:3506: error: dereferencing pointer to incomplete type
zaptel.c:3507: error: dereferencing pointer to incomplete type
zaptel.c:3510: error: dereferencing pointer to incomplete type
zaptel.c:3511: error: dereferencing pointer to incomplete type
zaptel.c:3516: error: dereferencing pointer to incomplete type
zaptel.c:3516: error: dereferencing pointer to incomplete type
zaptel.c:3518: error: dereferencing pointer to incomplete type
zaptel.c:3523: error: dereferencing pointer to incomplete type
zaptel.c:3525: error: dereferencing pointer to incomplete type
zaptel.c:3526: error: dereferencing pointer to incomplete type
zaptel.c:3528: error: dereferencing pointer to incomplete type
zaptel.c:3533: error: dereferencing pointer to incomplete type
zaptel.c:3534: error: dereferencing pointer to incomplete type
zaptel.c:3539: error: dereferencing pointer to incomplete type
zaptel.c:3541: error: dereferencing pointer to incomplete type
zaptel.c:3544: error: dereferencing pointer to incomplete type
zaptel.c:3544: error: dereferencing pointer to incomplete type
zaptel.c:3548: error: dereferencing pointer to incomplete type
zaptel.c:3550: error: dereferencing pointer to incomplete type
zaptel.c:3554: error: dereferencing pointer to incomplete type
zaptel.c:3557: error: dereferencing pointer to incomplete type
zaptel.c:3558: error: dereferencing pointer to incomplete type
zaptel.c:3562: error: dereferencing pointer to incomplete type
zaptel.c:3565: error: dereferencing pointer to incomplete type
zaptel.c:3565: error: dereferencing pointer to incomplete type
zaptel.c:3568: error: dereferencing pointer to incomplete type
zaptel.c:3570: error: dereferencing pointer to incomplete type
zaptel.c:3576: error: dereferencing pointer to incomplete type
zaptel.c:3580: error: dereferencing pointer to incomplete type
zaptel.c:3585: error: dereferencing pointer to incomplete type
zaptel.c:3587: error: dereferencing pointer to incomplete type
zaptel.c:3587: error: dereferencing pointer to incomplete type
zaptel.c:3589: error: dereferencing pointer to incomplete type
zaptel.c:3589: error: dereferencing pointer to incomplete type
zaptel.c:3592: error: dereferencing pointer to incomplete type
zaptel.c:3593: error: dereferencing pointer to incomplete type
zaptel.c:3595: error: dereferencing pointer to incomplete type
zaptel.c:3600: error: dereferencing pointer to incomplete type
zaptel.c:3602: error: dereferencing pointer to incomplete type
zaptel.c:3606: error: dereferencing pointer to incomplete type
zaptel.c:3607: error: dereferencing pointer to incomplete type
zaptel.c:3613: error: dereferencing pointer to incomplete type
zaptel.c:3615: error: dereferencing pointer to incomplete type
zaptel.c:3618: error: dereferencing pointer to incomplete type
zaptel.c:3619: error: dereferencing pointer to incomplete type
zaptel.c:3620: error: dereferencing pointer to incomplete type
zaptel.c:3623: error: dereferencing pointer to incomplete type
zaptel.c:3628: error: dereferencing pointer to incomplete type
zaptel.c:3630: error: dereferencing pointer to incomplete type
zaptel.c:3636: error: dereferencing pointer to incomplete type
zaptel.c:3639: error: dereferencing pointer to incomplete type
zaptel.c:3641: error: dereferencing pointer to incomplete type
zaptel.c:3642: error: dereferencing pointer to incomplete type
zaptel.c:3649: error: dereferencing pointer to incomplete type
zaptel.c:3652: error: dereferencing pointer to incomplete type
zaptel.c:3667: error: dereferencing pointer to incomplete type
zaptel.c:3672: error: dereferencing pointer to incomplete type
zaptel.c:3677: error: dereferencing pointer to incomplete type
zaptel.c:3678: error: dereferencing pointer to incomplete type
zaptel.c:3678: error: dereferencing pointer to incomplete type
zaptel.c:3678: error: dereferencing pointer to incomplete type
zaptel.c:3678: error: dereferencing pointer to incomplete type
zaptel.c:3679: error: dereferencing pointer to incomplete type
zaptel.c:3679: error: dereferencing pointer to incomplete type
zaptel.c:3679: error: dereferencing pointer to incomplete type
zaptel.c:3679: error: dereferencing pointer to incomplete type
zaptel.c:3680: error: dereferencing pointer to incomplete type
zaptel.c:3680: error: dereferencing pointer to incomplete type
zaptel.c:3680: error: dereferencing pointer to incomplete type
zaptel.c:3680: error: dereferencing pointer to incomplete type
zaptel.c:3682: error: dereferencing pointer to incomplete type
zaptel.c:3683: error: dereferencing pointer to incomplete type
zaptel.c:3684: error: dereferencing pointer to incomplete type
zaptel.c:3685: error: dereferencing pointer to incomplete type
zaptel.c:3688: error: dereferencing pointer to incomplete type
zaptel.c:3688: error: dereferencing pointer to incomplete type
zaptel.c:3689: error: dereferencing pointer to incomplete type
zaptel.c:3690: error: dereferencing pointer to incomplete type
zaptel.c:3690: error: dereferencing pointer to incomplete type
zaptel.c:3691: error: dereferencing pointer to incomplete type
zaptel.c:3693: error: dereferencing pointer to incomplete type
zaptel.c:3701: error: dereferencing pointer to incomplete type
zaptel.c:3703: error: dereferencing pointer to incomplete type
zaptel.c:3708: error: dereferencing pointer to incomplete type
zaptel.c:3716: error: dereferencing pointer to incomplete type
zaptel.c:3723: error: dereferencing pointer to incomplete type
zaptel.c:3774: error: dereferencing pointer to incomplete type
zaptel.c:3778: error: dereferencing pointer to incomplete type
zaptel.c:3789: error: dereferencing pointer to incomplete type
zaptel.c:3793: error: dereferencing pointer to incomplete type
zaptel.c:3822: error: dereferencing pointer to incomplete type
zaptel.c:3826: error: dereferencing pointer to incomplete type
zaptel.c:3828: error: dereferencing pointer to incomplete type
zaptel.c:3835: error: dereferencing pointer to incomplete type
zaptel.c:3835: error: dereferencing pointer to incomplete type
zaptel.c:3835: error: dereferencing pointer to incomplete type
zaptel.c:3835: error: dereferencing pointer to incomplete type
zaptel.c:3835: error: dereferencing pointer to incomplete type
zaptel.c:3836: error: dereferencing pointer to incomplete type
zaptel.c:3839: error: dereferencing pointer to incomplete type
zaptel.c:3840: error: dereferencing pointer to incomplete type
zaptel.c:3841: error: dereferencing pointer to incomplete type
zaptel.c:3847: error: dereferencing pointer to incomplete type
zaptel.c:3848: error: dereferencing pointer to incomplete type
zaptel.c:3849: error: dereferencing pointer to incomplete type
zaptel.c:3849: error: dereferencing pointer to incomplete type
zaptel.c:3849: error: dereferencing pointer to incomplete type
zaptel.c:3849: error: dereferencing pointer to incomplete type
zaptel.c:3849: error: dereferencing pointer to incomplete type
zaptel.c:3849: error: dereferencing pointer to incomplete type
zaptel.c:3849: error: dereferencing pointer to incomplete type
zaptel.c:3852: error: dereferencing pointer to incomplete type
zaptel.c:3853: error: dereferencing pointer to incomplete type
zaptel.c:3854: error: dereferencing pointer to incomplete type
zaptel.c:3859: error: dereferencing pointer to incomplete type
zaptel.c:3859: error: dereferencing pointer to incomplete type
zaptel.c:3859: error: dereferencing pointer to incomplete type
zaptel.c:3859: error: dereferencing pointer to incomplete type
zaptel.c:3859: error: dereferencing pointer to incomplete type
zaptel.c:3859: error: dereferencing pointer to incomplete type
zaptel.c:3859: error: dereferencing pointer to incomplete type
zaptel.c:3859: error: dereferencing pointer to incomplete type
zaptel.c:3859: error: dereferencing pointer to incomplete type
zaptel.c:3859: error: dereferencing pointer to incomplete type
zaptel.c:3860: error: dereferencing pointer to incomplete type
zaptel.c:3860: error: dereferencing pointer to incomplete type
zaptel.c:3861: error: dereferencing pointer to incomplete type
zaptel.c:3869: error: dereferencing pointer to incomplete type
zaptel.c:3870: error: dereferencing pointer to incomplete type
zaptel.c:3871: error: dereferencing pointer to incomplete type
zaptel.c: In function `zt_chan_ioctl':
zaptel.c:3921: error: dereferencing pointer to incomplete type
zaptel.c:3923: error: dereferencing pointer to incomplete type
zaptel.c:3925: error: dereferencing pointer to incomplete type
zaptel.c:3927: error: dereferencing pointer to incomplete type
zaptel.c:3930: error: dereferencing pointer to incomplete type
zaptel.c:3931: error: dereferencing pointer to incomplete type
zaptel.c:3935: error: dereferencing pointer to incomplete type
zaptel.c:3940: error: dereferencing pointer to incomplete type
zaptel.c:3943: error: dereferencing pointer to incomplete type
zaptel.c:3944: error: dereferencing pointer to incomplete type
zaptel.c:3945: error: dereferencing pointer to incomplete type
zaptel.c:3946: error: dereferencing pointer to incomplete type
zaptel.c:3951: error: dereferencing pointer to incomplete type
zaptel.c:3952: error: dereferencing pointer to incomplete type
zaptel.c:3954: error: dereferencing pointer to incomplete type
zaptel.c:3956: error: dereferencing pointer to incomplete type
zaptel.c:3957: error: dereferencing pointer to incomplete type
zaptel.c:3958: error: dereferencing pointer to incomplete type
zaptel.c:3958: error: dereferencing pointer to incomplete type
zaptel.c:3959: error: dereferencing pointer to incomplete type
zaptel.c:3960: error: dereferencing pointer to incomplete type
zaptel.c:3961: error: dereferencing pointer to incomplete type
zaptel.c:3962: error: dereferencing pointer to incomplete type
zaptel.c:3962: error: dereferencing pointer to incomplete type
zaptel.c:3962: error: dereferencing pointer to incomplete type
zaptel.c:3962: error: dereferencing pointer to incomplete type
zaptel.c:3962: error: dereferencing pointer to incomplete type
zaptel.c:3962: error: dereferencing pointer to incomplete type
zaptel.c:3962: error: dereferencing pointer to incomplete type
zaptel.c:3962: error: dereferencing pointer to incomplete type
zaptel.c:3962: error: dereferencing pointer to incomplete type
zaptel.c:3962: error: dereferencing pointer to incomplete type
zaptel.c:3963: error: dereferencing pointer to incomplete type
zaptel.c:3963: error: dereferencing pointer to incomplete type
zaptel.c:3963: error: dereferencing pointer to incomplete type
zaptel.c:3963: error: dereferencing pointer to incomplete type
zaptel.c:3963: error: dereferencing pointer to incomplete type
zaptel.c:3963: error: dereferencing pointer to incomplete type
zaptel.c:3963: error: dereferencing pointer to incomplete type
zaptel.c:3963: error: dereferencing pointer to incomplete type
zaptel.c:3963: error: dereferencing pointer to incomplete type
zaptel.c:3963: error: dereferencing pointer to incomplete type
zaptel.c:3964: error: dereferencing pointer to incomplete type
zaptel.c:3964: error: dereferencing pointer to incomplete type
zaptel.c:3964: error: dereferencing pointer to incomplete type
zaptel.c:3964: error: dereferencing pointer to incomplete type
zaptel.c:3964: error: dereferencing pointer to incomplete type
zaptel.c:3964: error: dereferencing pointer to incomplete type
zaptel.c:3964: error: dereferencing pointer to incomplete type
zaptel.c:3964: error: dereferencing pointer to incomplete type
zaptel.c:3964: error: dereferencing pointer to incomplete type
zaptel.c:3964: error: dereferencing pointer to incomplete type
zaptel.c:3965: error: dereferencing pointer to incomplete type
zaptel.c:3966: error: dereferencing pointer to incomplete type
zaptel.c:3969: error: dereferencing pointer to incomplete type
zaptel.c:3969: error: dereferencing pointer to incomplete type
zaptel.c:3970: error: dereferencing pointer to incomplete type
zaptel.c:3974: error: dereferencing pointer to incomplete type
zaptel.c:3975: error: dereferencing pointer to incomplete type
zaptel.c:3976: error: dereferencing pointer to incomplete type
zaptel.c:3978: error: dereferencing pointer to incomplete type
zaptel.c:3978: error: dereferencing pointer to incomplete type
zaptel.c:3979: error: dereferencing pointer to incomplete type
zaptel.c:3980: error: dereferencing pointer to incomplete type
zaptel.c:4055: error: dereferencing pointer to incomplete type
zaptel.c:4057: error: dereferencing pointer to incomplete type
zaptel.c:4059: error: dereferencing pointer to incomplete type
zaptel.c:4060: error: dereferencing pointer to incomplete type
zaptel.c:4061: error: dereferencing pointer to incomplete type
zaptel.c:4065: error: dereferencing pointer to incomplete type
zaptel.c:4067: error: dereferencing pointer to incomplete type
zaptel.c:4069: error: dereferencing pointer to incomplete type
zaptel.c:4070: error: dereferencing pointer to incomplete type
zaptel.c:4071: error: dereferencing pointer to incomplete type
zaptel.c:4075: error: dereferencing pointer to incomplete type
zaptel.c:4079: error: dereferencing pointer to incomplete type
zaptel.c:4081: error: dereferencing pointer to incomplete type
zaptel.c:4082: error: dereferencing pointer to incomplete type
zaptel.c:4084: error: dereferencing pointer to incomplete type
zaptel.c:4084: error: dereferencing pointer to incomplete type
zaptel.c:4085: error: dereferencing pointer to incomplete type
zaptel.c:4098: error: dereferencing pointer to incomplete type
zaptel.c:4102: error: dereferencing pointer to incomplete type
zaptel.c:4103: error: dereferencing pointer to incomplete type
zaptel.c:4104: error: dereferencing pointer to incomplete type
zaptel.c:4105: error: dereferencing pointer to incomplete type
zaptel.c:4106: error: dereferencing pointer to incomplete type
zaptel.c:4107: error: dereferencing pointer to incomplete type
zaptel.c:4108: error: dereferencing pointer to incomplete type
zaptel.c:4109: error: dereferencing pointer to incomplete type
zaptel.c:4111: error: dereferencing pointer to incomplete type
zaptel.c:4115: error: dereferencing pointer to incomplete type
zaptel.c:4116: error: dereferencing pointer to incomplete type
zaptel.c:4117: error: dereferencing pointer to incomplete type
zaptel.c:4118: error: dereferencing pointer to incomplete type
zaptel.c:4119: error: dereferencing pointer to incomplete type
zaptel.c:4120: error: dereferencing pointer to incomplete type
zaptel.c:4121: error: dereferencing pointer to incomplete type
zaptel.c:4123: error: dereferencing pointer to incomplete type
zaptel.c:4123: error: dereferencing pointer to incomplete type
zaptel.c:4124: error: dereferencing pointer to incomplete type
zaptel.c:4125: error: dereferencing pointer to incomplete type
zaptel.c:4135: error: dereferencing pointer to incomplete type
zaptel.c:4137: error: dereferencing pointer to incomplete type
zaptel.c:4138: error: dereferencing pointer to incomplete type
zaptel.c:4143: error: dereferencing pointer to incomplete type
zaptel.c:4150: error: dereferencing pointer to incomplete type
zaptel.c:4150: error: dereferencing pointer to incomplete type
zaptel.c:4150: error: dereferencing pointer to incomplete type
zaptel.c:4150: error: dereferencing pointer to incomplete type
zaptel.c:4155: error: dereferencing pointer to incomplete type
zaptel.c:4157: error: dereferencing pointer to incomplete type
zaptel.c:4160: error: dereferencing pointer to incomplete type
zaptel.c:4161: error: dereferencing pointer to incomplete type
zaptel.c:4163: error: dereferencing pointer to incomplete type
zaptel.c:4164: error: dereferencing pointer to incomplete type
zaptel.c:4165: error: dereferencing pointer to incomplete type
zaptel.c:4166: error: dereferencing pointer to incomplete type
zaptel.c:4167: error: dereferencing pointer to incomplete type
zaptel.c:4168: error: dereferencing pointer to incomplete type
zaptel.c:4169: error: dereferencing pointer to incomplete type
zaptel.c:4172: error: dereferencing pointer to incomplete type
zaptel.c:4174: error: dereferencing pointer to incomplete type
zaptel.c:4177: error: dereferencing pointer to incomplete type
zaptel.c:4178: error: dereferencing pointer to incomplete type
zaptel.c:4179: error: dereferencing pointer to incomplete type
zaptel.c:4180: error: dereferencing pointer to incomplete type
zaptel.c:4183: error: dereferencing pointer to incomplete type
zaptel.c:4184: error: dereferencing pointer to incomplete type
zaptel.c:4188: error: dereferencing pointer to incomplete type
zaptel.c:4189: error: dereferencing pointer to incomplete type
zaptel.c:4190: error: dereferencing pointer to incomplete type
zaptel.c:4193: error: dereferencing pointer to incomplete type
zaptel.c:4195: error: dereferencing pointer to incomplete type
zaptel.c:4196: error: dereferencing pointer to incomplete type
zaptel.c:4199: error: dereferencing pointer to incomplete type
zaptel.c:4200: error: dereferencing pointer to incomplete type
zaptel.c:4201: error: dereferencing pointer to incomplete type
zaptel.c:4210: error: dereferencing pointer to incomplete type
zaptel.c:4211: error: dereferencing pointer to incomplete type
zaptel.c:4212: error: dereferencing pointer to incomplete type
zaptel.c:4215: error: dereferencing pointer to incomplete type
zaptel.c:4216: error: dereferencing pointer to incomplete type
zaptel.c:4217: error: dereferencing pointer to incomplete type
zaptel.c:4219: error: dereferencing pointer to incomplete type
zaptel.c:4223: error: dereferencing pointer to incomplete type
zaptel.c:4224: error: dereferencing pointer to incomplete type
zaptel.c:4225: error: dereferencing pointer to incomplete type
zaptel.c:4228: error: dereferencing pointer to incomplete type
zaptel.c:4229: error: dereferencing pointer to incomplete type
zaptel.c:4230: error: dereferencing pointer to incomplete type
zaptel.c:4232: error: dereferencing pointer to incomplete type
zaptel.c:4236: error: dereferencing pointer to incomplete type
zaptel.c:4238: error: dereferencing pointer to incomplete type
zaptel.c:4243: error: dereferencing pointer to incomplete type
zaptel.c:4244: error: dereferencing pointer to incomplete type
zaptel.c:4245: error: dereferencing pointer to incomplete type
zaptel.c:4246: error: dereferencing pointer to incomplete type
zaptel.c: In function `zt_prechan_ioctl':
zaptel.c:4273: error: dereferencing pointer to incomplete type
zaptel.c:4291: error: dereferencing pointer to incomplete type
zaptel.c: In function `zt_ioctl':
zaptel.c:4304: error: dereferencing pointer to incomplete type
zaptel.c:4311: error: dereferencing pointer to incomplete type
zaptel.c:4318: error: dereferencing pointer to incomplete type
zaptel.c:4320: error: dereferencing pointer to incomplete type
zaptel.c:4325: error: dereferencing pointer to incomplete type
zaptel.c:4330: error: dereferencing pointer to incomplete type
zaptel.c: In function `zt_register':
zaptel.c:4373: error: invalid use of undefined type `struct zt_chan'
zaptel.c:4373: error: dereferencing pointer to incomplete type
zaptel.c:4374: error: invalid use of undefined type `struct zt_chan'
zaptel.c:4374: error: dereferencing pointer to incomplete type
zaptel.c: In function `zt_unregister':
zaptel.c:4456: error: invalid use of undefined type `struct zt_chan'
zaptel.c:4456: error: dereferencing pointer to incomplete type
zaptel.c: At top level:
zaptel.c:4580: error: syntax error before "alaw"
zaptel.c:4581: warning: function declaration isn't a prototype
zaptel.c: In function `alaw2linear':
zaptel.c:4585: error: `alaw' undeclared (first use in this function)
zaptel.c: In function `__zt_process_getaudio_chunk':
zaptel.c:4630: error: dereferencing pointer to incomplete type
zaptel.c:4637: error: dereferencing pointer to incomplete type
zaptel.c:4639: error: dereferencing pointer to incomplete type
zaptel.c:4642: error: dereferencing pointer to incomplete type
zaptel.c:4643: error: dereferencing pointer to incomplete type
zaptel.c:4644: error: dereferencing pointer to incomplete type
zaptel.c:4645: error: dereferencing pointer to incomplete type
zaptel.c:4646: error: dereferencing pointer to incomplete type
zaptel.c:4647: error: dereferencing pointer to incomplete type
zaptel.c:4648: error: dereferencing pointer to incomplete type
zaptel.c:4649: error: dereferencing pointer to incomplete type
zaptel.c:4655: error: dereferencing pointer to incomplete type
zaptel.c:4655: error: dereferencing pointer to incomplete type
zaptel.c:4655: error: dereferencing pointer to incomplete type
zaptel.c:4657: error: dereferencing pointer to incomplete type
zaptel.c:4663: error: dereferencing pointer to incomplete type
zaptel.c:4665: error: dereferencing pointer to incomplete type
zaptel.c:4666: error: dereferencing pointer to incomplete type
zaptel.c:4668: error: dereferencing pointer to incomplete type
zaptel.c:4671: error: dereferencing pointer to incomplete type
zaptel.c:4675: error: dereferencing pointer to incomplete type
zaptel.c:4677: error: dereferencing pointer to incomplete type
zaptel.c:4678: error: dereferencing pointer to incomplete type
zaptel.c:4680: error: dereferencing pointer to incomplete type
zaptel.c:4684: error: dereferencing pointer to incomplete type
zaptel.c:4688: error: dereferencing pointer to incomplete type
zaptel.c:4689: error: dereferencing pointer to incomplete type
zaptel.c:4690: error: dereferencing pointer to incomplete type
zaptel.c:4692: error: dereferencing pointer to incomplete type
zaptel.c:4700: error: dereferencing pointer to incomplete type
zaptel.c:4704: error: dereferencing pointer to incomplete type
zaptel.c:4706: error: dereferencing pointer to incomplete type
zaptel.c:4706: error: dereferencing pointer to incomplete type
zaptel.c:4706: error: dereferencing pointer to incomplete type
zaptel.c:4706: error: dereferencing pointer to incomplete type
zaptel.c:4707: error: dereferencing pointer to incomplete type
zaptel.c:4707: error: dereferencing pointer to incomplete type
zaptel.c:4709: error: dereferencing pointer to incomplete type
zaptel.c:4709: error: dereferencing pointer to incomplete type
zaptel.c:4711: error: dereferencing pointer to incomplete type
zaptel.c:4711: error: dereferencing pointer to incomplete type
zaptel.c:4713: error: dereferencing pointer to incomplete type
zaptel.c:4713: error: dereferencing pointer to incomplete type
zaptel.c:4713: error: dereferencing pointer to incomplete type
zaptel.c:4713: error: dereferencing pointer to incomplete type
zaptel.c:4714: error: dereferencing pointer to incomplete type
zaptel.c:4714: error: dereferencing pointer to incomplete type
zaptel.c:4714: error: dereferencing pointer to incomplete type
zaptel.c:4714: error: dereferencing pointer to incomplete type
zaptel.c:4717: error: dereferencing pointer to incomplete type
zaptel.c:4721: error: dereferencing pointer to incomplete type
zaptel.c:4724: error: dereferencing pointer to incomplete type
zaptel.c:4728: error: dereferencing pointer to incomplete type
zaptel.c:4730: error: dereferencing pointer to incomplete type
zaptel.c:4730: error: dereferencing pointer to incomplete type
zaptel.c:4731: error: dereferencing pointer to incomplete type
zaptel.c:4731: error: dereferencing pointer to incomplete type
zaptel.c:4733: error: dereferencing pointer to incomplete type
zaptel.c:4733: error: dereferencing pointer to incomplete type
zaptel.c:4734: error: dereferencing pointer to incomplete type
zaptel.c:4734: error: dereferencing pointer to incomplete type
zaptel.c:4734: error: dereferencing pointer to incomplete type
zaptel.c:4734: error: dereferencing pointer to incomplete type
zaptel.c:4735: error: dereferencing pointer to incomplete type
zaptel.c:4735: error: dereferencing pointer to incomplete type
zaptel.c:4736: error: dereferencing pointer to incomplete type
zaptel.c:4742: error: dereferencing pointer to incomplete type
zaptel.c:4744: error: dereferencing pointer to incomplete type
zaptel.c:4746: error: dereferencing pointer to incomplete type
zaptel.c:4749: error: dereferencing pointer to incomplete type
zaptel.c:4754: error: dereferencing pointer to incomplete type
zaptel.c:4758: error: dereferencing pointer to incomplete type
zaptel.c:4760: error: dereferencing pointer to incomplete type
zaptel.c:4762: error: dereferencing pointer to incomplete type
zaptel.c:4765: error: dereferencing pointer to incomplete type
zaptel.c:4769: error: dereferencing pointer to incomplete type
zaptel.c:4771: error: dereferencing pointer to incomplete type
zaptel.c:4772: error: dereferencing pointer to incomplete type
zaptel.c:4774: error: dereferencing pointer to incomplete type
zaptel.c:4774: error: dereferencing pointer to incomplete type
zaptel.c:4776: error: dereferencing pointer to incomplete type
zaptel.c:4776: error: dereferencing pointer to incomplete type
zaptel.c:4779: error: dereferencing pointer to incomplete type
zaptel.c:4781: error: dereferencing pointer to incomplete type
zaptel.c:4781: error: dereferencing pointer to incomplete type
zaptel.c:4783: error: dereferencing pointer to incomplete type
zaptel.c:4783: error: dereferencing pointer to incomplete type
zaptel.c:4787: error: dereferencing pointer to incomplete type
zaptel.c:4791: error: dereferencing pointer to incomplete type
zaptel.c:4791: error: dereferencing pointer to incomplete type
zaptel.c:4792: error: dereferencing pointer to incomplete type
zaptel.c:4794: error: dereferencing pointer to incomplete type
zaptel.c:4796: error: dereferencing pointer to incomplete type
zaptel.c:4797: error: dereferencing pointer to incomplete type
zaptel.c:4801: error: dereferencing pointer to incomplete type
zaptel.c:4801: error: dereferencing pointer to incomplete type
zaptel.c:4801: error: dereferencing pointer to incomplete type
zaptel.c:4801: error: dereferencing pointer to incomplete type
zaptel.c:4803: error: dereferencing pointer to incomplete type
zaptel.c:4803: error: dereferencing pointer to incomplete type
zaptel.c:4805: error: dereferencing pointer to incomplete type
zaptel.c:4805: error: dereferencing pointer to incomplete type
zaptel.c:4807: error: dereferencing pointer to incomplete type
zaptel.c:4807: error: dereferencing pointer to incomplete type
zaptel.c:4807: error: dereferencing pointer to incomplete type
zaptel.c:4812: error: dereferencing pointer to incomplete type
zaptel.c:4817: error: dereferencing pointer to incomplete type
zaptel.c: In function `__zt_getbuf_chunk':
zaptel.c:4824: error: dereferencing pointer to incomplete type
zaptel.c:4839: error: dereferencing pointer to incomplete type
zaptel.c:4839: error: dereferencing pointer to incomplete type
zaptel.c:4840: error: dereferencing pointer to incomplete type
zaptel.c:4840: error: dereferencing pointer to incomplete type
zaptel.c:4841: error: dereferencing pointer to incomplete type
zaptel.c:4841: error: dereferencing pointer to incomplete type
zaptel.c:4841: error: dereferencing pointer to incomplete type
zaptel.c:4841: error: dereferencing pointer to incomplete type
zaptel.c:4844: error: dereferencing pointer to incomplete type
zaptel.c:4848: error: dereferencing pointer to incomplete type
zaptel.c:4850: error: dereferencing pointer to incomplete type
zaptel.c:4850: error: dereferencing pointer to incomplete type
zaptel.c:4850: error: dereferencing pointer to incomplete type
zaptel.c:4851: error: dereferencing pointer to incomplete type
zaptel.c:4855: error: dereferencing pointer to incomplete type
zaptel.c:4855: error: dereferencing pointer to incomplete type
zaptel.c:4855: error: dereferencing pointer to incomplete type
zaptel.c:4855: error: dereferencing pointer to incomplete type
zaptel.c:4856: error: dereferencing pointer to incomplete type
zaptel.c:4856: error: dereferencing pointer to incomplete type
zaptel.c:4861: error: dereferencing pointer to incomplete type
zaptel.c:4861: error: dereferencing pointer to incomplete type
zaptel.c:4861: error: dereferencing pointer to incomplete type
zaptel.c:4861: error: dereferencing pointer to incomplete type
zaptel.c:4863: error: dereferencing pointer to incomplete type
zaptel.c:4865: error: dereferencing pointer to incomplete type
zaptel.c:4866: error: dereferencing pointer to incomplete type
zaptel.c:4867: error: dereferencing pointer to incomplete type
zaptel.c:4867: error: dereferencing pointer to incomplete type
zaptel.c:4867: error: dereferencing pointer to incomplete type
zaptel.c:4868: error: dereferencing pointer to incomplete type
zaptel.c:4868: error: dereferencing pointer to incomplete type
zaptel.c:4872: error: dereferencing pointer to incomplete type
zaptel.c:4873: error: dereferencing pointer to incomplete type
zaptel.c:4874: error: dereferencing pointer to incomplete type
zaptel.c:4876: error: dereferencing pointer to incomplete type
zaptel.c:4877: error: dereferencing pointer to incomplete type
zaptel.c:4879: error: dereferencing pointer to incomplete type
zaptel.c:4882: error: dereferencing pointer to incomplete type
zaptel.c:4894: error: dereferencing pointer to incomplete type
zaptel.c:4895: error: dereferencing pointer to incomplete type
zaptel.c:4896: error: dereferencing pointer to incomplete type
zaptel.c:4897: error: dereferencing pointer to incomplete type
zaptel.c:4898: error: dereferencing pointer to incomplete type
zaptel.c:4901: error: dereferencing pointer to incomplete type
zaptel.c:4902: error: dereferencing pointer to incomplete type
zaptel.c:4914: error: dereferencing pointer to incomplete type
zaptel.c:4914: error: dereferencing pointer to incomplete type
zaptel.c:4915: error: dereferencing pointer to incomplete type
zaptel.c:4915: error: dereferencing pointer to incomplete type
zaptel.c:4920: error: dereferencing pointer to incomplete type
zaptel.c:4920: error: dereferencing pointer to incomplete type
zaptel.c:4921: error: dereferencing pointer to incomplete type
zaptel.c:4923: error: dereferencing pointer to incomplete type
zaptel.c:4925: error: dereferencing pointer to incomplete type
zaptel.c:4925: error: dereferencing pointer to incomplete type
zaptel.c:4928: error: dereferencing pointer to incomplete type
zaptel.c:4929: error: dereferencing pointer to incomplete type
zaptel.c:4930: error: dereferencing pointer to incomplete type
zaptel.c:4930: error: dereferencing pointer to incomplete type
zaptel.c:4931: error: dereferencing pointer to incomplete type
zaptel.c:4933: error: dereferencing pointer to incomplete type
zaptel.c:4936: error: dereferencing pointer to incomplete type
zaptel.c:4937: error: dereferencing pointer to incomplete type
zaptel.c:4937: error: dereferencing pointer to incomplete type
zaptel.c:4940: error: dereferencing pointer to incomplete type
zaptel.c:4943: error: dereferencing pointer to incomplete type
zaptel.c:4944: error: dereferencing pointer to incomplete type
zaptel.c:4945: error: dereferencing pointer to incomplete type
zaptel.c:4948: error: dereferencing pointer to incomplete type
zaptel.c:4954: error: dereferencing pointer to incomplete type
zaptel.c:4954: error: dereferencing pointer to incomplete type
zaptel.c:4954: error: dereferencing pointer to incomplete type
zaptel.c:4954: error: dereferencing pointer to incomplete type
zaptel.c:4954: error: dereferencing pointer to incomplete type
zaptel.c: In function `rbs_itimer_expire':
zaptel.c:4965: error: dereferencing pointer to incomplete type
zaptel.c:4971: error: dereferencing pointer to incomplete type
zaptel.c: In function `__rbs_otimer_expire':
zaptel.c:4994: error: dereferencing pointer to incomplete type
zaptel.c:4996: error: dereferencing pointer to incomplete type
zaptel.c:4999: error: dereferencing pointer to incomplete type
zaptel.c:5000: error: dereferencing pointer to incomplete type
zaptel.c:5001: error: dereferencing pointer to incomplete type
zaptel.c:5001: error: dereferencing pointer to incomplete type
zaptel.c:5002: error: dereferencing pointer to incomplete type
zaptel.c:5002: error: dereferencing pointer to incomplete type
zaptel.c:5005: error: dereferencing pointer to incomplete type
zaptel.c:5005: error: dereferencing pointer to incomplete type
zaptel.c:5006: error: dereferencing pointer to incomplete type
zaptel.c:5006: error: dereferencing pointer to incomplete type
zaptel.c:5015: error: dereferencing pointer to incomplete type
zaptel.c:5016: error: dereferencing pointer to incomplete type
zaptel.c:5017: error: dereferencing pointer to incomplete type
zaptel.c:5018: error: dereferencing pointer to incomplete type
zaptel.c:5018: error: dereferencing pointer to incomplete type
zaptel.c:5021: error: dereferencing pointer to incomplete type
zaptel.c:5022: error: dereferencing pointer to incomplete type
zaptel.c:5022: error: dereferencing pointer to incomplete type
zaptel.c:5032: error: dereferencing pointer to incomplete type
zaptel.c:5037: error: dereferencing pointer to incomplete type
zaptel.c:5043: error: dereferencing pointer to incomplete type
zaptel.c:5043: error: dereferencing pointer to incomplete type
zaptel.c:5045: error: dereferencing pointer to incomplete type
zaptel.c:5050: error: dereferencing pointer to incomplete type
zaptel.c:5055: error: dereferencing pointer to incomplete type
zaptel.c:5055: error: dereferencing pointer to incomplete type
zaptel.c:5057: error: dereferencing pointer to incomplete type
zaptel.c:5063: error: dereferencing pointer to incomplete type
zaptel.c:5064: error: dereferencing pointer to incomplete type
zaptel.c:5064: error: dereferencing pointer to incomplete type
zaptel.c:5064: error: dereferencing pointer to incomplete type
zaptel.c:5065: error: dereferencing pointer to incomplete type
zaptel.c:5070: error: dereferencing pointer to incomplete type
zaptel.c:5070: error: dereferencing pointer to incomplete type
zaptel.c:5072: error: dereferencing pointer to incomplete type
zaptel.c:5077: error: dereferencing pointer to incomplete type
zaptel.c:5077: error: dereferencing pointer to incomplete type
zaptel.c:5079: error: dereferencing pointer to incomplete type
zaptel.c:5083: error: dereferencing pointer to incomplete type
zaptel.c:5086: error: dereferencing pointer to incomplete type
zaptel.c:5087: error: dereferencing pointer to incomplete type
zaptel.c:5092: error: dereferencing pointer to incomplete type
zaptel.c:5093: error: dereferencing pointer to incomplete type
zaptel.c:5097: error: dereferencing pointer to incomplete type
zaptel.c:5098: error: dereferencing pointer to incomplete type
zaptel.c:5099: error: dereferencing pointer to incomplete type
zaptel.c:5102: error: dereferencing pointer to incomplete type
zaptel.c:5105: error: dereferencing pointer to incomplete type
zaptel.c:5106: error: dereferencing pointer to incomplete type
zaptel.c:5106: error: dereferencing pointer to incomplete type
zaptel.c:5107: error: dereferencing pointer to incomplete type
zaptel.c:5111: error: dereferencing pointer to incomplete type
zaptel.c:5113: error: dereferencing pointer to incomplete type
zaptel.c: In function `__zt_hooksig_pvt':
zaptel.c:5127: error: dereferencing pointer to incomplete type
zaptel.c:5129: error: dereferencing pointer to incomplete type
zaptel.c:5131: error: dereferencing pointer to incomplete type
zaptel.c:5132: error: dereferencing pointer to incomplete type
zaptel.c:5147: error: dereferencing pointer to incomplete type
zaptel.c:5147: error: dereferencing pointer to incomplete type
zaptel.c:5147: error: dereferencing pointer to incomplete type
zaptel.c:5152: error: dereferencing pointer to incomplete type
zaptel.c:5163: error: dereferencing pointer to incomplete type
zaptel.c:5166: error: dereferencing pointer to incomplete type
zaptel.c:5166: error: dereferencing pointer to incomplete type
zaptel.c:5174: error: dereferencing pointer to incomplete type
zaptel.c:5178: error: dereferencing pointer to incomplete type
zaptel.c:5179: error: dereferencing pointer to incomplete type
zaptel.c:5180: error: dereferencing pointer to incomplete type
zaptel.c:5181: error: dereferencing pointer to incomplete type
zaptel.c:5189: error: dereferencing pointer to incomplete type
zaptel.c:5191: error: dereferencing pointer to incomplete type
zaptel.c:5200: error: dereferencing pointer to incomplete type
zaptel.c:5203: error: dereferencing pointer to incomplete type
zaptel.c:5207: error: dereferencing pointer to incomplete type
zaptel.c:5209: error: dereferencing pointer to incomplete type
zaptel.c:5209: error: dereferencing pointer to incomplete type
zaptel.c:5214: error: dereferencing pointer to incomplete type
zaptel.c:5215: error: dereferencing pointer to incomplete type
zaptel.c:5216: error: dereferencing pointer to incomplete type
zaptel.c:5216: error: dereferencing pointer to incomplete type
zaptel.c:5217: error: dereferencing pointer to incomplete type
zaptel.c:5224: error: dereferencing pointer to incomplete type
zaptel.c:5226: error: dereferencing pointer to incomplete type
zaptel.c:5227: error: dereferencing pointer to incomplete type
zaptel.c:5227: error: dereferencing pointer to incomplete type
zaptel.c:5230: error: dereferencing pointer to incomplete type
zaptel.c:5230: error: dereferencing pointer to incomplete type
zaptel.c:5234: error: dereferencing pointer to incomplete type
zaptel.c:5235: error: dereferencing pointer to incomplete type
zaptel.c:5236: error: dereferencing pointer to incomplete type
zaptel.c:5237: error: dereferencing pointer to incomplete type
zaptel.c:5237: error: dereferencing pointer to incomplete type
zaptel.c:5237: error: dereferencing pointer to incomplete type
zaptel.c:5239: error: dereferencing pointer to incomplete type
zaptel.c:5240: error: dereferencing pointer to incomplete type
zaptel.c: In function `zt_hooksig':
zaptel.c:5254: error: dereferencing pointer to incomplete type
zaptel.c:5256: error: dereferencing pointer to incomplete type
zaptel.c: In function `zt_rbsbits':
zaptel.c:5262: error: dereferencing pointer to incomplete type
zaptel.c:5265: error: dereferencing pointer to incomplete type
zaptel.c:5267: error: dereferencing pointer to incomplete type
zaptel.c:5268: error: dereferencing pointer to incomplete type
zaptel.c:5295: error: dereferencing pointer to incomplete type
zaptel.c:5311: error: dereferencing pointer to incomplete type
zaptel.c:5312: error: dereferencing pointer to incomplete type
zaptel.c: In function `__zt_ec_chunk':
zaptel.c:5320: error: dereferencing pointer to incomplete type
zaptel.c:5322: error: dereferencing pointer to incomplete type
zaptel.c:5326: error: dereferencing pointer to incomplete type
zaptel.c:5329: error: dereferencing pointer to incomplete type
zaptel.c:5330: error: dereferencing pointer to incomplete type
zaptel.c:5331: error: dereferencing pointer to incomplete type
zaptel.c:5332: error: dereferencing pointer to incomplete type
zaptel.c:5333: error: dereferencing pointer to incomplete type
zaptel.c:5334: error: dereferencing pointer to incomplete type
zaptel.c:5337: error: dereferencing pointer to incomplete type
zaptel.c:5338: error: dereferencing pointer to incomplete type
zaptel.c:5339: error: dereferencing pointer to incomplete type
zaptel.c:5341: error: dereferencing pointer to incomplete type
zaptel.c:5342: error: dereferencing pointer to incomplete type
zaptel.c:5342: error: dereferencing pointer to incomplete type
zaptel.c:5346: error: dereferencing pointer to incomplete type
zaptel.c:5350: error: dereferencing pointer to incomplete type
zaptel.c:5354: error: dereferencing pointer to incomplete type
zaptel.c:5355: error: dereferencing pointer to incomplete type
zaptel.c:5355: error: dereferencing pointer to incomplete type
zaptel.c:5356: error: dereferencing pointer to incomplete type
zaptel.c:5363: error: dereferencing pointer to incomplete type
zaptel.c: In function `zt_ec_span':
zaptel.c:5375: error: invalid use of undefined type `struct zt_chan'
zaptel.c:5375: error: dereferencing pointer to incomplete type
zaptel.c:5376: error: invalid use of undefined type `struct zt_chan'
zaptel.c:5376: error: dereferencing pointer to incomplete type
zaptel.c:5376: error: invalid use of undefined type `struct zt_chan'
zaptel.c:5376: error: dereferencing pointer to incomplete type
zaptel.c:5376: error: invalid use of undefined type `struct zt_chan'
zaptel.c:5376: error: dereferencing pointer to incomplete type
zaptel.c: In function `__zt_process_putaudio_chunk':
zaptel.c:5433: error: dereferencing pointer to incomplete type
zaptel.c:5438: error: dereferencing pointer to incomplete type
zaptel.c:5438: error: dereferencing pointer to incomplete type
zaptel.c:5439: error: dereferencing pointer to incomplete type
zaptel.c:5439: error: dereferencing pointer to incomplete type
zaptel.c:5440: error: dereferencing pointer to incomplete type
zaptel.c:5440: error: dereferencing pointer to incomplete type
zaptel.c:5442: error: dereferencing pointer to incomplete type
zaptel.c:5446: error: dereferencing pointer to incomplete type
zaptel.c:5447: error: dereferencing pointer to incomplete type
zaptel.c:5451: error: dereferencing pointer to incomplete type
zaptel.c:5453: error: dereferencing pointer to incomplete type
zaptel.c:5454: error: dereferencing pointer to incomplete type
zaptel.c:5455: error: dereferencing pointer to incomplete type
zaptel.c:5456: error: dereferencing pointer to incomplete type
zaptel.c:5457: error: dereferencing pointer to incomplete type
zaptel.c:5458: error: dereferencing pointer to incomplete type
zaptel.c:5459: error: dereferencing pointer to incomplete type
zaptel.c:5460: error: dereferencing pointer to incomplete type
zaptel.c:5467: error: dereferencing pointer to incomplete type
zaptel.c:5467: error: dereferencing pointer to incomplete type
zaptel.c:5467: error: dereferencing pointer to incomplete type
zaptel.c:5469: error: dereferencing pointer to incomplete type
zaptel.c:5469: error: dereferencing pointer to incomplete type
zaptel.c:5470: error: dereferencing pointer to incomplete type
zaptel.c:5470: error: dereferencing pointer to incomplete type
zaptel.c:5473: error: dereferencing pointer to incomplete type
zaptel.c:5476: error: dereferencing pointer to incomplete type
zaptel.c:5478: error: dereferencing pointer to incomplete type
zaptel.c:5479: error: dereferencing pointer to incomplete type
zaptel.c:5487: error: dereferencing pointer to incomplete type
zaptel.c:5492: error: dereferencing pointer to incomplete type
zaptel.c:5493: error: dereferencing pointer to incomplete type
zaptel.c:5493: error: dereferencing pointer to incomplete type
zaptel.c:5494: error: dereferencing pointer to incomplete type
zaptel.c:5494: error: dereferencing pointer to incomplete type
zaptel.c:5499: error: dereferencing pointer to incomplete type
zaptel.c:5499: error: dereferencing pointer to incomplete type
zaptel.c:5500: error: dereferencing pointer to incomplete type
zaptel.c:5501: error: dereferencing pointer to incomplete type
zaptel.c:5507: error: dereferencing pointer to incomplete type
zaptel.c:5509: error: dereferencing pointer to incomplete type
zaptel.c:5510: error: dereferencing pointer to incomplete type
zaptel.c:5512: error: dereferencing pointer to incomplete type
zaptel.c:5516: error: dereferencing pointer to incomplete type
zaptel.c:5520: error: dereferencing pointer to incomplete type
zaptel.c:5522: error: dereferencing pointer to incomplete type
zaptel.c:5523: error: dereferencing pointer to incomplete type
zaptel.c:5525: error: dereferencing pointer to incomplete type
zaptel.c:5529: error: dereferencing pointer to incomplete type
zaptel.c:5533: error: dereferencing pointer to incomplete type
zaptel.c:5538: error: dereferencing pointer to incomplete type
zaptel.c:5539: error: dereferencing pointer to incomplete type
zaptel.c:5542: error: dereferencing pointer to incomplete type
zaptel.c:5546: error: dereferencing pointer to incomplete type
zaptel.c:5550: error: dereferencing pointer to incomplete type
zaptel.c:5552: error: dereferencing pointer to incomplete type
zaptel.c:5552: error: dereferencing pointer to incomplete type
zaptel.c:5553: error: dereferencing pointer to incomplete type
zaptel.c:5553: error: dereferencing pointer to incomplete type
zaptel.c:5555: error: dereferencing pointer to incomplete type
zaptel.c:5555: error: dereferencing pointer to incomplete type
zaptel.c:5556: error: dereferencing pointer to incomplete type
zaptel.c:5556: error: dereferencing pointer to incomplete type
zaptel.c:5556: error: dereferencing pointer to incomplete type
zaptel.c:5556: error: dereferencing pointer to incomplete type
zaptel.c:5559: error: dereferencing pointer to incomplete type
zaptel.c:5561: error: dereferencing pointer to incomplete type
zaptel.c:5563: error: dereferencing pointer to incomplete type
zaptel.c:5567: error: dereferencing pointer to incomplete type
zaptel.c:5570: error: dereferencing pointer to incomplete type
zaptel.c:5572: error: dereferencing pointer to incomplete type
zaptel.c:5574: error: dereferencing pointer to incomplete type
zaptel.c:5576: error: dereferencing pointer to incomplete type
zaptel.c:5580: error: dereferencing pointer to incomplete type
zaptel.c:5581: error: dereferencing pointer to incomplete type
zaptel.c:5581: error: dereferencing pointer to incomplete type
zaptel.c:5586: error: dereferencing pointer to incomplete type
zaptel.c:5590: error: dereferencing pointer to incomplete type
zaptel.c:5592: error: dereferencing pointer to incomplete type
zaptel.c:5592: error: dereferencing pointer to incomplete type
zaptel.c:5593: error: dereferencing pointer to incomplete type
zaptel.c:5593: error: dereferencing pointer to incomplete type
zaptel.c:5595: error: dereferencing pointer to incomplete type
zaptel.c:5595: error: dereferencing pointer to incomplete type
zaptel.c:5597: error: dereferencing pointer to incomplete type
zaptel.c:5597: error: dereferencing pointer to incomplete type
zaptel.c:5597: error: dereferencing pointer to incomplete type
zaptel.c:5597: error: dereferencing pointer to incomplete type
zaptel.c:5602: error: dereferencing pointer to incomplete type
zaptel.c:5606: error: dereferencing pointer to incomplete type
zaptel.c:5606: error: dereferencing pointer to incomplete type
zaptel.c:5608: error: dereferencing pointer to incomplete type
zaptel.c:5610: error: dereferencing pointer to incomplete type
zaptel.c:5610: error: dereferencing pointer to incomplete type
zaptel.c:5611: error: dereferencing pointer to incomplete type
zaptel.c:5611: error: dereferencing pointer to incomplete type
zaptel.c:5613: error: dereferencing pointer to incomplete type
zaptel.c:5613: error: dereferencing pointer to incomplete type
zaptel.c:5615: error: dereferencing pointer to incomplete type
zaptel.c:5615: error: dereferencing pointer to incomplete type
zaptel.c:5615: error: dereferencing pointer to incomplete type
zaptel.c:5615: error: dereferencing pointer to incomplete type
zaptel.c:5617: error: dereferencing pointer to incomplete type
zaptel.c:5617: error: dereferencing pointer to incomplete type
zaptel.c:5621: error: dereferencing pointer to incomplete type
zaptel.c:5623: error: dereferencing pointer to incomplete type
zaptel.c:5624: error: dereferencing pointer to incomplete type
zaptel.c:5624: error: dereferencing pointer to incomplete type
zaptel.c:5626: error: dereferencing pointer to incomplete type
zaptel.c:5626: error: dereferencing pointer to incomplete type
zaptel.c: In function `__zt_putbuf_chunk':
zaptel.c:5637: error: dereferencing pointer to incomplete type
zaptel.c:5659: error: dereferencing pointer to incomplete type
zaptel.c:5661: error: dereferencing pointer to incomplete type
zaptel.c:5661: error: dereferencing pointer to incomplete type
zaptel.c:5662: error: dereferencing pointer to incomplete type
zaptel.c:5662: error: dereferencing pointer to incomplete type
zaptel.c:5662: error: dereferencing pointer to incomplete type
zaptel.c:5665: error: dereferencing pointer to incomplete type
zaptel.c:5668: error: dereferencing pointer to incomplete type
zaptel.c:5670: error: dereferencing pointer to incomplete type
zaptel.c:5676: error: dereferencing pointer to incomplete type
zaptel.c:5676: error: dereferencing pointer to incomplete type
zaptel.c:5677: error: dereferencing pointer to incomplete type
zaptel.c:5677: error: dereferencing pointer to incomplete type
zaptel.c:5687: error: dereferencing pointer to incomplete type
zaptel.c:5687: error: dereferencing pointer to incomplete type
zaptel.c:5694: error: dereferencing pointer to incomplete type
zaptel.c:5694: error: dereferencing pointer to incomplete type
zaptel.c:5694: error: dereferencing pointer to incomplete type
zaptel.c:5695: error: dereferencing pointer to incomplete type
zaptel.c:5695: error: dereferencing pointer to incomplete type
zaptel.c:5697: error: dereferencing pointer to incomplete type
zaptel.c:5697: error: dereferencing pointer to incomplete type
zaptel.c:5697: error: dereferencing pointer to incomplete type
zaptel.c:5698: error: dereferencing pointer to incomplete type
zaptel.c:5699: error: dereferencing pointer to incomplete type
zaptel.c:5699: error: dereferencing pointer to incomplete type
zaptel.c:5702: error: dereferencing pointer to incomplete type
zaptel.c:5703: error: dereferencing pointer to incomplete type
zaptel.c:5704: error: dereferencing pointer to incomplete type
zaptel.c:5704: error: dereferencing pointer to incomplete type
zaptel.c:5711: error: dereferencing pointer to incomplete type
zaptel.c:5711: error: dereferencing pointer to incomplete type
zaptel.c:5711: error: dereferencing pointer to incomplete type
zaptel.c:5711: error: dereferencing pointer to incomplete type
zaptel.c:5713: error: dereferencing pointer to incomplete type
zaptel.c:5713: error: dereferencing pointer to incomplete type
zaptel.c:5716: error: dereferencing pointer to incomplete type
zaptel.c:5716: error: dereferencing pointer to incomplete type
zaptel.c:5716: error: dereferencing pointer to incomplete type
zaptel.c:5720: error: dereferencing pointer to incomplete type
zaptel.c:5721: error: dereferencing pointer to incomplete type
zaptel.c:5722: error: dereferencing pointer to incomplete type
zaptel.c:5722: error: dereferencing pointer to incomplete type
zaptel.c:5722: error: dereferencing pointer to incomplete type
zaptel.c:5722: error: dereferencing pointer to incomplete type
zaptel.c:5788: error: dereferencing pointer to incomplete type
zaptel.c:5788: error: dereferencing pointer to incomplete type
zaptel.c:5788: error: dereferencing pointer to incomplete type
zaptel.c:5789: error: dereferencing pointer to incomplete type
zaptel.c:5789: error: dereferencing pointer to incomplete type
zaptel.c:5796: error: dereferencing pointer to incomplete type
zaptel.c:5798: error: dereferencing pointer to incomplete type
zaptel.c:5800: error: dereferencing pointer to incomplete type
zaptel.c:5801: error: dereferencing pointer to incomplete type
zaptel.c:5813: error: dereferencing pointer to incomplete type
zaptel.c:5819: error: dereferencing pointer to incomplete type
zaptel.c:5820: error: dereferencing pointer to incomplete type
zaptel.c:5821: error: dereferencing pointer to incomplete type
zaptel.c:5822: error: dereferencing pointer to incomplete type
zaptel.c:5828: error: dereferencing pointer to incomplete type
zaptel.c:5828: error: dereferencing pointer to incomplete type
zaptel.c:5829: error: dereferencing pointer to incomplete type
zaptel.c:5854: error: dereferencing pointer to incomplete type
zaptel.c:5854: error: dereferencing pointer to incomplete type
zaptel.c:5856: error: dereferencing pointer to incomplete type
zaptel.c: In function `zt_timer_poll':
zaptel.c:5923: error: dereferencing pointer to incomplete type
zaptel.c: In function `zt_chan_poll':
zaptel.c:5948: error: dereferencing pointer to incomplete type
zaptel.c:5950: error: dereferencing pointer to incomplete type
zaptel.c:5952: error: dereferencing pointer to incomplete type
zaptel.c:5955: error: dereferencing pointer to incomplete type
zaptel.c:5955: error: dereferencing pointer to incomplete type
zaptel.c:5958: error: dereferencing pointer to incomplete type
zaptel.c:5958: error: dereferencing pointer to incomplete type
zaptel.c:5963: error: dereferencing pointer to incomplete type
zaptel.c: In function `zt_poll':
zaptel.c:5971: error: dereferencing pointer to incomplete type
zaptel.c:5981: error: dereferencing pointer to incomplete type
zaptel.c:5984: error: dereferencing pointer to incomplete type
zaptel.c:5987: error: dereferencing pointer to incomplete type
zaptel.c:5992: error: dereferencing pointer to incomplete type
zaptel.c: In function `__zt_transmit_chunk':
zaptel.c:6005: error: dereferencing pointer to incomplete type
zaptel.c:6005: error: dereferencing pointer to incomplete type
zaptel.c: In function `__zt_real_transmit':
zaptel.c:6019: error: dereferencing pointer to incomplete type
zaptel.c:6021: error: dereferencing pointer to incomplete type
zaptel.c:6021: error: dereferencing pointer to incomplete type
zaptel.c:6023: error: dereferencing pointer to incomplete type
zaptel.c: In function `__zt_getempty':
zaptel.c:6038: error: dereferencing pointer to incomplete type
zaptel.c:6039: error: dereferencing pointer to incomplete type
zaptel.c:6039: error: dereferencing pointer to incomplete type
zaptel.c:6044: error: dereferencing pointer to incomplete type
zaptel.c:6044: error: dereferencing pointer to incomplete type
zaptel.c:6045: error: dereferencing pointer to incomplete type
zaptel.c:6047: error: dereferencing pointer to incomplete type
zaptel.c:6049: error: dereferencing pointer to incomplete type
zaptel.c:6049: error: dereferencing pointer to incomplete type
zaptel.c:6052: error: dereferencing pointer to incomplete type
zaptel.c:6053: error: dereferencing pointer to incomplete type
zaptel.c:6054: error: dereferencing pointer to incomplete type
zaptel.c:6054: error: dereferencing pointer to incomplete type
zaptel.c:6055: error: dereferencing pointer to incomplete type
zaptel.c:6057: error: dereferencing pointer to incomplete type
zaptel.c:6060: error: dereferencing pointer to incomplete type
zaptel.c:6061: error: dereferencing pointer to incomplete type
zaptel.c:6061: error: dereferencing pointer to incomplete type
zaptel.c:6066: error: dereferencing pointer to incomplete type
zaptel.c:6066: error: dereferencing pointer to incomplete type
zaptel.c:6066: error: dereferencing pointer to incomplete type
zaptel.c:6066: error: dereferencing pointer to incomplete type
zaptel.c:6066: error: dereferencing pointer to incomplete type
zaptel.c: In function `__zt_receive_chunk':
zaptel.c:6079: error: dereferencing pointer to incomplete type
zaptel.c:6079: error: dereferencing pointer to incomplete type
zaptel.c:6079: error: dereferencing pointer to incomplete type
zaptel.c:6079: error: dereferencing pointer to incomplete type
zaptel.c:6079: error: dereferencing pointer to incomplete type
zaptel.c:6082: error: dereferencing pointer to incomplete type
zaptel.c:6082: error: dereferencing pointer to incomplete type
zaptel.c: In function `__zt_real_receive':
zaptel.c:6097: error: dereferencing pointer to incomplete type
zaptel.c:6099: error: dereferencing pointer to incomplete type
zaptel.c:6099: error: dereferencing pointer to incomplete type
zaptel.c:6101: error: dereferencing pointer to incomplete type
zaptel.c: In function `zt_transmit':
zaptel.c:6112: error: invalid use of undefined type `struct zt_chan'
zaptel.c:6112: error: dereferencing pointer to incomplete type
zaptel.c:6113: error: invalid use of undefined type `struct zt_chan'
zaptel.c:6113: error: dereferencing pointer to incomplete type
zaptel.c:6113: error: invalid use of undefined type `struct zt_chan'
zaptel.c:6113: error: dereferencing pointer to incomplete type
zaptel.c:6114: error: invalid use of undefined type `struct zt_chan'
zaptel.c:6114: error: dereferencing pointer to incomplete type
zaptel.c:6115: error: invalid use of undefined type `struct zt_chan'
zaptel.c:6115: error: dereferencing pointer to incomplete type
zaptel.c:6116: error: invalid use of undefined type `struct zt_chan'
zaptel.c:6116: error: dereferencing pointer to incomplete type
zaptel.c:6117: error: invalid use of undefined type `struct zt_chan'
zaptel.c:6117: error: dereferencing pointer to incomplete type
zaptel.c:6120: error: invalid use of undefined type `struct zt_chan'
zaptel.c:6120: error: dereferencing pointer to incomplete type
zaptel.c:6121: error: invalid use of undefined type `struct zt_chan'
zaptel.c:6121: error: dereferencing pointer to incomplete type
zaptel.c:6123: error: invalid use of undefined type `struct zt_chan'
zaptel.c:6123: error: dereferencing pointer to incomplete type
zaptel.c:6124: error: `u_char' undeclared (first use in this function)
zaptel.c:6124: error: syntax error before "data"
zaptel.c:6133: error: invalid use of undefined type `struct zt_chan'
zaptel.c:6133: error: dereferencing pointer to incomplete type
zaptel.c:6136: error: invalid use of undefined type `struct zt_chan'
zaptel.c:6136: error: dereferencing pointer to incomplete type
zaptel.c:6136: warning: dereferencing `void *' pointer
zaptel.c:6137: error: invalid use of undefined type `struct zt_chan'
zaptel.c:6137: error: dereferencing pointer to incomplete type
zaptel.c:6142: error: invalid use of undefined type `struct zt_chan'
zaptel.c:6142: error: dereferencing pointer to incomplete type
zaptel.c:6145: error: invalid use of undefined type `struct zt_chan'
zaptel.c:6145: error: dereferencing pointer to incomplete type
zaptel.c:6146: error: invalid use of undefined type `struct zt_chan'
zaptel.c:6146: error: dereferencing pointer to incomplete type
zaptel.c:6148: error: invalid use of undefined type `struct zt_chan'
zaptel.c:6148: error: dereferencing pointer to incomplete type
zaptel.c:6148: error: invalid use of undefined type `struct zt_chan'
zaptel.c:6148: error: dereferencing pointer to incomplete type
zaptel.c:6149: error: invalid use of undefined type `struct zt_chan'
zaptel.c:6149: error: dereferencing pointer to incomplete type
zaptel.c:6149: error: invalid use of undefined type `struct zt_chan'
zaptel.c:6149: error: dereferencing pointer to incomplete type
zaptel.c:6150: error: invalid use of undefined type `struct zt_chan'
zaptel.c:6150: error: dereferencing pointer to incomplete type
zaptel.c:6150: error: invalid use of undefined type `struct zt_chan'
zaptel.c:6150: error: dereferencing pointer to incomplete type
zaptel.c:6156: error: invalid use of undefined type `struct zt_chan'
zaptel.c:6156: error: dereferencing pointer to incomplete type
zaptel.c: In function `zt_receive':
zaptel.c:6182: error: invalid use of undefined type `struct zt_chan'
zaptel.c:6182: error: dereferencing pointer to incomplete type
zaptel.c:6182: error: invalid use of undefined type `struct zt_chan'
zaptel.c:6182: error: dereferencing pointer to incomplete type
zaptel.c:6183: error: invalid use of undefined type `struct zt_chan'
zaptel.c:6183: error: dereferencing pointer to incomplete type
zaptel.c:6184: error: invalid use of undefined type `struct zt_chan'
zaptel.c:6184: error: dereferencing pointer to incomplete type
zaptel.c:6186: error: `u_char' undeclared (first use in this function)
zaptel.c:6186: error: syntax error before "data"
zaptel.c:6192: warning: dereferencing `void *' pointer
zaptel.c:6192: error: invalid use of undefined type `struct zt_chan'
zaptel.c:6192: error: dereferencing pointer to incomplete type
zaptel.c:6192: error: invalid use of void expression
zaptel.c:6194: error: invalid use of undefined type `struct zt_chan'
zaptel.c:6194: error: dereferencing pointer to incomplete type
zaptel.c:6197: error: invalid use of undefined type `struct zt_chan'
zaptel.c:6197: error: dereferencing pointer to incomplete type
zaptel.c:6202: error: invalid use of undefined type `struct zt_chan'
zaptel.c:6202: error: dereferencing pointer to incomplete type
zaptel.c:6204: error: invalid use of undefined type `struct zt_chan'
zaptel.c:6204: error: dereferencing pointer to incomplete type
zaptel.c:6205: error: invalid use of undefined type `struct zt_chan'
zaptel.c:6205: error: dereferencing pointer to incomplete type
zaptel.c:6206: error: invalid use of undefined type `struct zt_chan'
zaptel.c:6206: error: dereferencing pointer to incomplete type
zaptel.c:6207: error: invalid use of undefined type `struct zt_chan'
zaptel.c:6207: error: dereferencing pointer to incomplete type
zaptel.c:6210: error: invalid use of undefined type `struct zt_chan'
zaptel.c:6210: error: dereferencing pointer to incomplete type
zaptel.c:6211: error: invalid use of undefined type `struct zt_chan'
zaptel.c:6211: error: dereferencing pointer to incomplete type
zaptel.c:6212: error: invalid use of undefined type `struct zt_chan'
zaptel.c:6212: error: dereferencing pointer to incomplete type
zaptel.c:6213: error: invalid use of undefined type `struct zt_chan'
zaptel.c:6213: error: dereferencing pointer to incomplete type
zaptel.c:6214: error: invalid use of undefined type `struct zt_chan'
zaptel.c:6214: error: dereferencing pointer to incomplete type
zaptel.c:6215: error: invalid use of undefined type `struct zt_chan'
zaptel.c:6215: error: dereferencing pointer to incomplete type
zaptel.c:6216: error: invalid use of undefined type `struct zt_chan'
zaptel.c:6216: error: dereferencing pointer to incomplete type
zaptel.c:6218: error: invalid use of undefined type `struct zt_chan'
zaptel.c:6218: error: dereferencing pointer to incomplete type
zaptel.c:6218: error: invalid use of undefined type `struct zt_chan'
zaptel.c:6218: error: dereferencing pointer to incomplete type
zaptel.c:6219: error: invalid use of undefined type `struct zt_chan'
zaptel.c:6219: error: dereferencing pointer to incomplete type
zaptel.c:6222: error: invalid use of undefined type `struct zt_chan'
zaptel.c:6222: error: dereferencing pointer to incomplete type
zaptel.c:6224: error: invalid use of undefined type `struct zt_chan'
zaptel.c:6224: error: dereferencing pointer to incomplete type
zaptel.c:6225: error: invalid use of undefined type `struct zt_chan'
zaptel.c:6225: error: dereferencing pointer to incomplete type
zaptel.c:6227: error: invalid use of undefined type `struct zt_chan'
zaptel.c:6227: error: dereferencing pointer to incomplete type
zaptel.c:6229: error: invalid use of undefined type `struct zt_chan'
zaptel.c:6229: error: dereferencing pointer to incomplete type
zaptel.c:6232: error: invalid use of undefined type `struct zt_chan'
zaptel.c:6232: error: dereferencing pointer to incomplete type
zaptel.c:6233: error: invalid use of undefined type `struct zt_chan'
zaptel.c:6233: error: dereferencing pointer to incomplete type
zaptel.c:6234: error: invalid use of undefined type `struct zt_chan'
zaptel.c:6234: error: dereferencing pointer to incomplete type
zaptel.c:6235: error: invalid use of undefined type `struct zt_chan'
zaptel.c:6235: error: dereferencing pointer to incomplete type
zaptel.c:6236: error: invalid use of undefined type `struct zt_chan'
zaptel.c:6236: error: dereferencing pointer to incomplete type
zaptel.c:6237: error: invalid use of undefined type `struct zt_chan'
zaptel.c:6237: error: dereferencing pointer to incomplete type
zaptel.c:6238: error: invalid use of undefined type `struct zt_chan'
zaptel.c:6238: error: dereferencing pointer to incomplete type
zaptel.c:6239: error: invalid use of undefined type `struct zt_chan'
zaptel.c:6239: error: dereferencing pointer to incomplete type
zaptel.c:6241: error: invalid use of undefined type `struct zt_chan'
zaptel.c:6241: error: dereferencing pointer to incomplete type
zaptel.c:6242: error: invalid use of undefined type `struct zt_chan'
zaptel.c:6242: error: dereferencing pointer to incomplete type
zaptel.c:6244: error: invalid use of undefined type `struct zt_chan'
zaptel.c:6244: error: dereferencing pointer to incomplete type
zaptel.c:6248: error: invalid use of undefined type `struct zt_chan'
zaptel.c:6248: error: dereferencing pointer to incomplete type
zaptel.c:6263: error: dereferencing pointer to incomplete type
zaptel.c:6263: error: dereferencing pointer to incomplete type
zaptel.c:6265: error: dereferencing pointer to incomplete type
zaptel.c:6266: error: dereferencing pointer to incomplete type
zaptel.c:6269: error: dereferencing pointer to incomplete type
zaptel.c:6270: error: dereferencing pointer to incomplete type
zaptel.c:6277: error: dereferencing pointer to incomplete type
zaptel.c:6278: error: dereferencing pointer to incomplete type
zaptel.c:6280: error: dereferencing pointer to incomplete type
zaptel.c:6301: error: dereferencing pointer to incomplete type
zaptel.c:6303: error: dereferencing pointer to incomplete type
zaptel.c:6306: error: dereferencing pointer to incomplete type
zaptel.c:6310: error: dereferencing pointer to incomplete type
zaptel.c:6310: error: dereferencing pointer to incomplete type
zaptel.c:6312: error: dereferencing pointer to incomplete type
zaptel.c:6313: error: dereferencing pointer to incomplete type
zaptel.c:6316: error: dereferencing pointer to incomplete type
zaptel.c:6317: error: dereferencing pointer to incomplete type
zaptel.c: At top level:
zaptel.c:6340: error: variable `zt_fops' has initializer but incomplete type
zaptel.c:6341: error: unknown field `owner' specified in initializer
zaptel.c:6341: warning: excess elements in struct initializer
zaptel.c:6341: warning: (near initialization for `zt_fops')
zaptel.c:6342: error: unknown field `llseek' specified in initializer
zaptel.c:6342: warning: excess elements in struct initializer
zaptel.c:6342: warning: (near initialization for `zt_fops')
zaptel.c:6343: error: unknown field `open' specified in initializer
zaptel.c:6343: warning: excess elements in struct initializer
zaptel.c:6343: warning: (near initialization for `zt_fops')
zaptel.c:6344: error: unknown field `release' specified in initializer
zaptel.c:6344: warning: excess elements in struct initializer
zaptel.c:6344: warning: (near initialization for `zt_fops')
zaptel.c:6345: error: unknown field `ioctl' specified in initializer
zaptel.c:6345: warning: excess elements in struct initializer
zaptel.c:6345: warning: (near initialization for `zt_fops')
zaptel.c:6346: error: unknown field `read' specified in initializer
zaptel.c:6346: warning: excess elements in struct initializer
zaptel.c:6346: warning: (near initialization for `zt_fops')
zaptel.c:6347: error: unknown field `write' specified in initializer
zaptel.c:6347: warning: excess elements in struct initializer
zaptel.c:6347: warning: (near initialization for `zt_fops')
zaptel.c:6348: error: unknown field `poll' specified in initializer
zaptel.c:6348: warning: excess elements in struct initializer
zaptel.c:6348: warning: (near initialization for `zt_fops')
zaptel.c:6349: error: unknown field `mmap' specified in initializer
zaptel.c:6349: warning: excess elements in struct initializer
zaptel.c:6349: warning: (near initialization for `zt_fops')
zaptel.c:6350: error: unknown field `flush' specified in initializer
zaptel.c:6350: warning: excess elements in struct initializer
zaptel.c:6350: warning: (near initialization for `zt_fops')
zaptel.c:6351: error: unknown field `fsync' specified in initializer
zaptel.c:6351: warning: excess elements in struct initializer
zaptel.c:6351: warning: (near initialization for `zt_fops')
zaptel.c:6352: error: unknown field `fasync' specified in initializer
zaptel.c:6352: warning: excess elements in struct initializer
zaptel.c:6352: warning: (near initialization for `zt_fops')
/usr/include/asm-generic/siginfo.h:53: error: storage size of `_pad' isn't known
/usr/include/linux/stat.h:68: error: storage size of `atime' isn't known
/usr/include/linux/stat.h:69: error: storage size of `mtime' isn't known
/usr/include/linux/stat.h:70: error: storage size of `ctime' isn't known
/usr/include/linux/fs.h:262: error: storage size of `ia_atime' isn't known
/usr/include/linux/fs.h:263: error: storage size of `ia_mtime' isn't known
/usr/include/linux/fs.h:264: error: storage size of `ia_ctime' isn't known
/usr/include/linux/quota.h:226: error: storage size of `dq_dqb' isn't known
/usr/include/linux/fs.h:381: error: storage size of `i_atime' isn't known
/usr/include/linux/fs.h:382: error: storage size of `i_mtime' isn't known
/usr/include/linux/fs.h:383: error: storage size of `i_ctime' isn't known
/usr/include/linux/fs.h:515: error: storage size of `f_owner' isn't known
zaptel.h:1080: error: storage size of `confin' isn't known
zaptel.h:1081: error: storage size of `confout' isn't known
zaptel.c:6340: error: storage size of `zt_fops' isn't known
make: *** [zaptel.o] Error 1
gtspbx:/usr/src/zaptel#