rendered paste bodyThis file contains any messages produced by compilers while
running configure, to aid debugging if configure makes a mistake.
It was created by configure, which was
generated by GNU Autoconf 2.60. Invocation command line was
$ ./configure --prefix=/usr --host=x86_64-pc-linux-gnu --mandir=/usr/share/man --infodir=/usr/share/info --datadir=/usr/share --sysconfdir=/etc --localstatedir=/var/lib --enable-gnome --enable-nls --enable-ipv6 --enable-samba --disable-altivec --disable-v4l --disable-mng --without-imagemagick --enable-gdkpxibuf --enable-faad --enable-flac --with-vorbis --with-speex --with-theora --enable-a52 --with-external-a52dec --enable-mad --with-external-libmad --disable-dts --with-external-libdts --with-x --enable-xinerama --disable-vidix --disable-dxr3 --disable-directfb --disable-fb --enable-opengl --disable-aalib --without-caca --with-sdl --enable-xvmc --disable-oss --with-alsa --without-arts --without-esound --with-pulseaudio --enable-vcd --without-internal-vcdlibs --disable-w32dll --enable-modplug --enable-asf --with-external-ffmpeg --without-pulseaudio --disable-optimizations --with-xv-path=/usr/lib64 --with-w32-path=/usr/lib/win32 --enable-fast-install --disable-dependency-tracking --libdir=/usr/lib64 --build=x86_64-pc-linux-gnu
## --------- ##
## Platform. ##
## --------- ##
hostname = wasabi
uname -m = x86_64
uname -r = 2.6.17-ck1
uname -s = Linux
uname -v = #1 PREEMPT Sun Jul 2 21:30:17 CDT 2006
/usr/bin/uname -p = AMD Athlon(tm) 64 Processor 3800+
/bin/uname -X = unknown
/bin/arch = x86_64
/usr/bin/arch -k = unknown
/usr/convex/getsysinfo = unknown
/usr/bin/hostinfo = unknown
/bin/machine = unknown
/usr/bin/oslevel = unknown
/bin/universe = unknown
PATH: /usr/lib/ccache/bin
PATH: /usr/local/sbin
PATH: /sbin
PATH: /usr/sbin
PATH: /usr/lib/portage/bin
PATH: /usr/local/bin
PATH: /bin
PATH: /usr/bin
PATH: /opt/bin
PATH: /usr/qt/3/bin
PATH: /usr/x86_64-pc-linux-gnu/gcc-bin/3.4.4
PATH: /home/ian/kdesvn/kdenonbeta/unsermake
PATH: /opt/sun-jdk-1.5.0.06/bin
PATH: /opt/sun-jdk-1.5.0.06/jre/bin
PATH: /usr/kde/3.5/sbin
PATH: /usr/kde/3.5/bin
PATH: /usr/qt/3/bin
PATH: /usr/bin
PATH: /usr/kde/3.4/sbin
PATH: /usr/kde/3.4/bin
PATH: /usr/NX/bin
PATH: /opt/vmware/workstation/bin
## ----------- ##
## Core tests. ##
## ----------- ##
configure:2531: checking for a BSD-compatible install
configure:2587: result: /bin/install -c
configure:2598: checking whether build environment is sane
configure:2641: result: yes
configure:2706: checking for gawk
configure:2722: found /bin/gawk
configure:2733: result: gawk
configure:2744: checking whether make sets $(MAKE)
configure:2765: result: yes
configure:2979: checking for style of include used by make
configure:3007: result: GNU
configure:3040: checking for x86_64-pc-linux-gnu-gcc
configure:3056: found /usr/lib/ccache/bin/x86_64-pc-linux-gnu-gcc
configure:3067: result: x86_64-pc-linux-gnu-gcc
configure:3345: checking for C compiler version
configure:3352: x86_64-pc-linux-gnu-gcc --version >&5
x86_64-pc-linux-gnu-gcc (GCC) 3.4.4 (Gentoo 3.4.4-r1, ssp-3.4.4-1.0, pie-8.7.8)
Copyright (C) 2004 Free Software Foundation, Inc.
This is free software; see the source for copying conditions. There is NO
warranty; not even for MERCHANTABILITY or FITNESS FOR A PARTICULAR PURPOSE.
configure:3355: $? = 0
configure:3362: x86_64-pc-linux-gnu-gcc -v >&5
Reading specs from /usr/lib/gcc/x86_64-pc-linux-gnu/3.4.4/specs
Configured with: /var/tmp/portage/gcc-3.4.4-r1/work/gcc-3.4.4/configure --prefix=/usr --bindir=/usr/x86_64-pc-linux-gnu/gcc-bin/3.4.4 --includedir=/usr/lib/gcc/x86_64-pc-linux-gnu/3.4.4/include --datadir=/usr/share/gcc-data/x86_64-pc-linux-gnu/3.4.4 --mandir=/usr/share/gcc-data/x86_64-pc-linux-gnu/3.4.4/man --infodir=/usr/share/gcc-data/x86_64-pc-linux-gnu/3.4.4/info --with-gxx-include-dir=/usr/lib/gcc/x86_64-pc-linux-gnu/3.4.4/include/g++-v3 --host=x86_64-pc-linux-gnu --disable-altivec --enable-nls --without-included-gettext --with-system-zlib --disable-checking --disable-werror --disable-libunwind-exceptions --enable-multilib --disable-libgcj --enable-languages=c,c++,f77 --enable-shared --enable-threads=posix --enable-__cxa_atexit --enable-clocale=gnu
Thread model: posix
gcc version 3.4.4 (Gentoo 3.4.4-r1, ssp-3.4.4-1.0, pie-8.7.8)
configure:3365: $? = 0
configure:3372: x86_64-pc-linux-gnu-gcc -V >&5
x86_64-pc-linux-gnu-gcc: `-V' option must have argument
configure:3375: $? = 1
configure:3398: checking for C compiler default output file name
configure:3425: x86_64-pc-linux-gnu-gcc -march=athlon64 -O2 -pipe -frename-registers -ffunction-sections conftest.c >&5
configure:3428: $? = 0
configure:3474: result: a.out
configure:3479: checking whether the C compiler works
configure:3489: ./a.out
configure:3492: $? = 0
configure:3509: result: yes
configure:3516: checking whether we are cross compiling
configure:3518: result: no
configure:3521: checking for suffix of executables
configure:3528: x86_64-pc-linux-gnu-gcc -o conftest -march=athlon64 -O2 -pipe -frename-registers -ffunction-sections conftest.c >&5
configure:3531: $? = 0
configure:3555: result:
configure:3561: checking for suffix of object files
configure:3587: x86_64-pc-linux-gnu-gcc -c -march=athlon64 -O2 -pipe -frename-registers -ffunction-sections conftest.c >&5
configure:3590: $? = 0
configure:3613: result: o
configure:3617: checking whether we are using the GNU C compiler
configure:3646: x86_64-pc-linux-gnu-gcc -c -march=athlon64 -O2 -pipe -frename-registers -ffunction-sections conftest.c >&5
configure:3652: $? = 0
configure:3659: test -z "$ac_c_werror_flag" || test ! -s conftest.err
configure:3662: $? = 0
configure:3669: test -s conftest.o
configure:3672: $? = 0
configure:3686: result: yes
configure:3691: checking whether x86_64-pc-linux-gnu-gcc accepts -g
configure:3721: x86_64-pc-linux-gnu-gcc -c -g conftest.c >&5
configure:3727: $? = 0
configure:3734: test -z "$ac_c_werror_flag" || test ! -s conftest.err
configure:3737: $? = 0
configure:3744: test -s conftest.o
configure:3747: $? = 0
configure:3877: result: yes
configure:3894: checking for x86_64-pc-linux-gnu-gcc option to accept ISO C89
configure:3968: x86_64-pc-linux-gnu-gcc -c -march=athlon64 -O2 -pipe -frename-registers -ffunction-sections conftest.c >&5
configure:3974: $? = 0
configure:3981: test -z "$ac_c_werror_flag" || test ! -s conftest.err
configure:3984: $? = 0
configure:3991: test -s conftest.o
configure:3994: $? = 0
configure:4014: result: none needed
configure:4034: checking dependency style of x86_64-pc-linux-gnu-gcc
configure:4124: result: none
configure:4143: checking for strerror in -lcposix
configure:4178: x86_64-pc-linux-gnu-gcc -o conftest -march=athlon64 -O2 -pipe -frename-registers -ffunction-sections conftest.c -lcposix >&5
/usr/lib/gcc/x86_64-pc-linux-gnu/3.4.4/../../../../x86_64-pc-linux-gnu/bin/ld: cannot find -lcposix
collect2: ld returned 1 exit status
configure:4184: $? = 1
configure: failed program was:
| /* confdefs.h. */
| #define PACKAGE_NAME ""
| #define PACKAGE_TARNAME ""
| #define PACKAGE_VERSION ""
| #define PACKAGE_STRING ""
| #define PACKAGE_BUGREPORT ""
| #define XINE_MAJOR 1
| #define XINE_MINOR 1
| #define XINE_SUB 3
| #define XINE_TEXTDOMAIN "libxine1"
| #define PACKAGE "xine-lib"
| #define VERSION "1.1.3"
| /* end confdefs.h. */
|
| /* Override any GCC internal prototype to avoid an error.
| Use char because int might match the return type of a GCC
| builtin and then its argument prototype would still apply. */
| #ifdef __cplusplus
| extern "C"
| #endif
| char strerror ();
| int
| main ()
| {
| return strerror ();
| ;
| return 0;
| }
configure:4218: result: no
configure:4226: checking for grep that handles long lines and -e
configure:4300: result: /bin/grep
configure:4305: checking for egrep
configure:4383: result: /bin/grep -E
configure:4388: checking for x86_64-pc-linux-gnu-file
configure:4444: result: no
configure:4450: checking for file
configure:4503: result: /usr/bin/file
configure:4524: checking for x86_64-pc-linux-gnu-gcc
configure:4551: result: x86_64-pc-linux-gnu-gcc
configure:4829: checking for C compiler version
configure:4836: x86_64-pc-linux-gnu-gcc --version >&5
x86_64-pc-linux-gnu-gcc (GCC) 3.4.4 (Gentoo 3.4.4-r1, ssp-3.4.4-1.0, pie-8.7.8)
Copyright (C) 2004 Free Software Foundation, Inc.
This is free software; see the source for copying conditions. There is NO
warranty; not even for MERCHANTABILITY or FITNESS FOR A PARTICULAR PURPOSE.
configure:4839: $? = 0
configure:4846: x86_64-pc-linux-gnu-gcc -v >&5
Reading specs from /usr/lib/gcc/x86_64-pc-linux-gnu/3.4.4/specs
Configured with: /var/tmp/portage/gcc-3.4.4-r1/work/gcc-3.4.4/configure --prefix=/usr --bindir=/usr/x86_64-pc-linux-gnu/gcc-bin/3.4.4 --includedir=/usr/lib/gcc/x86_64-pc-linux-gnu/3.4.4/include --datadir=/usr/share/gcc-data/x86_64-pc-linux-gnu/3.4.4 --mandir=/usr/share/gcc-data/x86_64-pc-linux-gnu/3.4.4/man --infodir=/usr/share/gcc-data/x86_64-pc-linux-gnu/3.4.4/info --with-gxx-include-dir=/usr/lib/gcc/x86_64-pc-linux-gnu/3.4.4/include/g++-v3 --host=x86_64-pc-linux-gnu --disable-altivec --enable-nls --without-included-gettext --with-system-zlib --disable-checking --disable-werror --disable-libunwind-exceptions --enable-multilib --disable-libgcj --enable-languages=c,c++,f77 --enable-shared --enable-threads=posix --enable-__cxa_atexit --enable-clocale=gnu
Thread model: posix
gcc version 3.4.4 (Gentoo 3.4.4-r1, ssp-3.4.4-1.0, pie-8.7.8)
configure:4849: $? = 0
configure:4856: x86_64-pc-linux-gnu-gcc -V >&5
x86_64-pc-linux-gnu-gcc: `-V' option must have argument
configure:4859: $? = 1
configure:4862: checking whether we are using the GNU C compiler
configure:4931: result: yes
configure:4936: checking whether x86_64-pc-linux-gnu-gcc accepts -g
configure:5122: result: yes
configure:5139: checking for x86_64-pc-linux-gnu-gcc option to accept ISO C89
configure:5259: result: none needed
configure:5279: checking dependency style of x86_64-pc-linux-gnu-gcc
configure:5369: result: none
configure:5391: checking how to run the C preprocessor
configure:5431: x86_64-pc-linux-gnu-gcc -E conftest.c
configure:5437: $? = 0
configure:5475: x86_64-pc-linux-gnu-gcc -E conftest.c
conftest.c:14:28: ac_nonexistent.h: No such file or directory
configure:5481: $? = 1
configure: failed program was:
| /* confdefs.h. */
| #define PACKAGE_NAME ""
| #define PACKAGE_TARNAME ""
| #define PACKAGE_VERSION ""
| #define PACKAGE_STRING ""
| #define PACKAGE_BUGREPORT ""
| #define XINE_MAJOR 1
| #define XINE_MINOR 1
| #define XINE_SUB 3
| #define XINE_TEXTDOMAIN "libxine1"
| #define PACKAGE "xine-lib"
| #define VERSION "1.1.3"
| /* end confdefs.h. */
| #include <ac_nonexistent.h>
configure:5521: result: x86_64-pc-linux-gnu-gcc -E
configure:5550: x86_64-pc-linux-gnu-gcc -E conftest.c
configure:5556: $? = 0
configure:5594: x86_64-pc-linux-gnu-gcc -E conftest.c
conftest.c:14:28: ac_nonexistent.h: No such file or directory
configure:5600: $? = 1
configure: failed program was:
| /* confdefs.h. */
| #define PACKAGE_NAME ""
| #define PACKAGE_TARNAME ""
| #define PACKAGE_VERSION ""
| #define PACKAGE_STRING ""
| #define PACKAGE_BUGREPORT ""
| #define XINE_MAJOR 1
| #define XINE_MINOR 1
| #define XINE_SUB 3
| #define XINE_TEXTDOMAIN "libxine1"
| #define PACKAGE "xine-lib"
| #define VERSION "1.1.3"
| /* end confdefs.h. */
| #include <ac_nonexistent.h>
configure:5645: checking for ANSI C header files
configure:5675: x86_64-pc-linux-gnu-gcc -c -march=athlon64 -O2 -pipe -frename-registers -ffunction-sections conftest.c >&5
configure:5681: $? = 0
configure:5688: test -z "$ac_c_werror_flag" || test ! -s conftest.err
configure:5691: $? = 0
configure:5698: test -s conftest.o
configure:5701: $? = 0
configure:5797: x86_64-pc-linux-gnu-gcc -o conftest -march=athlon64 -O2 -pipe -frename-registers -ffunction-sections conftest.c >&5
configure:5800: $? = 0
configure:5806: ./conftest
configure:5809: $? = 0
configure:5826: result: yes
configure:5836: checking whether make sets $(MAKE)
configure:5857: result: yes
configure:5879: checking for a BSD-compatible install
configure:5935: result: /bin/install -c
configure:5946: checking whether ln -s works
configure:5950: result: yes
configure:5961: checking for gawk
configure:5988: result: gawk
configure:5999: checking for inline
configure:6025: x86_64-pc-linux-gnu-gcc -c -march=athlon64 -O2 -pipe -frename-registers -ffunction-sections conftest.c >&5
configure:6031: $? = 0
configure:6038: test -z "$ac_c_werror_flag" || test ! -s conftest.err
configure:6041: $? = 0
configure:6048: test -s conftest.o
configure:6051: $? = 0
configure:6066: result: inline
configure:6191: checking build system type
configure:6209: result: x86_64-pc-linux-gnu
configure:6231: checking host system type
configure:6246: result: x86_64-pc-linux-gnu
configure:6268: checking for a sed that does not truncate output
configure:6322: result: /bin/sed
configure:6336: checking for ld used by x86_64-pc-linux-gnu-gcc
configure:6403: result: /usr/x86_64-pc-linux-gnu/bin/ld
configure:6412: checking if the linker (/usr/x86_64-pc-linux-gnu/bin/ld) is GNU ld
configure:6427: result: yes
configure:6432: checking for /usr/x86_64-pc-linux-gnu/bin/ld option to reload object files
configure:6439: result: -r
configure:6457: checking for BSD-compatible nm
configure:6499: result: /usr/bin/x86_64-pc-linux-gnu-nm -B
configure:6503: checking how to recognise dependent libraries
configure:6675: result: pass_all
configure:6759: x86_64-pc-linux-gnu-gcc -c -march=athlon64 -O2 -pipe -frename-registers -ffunction-sections conftest.c >&5
configure:6762: $? = 0
configure:7200: checking for sys/types.h
configure:7221: x86_64-pc-linux-gnu-gcc -c -march=athlon64 -O2 -pipe -frename-registers -ffunction-sections conftest.c >&5
configure:7227: $? = 0
configure:7234: test -z "$ac_c_werror_flag" || test ! -s conftest.err
configure:7237: $? = 0
configure:7244: test -s conftest.o
configure:7247: $? = 0
configure:7260: result: yes
configure:7200: checking for sys/stat.h
configure:7221: x86_64-pc-linux-gnu-gcc -c -march=athlon64 -O2 -pipe -frename-registers -ffunction-sections conftest.c >&5
configure:7227: $? = 0
configure:7234: test -z "$ac_c_werror_flag" || test ! -s conftest.err
configure:7237: $? = 0
configure:7244: test -s conftest.o
configure:7247: $? = 0
configure:7260: result: yes
configure:7200: checking for stdlib.h
configure:7221: x86_64-pc-linux-gnu-gcc -c -march=athlon64 -O2 -pipe -frename-registers -ffunction-sections conftest.c >&5
configure:7227: $? = 0
configure:7234: test -z "$ac_c_werror_flag" || test ! -s conftest.err
configure:7237: $? = 0
configure:7244: test -s conftest.o
configure:7247: $? = 0
configure:7260: result: yes
configure:7200: checking for string.h
configure:7221: x86_64-pc-linux-gnu-gcc -c -march=athlon64 -O2 -pipe -frename-registers -ffunction-sections conftest.c >&5
configure:7227: $? = 0
configure:7234: test -z "$ac_c_werror_flag" || test ! -s conftest.err
configure:7237: $? = 0
configure:7244: test -s conftest.o
configure:7247: $? = 0
configure:7260: result: yes
configure:7200: checking for memory.h
configure:7221: x86_64-pc-linux-gnu-gcc -c -march=athlon64 -O2 -pipe -frename-registers -ffunction-sections conftest.c >&5
configure:7227: $? = 0
configure:7234: test -z "$ac_c_werror_flag" || test ! -s conftest.err
configure:7237: $? = 0
configure:7244: test -s conftest.o
configure:7247: $? = 0
configure:7260: result: yes
configure:7200: checking for strings.h
configure:7221: x86_64-pc-linux-gnu-gcc -c -march=athlon64 -O2 -pipe -frename-registers -ffunction-sections conftest.c >&5
configure:7227: $? = 0
configure:7234: test -z "$ac_c_werror_flag" || test ! -s conftest.err
configure:7237: $? = 0
configure:7244: test -s conftest.o
configure:7247: $? = 0
configure:7260: result: yes
configure:7200: checking for inttypes.h
configure:7221: x86_64-pc-linux-gnu-gcc -c -march=athlon64 -O2 -pipe -frename-registers -ffunction-sections conftest.c >&5
configure:7227: $? = 0
configure:7234: test -z "$ac_c_werror_flag" || test ! -s conftest.err
configure:7237: $? = 0
configure:7244: test -s conftest.o
configure:7247: $? = 0
configure:7260: result: yes
configure:7200: checking for stdint.h
configure:7221: x86_64-pc-linux-gnu-gcc -c -march=athlon64 -O2 -pipe -frename-registers -ffunction-sections conftest.c >&5
configure:7227: $? = 0
configure:7234: test -z "$ac_c_werror_flag" || test ! -s conftest.err
configure:7237: $? = 0
configure:7244: test -s conftest.o
configure:7247: $? = 0
configure:7260: result: yes
configure:7200: checking for unistd.h
configure:7221: x86_64-pc-linux-gnu-gcc -c -march=athlon64 -O2 -pipe -frename-registers -ffunction-sections conftest.c >&5
configure:7227: $? = 0
configure:7234: test -z "$ac_c_werror_flag" || test ! -s conftest.err
configure:7237: $? = 0
configure:7244: test -s conftest.o
configure:7247: $? = 0
configure:7260: result: yes
configure:7287: checking dlfcn.h usability
configure:7304: x86_64-pc-linux-gnu-gcc -c -march=athlon64 -O2 -pipe -frename-registers -ffunction-sections conftest.c >&5
configure:7310: $? = 0
configure:7317: test -z "$ac_c_werror_flag" || test ! -s conftest.err
configure:7320: $? = 0
configure:7327: test -s conftest.o
configure:7330: $? = 0
configure:7341: result: yes
configure:7345: checking dlfcn.h presence
configure:7360: x86_64-pc-linux-gnu-gcc -E conftest.c
configure:7366: $? = 0
configure:7387: result: yes
configure:7415: checking for dlfcn.h
configure:7423: result: yes
configure:7450: checking for x86_64-pc-linux-gnu-g++
configure:7466: found /usr/lib/ccache/bin/x86_64-pc-linux-gnu-g++
configure:7477: result: x86_64-pc-linux-gnu-g++
configure:7552: checking for C++ compiler version
configure:7559: x86_64-pc-linux-gnu-g++ --version >&5
x86_64-pc-linux-gnu-g++ (GCC) 3.4.4 (Gentoo 3.4.4-r1, ssp-3.4.4-1.0, pie-8.7.8)
Copyright (C) 2004 Free Software Foundation, Inc.
This is free software; see the source for copying conditions. There is NO
warranty; not even for MERCHANTABILITY or FITNESS FOR A PARTICULAR PURPOSE.
configure:7562: $? = 0
configure:7569: x86_64-pc-linux-gnu-g++ -v >&5
Reading specs from /usr/lib/gcc/x86_64-pc-linux-gnu/3.4.4/specs
Configured with: /var/tmp/portage/gcc-3.4.4-r1/work/gcc-3.4.4/configure --prefix=/usr --bindir=/usr/x86_64-pc-linux-gnu/gcc-bin/3.4.4 --includedir=/usr/lib/gcc/x86_64-pc-linux-gnu/3.4.4/include --datadir=/usr/share/gcc-data/x86_64-pc-linux-gnu/3.4.4 --mandir=/usr/share/gcc-data/x86_64-pc-linux-gnu/3.4.4/man --infodir=/usr/share/gcc-data/x86_64-pc-linux-gnu/3.4.4/info --with-gxx-include-dir=/usr/lib/gcc/x86_64-pc-linux-gnu/3.4.4/include/g++-v3 --host=x86_64-pc-linux-gnu --disable-altivec --enable-nls --without-included-gettext --with-system-zlib --disable-checking --disable-werror --disable-libunwind-exceptions --enable-multilib --disable-libgcj --enable-languages=c,c++,f77 --enable-shared --enable-threads=posix --enable-__cxa_atexit --enable-clocale=gnu
Thread model: posix
gcc version 3.4.4 (Gentoo 3.4.4-r1, ssp-3.4.4-1.0, pie-8.7.8)
configure:7572: $? = 0
configure:7579: x86_64-pc-linux-gnu-g++ -V >&5
x86_64-pc-linux-gnu-g++: `-V' option must have argument
configure:7582: $? = 1
configure:7585: checking whether we are using the GNU C++ compiler
configure:7614: x86_64-pc-linux-gnu-g++ -c -march=athlon64 -O2 -pipe -frename-registers -ffunction-sections conftest.cpp >&5
configure:7620: $? = 0
configure:7627: test -z "$ac_cxx_werror_flag" || test ! -s conftest.err
configure:7630: $? = 0
configure:7637: test -s conftest.o
configure:7640: $? = 0
configure:7654: result: yes
configure:7659: checking whether x86_64-pc-linux-gnu-g++ accepts -g
configure:7689: x86_64-pc-linux-gnu-g++ -c -g conftest.cpp >&5
configure:7695: $? = 0
configure:7702: test -z "$ac_cxx_werror_flag" || test ! -s conftest.err
configure:7705: $? = 0
configure:7712: test -s conftest.o
configure:7715: $? = 0
configure:7845: result: yes
configure:7870: checking dependency style of x86_64-pc-linux-gnu-g++
configure:7960: result: none
configure:7987: checking how to run the C++ preprocessor
configure:8023: x86_64-pc-linux-gnu-g++ -E conftest.cpp
configure:8029: $? = 0
configure:8067: x86_64-pc-linux-gnu-g++ -E conftest.cpp
conftest.cpp:25:28: ac_nonexistent.h: No such file or directory
configure:8073: $? = 1
configure: failed program was:
| /* confdefs.h. */
| #define PACKAGE_NAME ""
| #define PACKAGE_TARNAME ""
| #define PACKAGE_VERSION ""
| #define PACKAGE_STRING ""
| #define PACKAGE_BUGREPORT ""
| #define XINE_MAJOR 1
| #define XINE_MINOR 1
| #define XINE_SUB 3
| #define XINE_TEXTDOMAIN "libxine1"
| #define PACKAGE "xine-lib"
| #define VERSION "1.1.3"
| #define STDC_HEADERS 1
| #define HAVE_SYS_TYPES_H 1
| #define HAVE_SYS_STAT_H 1
| #define HAVE_STDLIB_H 1
| #define HAVE_STRING_H 1
| #define HAVE_MEMORY_H 1
| #define HAVE_STRINGS_H 1
| #define HAVE_INTTYPES_H 1
| #define HAVE_STDINT_H 1
| #define HAVE_UNISTD_H 1
| #define HAVE_DLFCN_H 1
| /* end confdefs.h. */
| #include <ac_nonexistent.h>
configure:8113: result: x86_64-pc-linux-gnu-g++ -E
configure:8142: x86_64-pc-linux-gnu-g++ -E conftest.cpp
configure:8148: $? = 0
configure:8186: x86_64-pc-linux-gnu-g++ -E conftest.cpp
conftest.cpp:25:28: ac_nonexistent.h: No such file or directory
configure:8192: $? = 1
configure: failed program was:
| /* confdefs.h. */
| #define PACKAGE_NAME ""
| #define PACKAGE_TARNAME ""
| #define PACKAGE_VERSION ""
| #define PACKAGE_STRING ""
| #define PACKAGE_BUGREPORT ""
| #define XINE_MAJOR 1
| #define XINE_MINOR 1
| #define XINE_SUB 3
| #define XINE_TEXTDOMAIN "libxine1"
| #define PACKAGE "xine-lib"
| #define VERSION "1.1.3"
| #define STDC_HEADERS 1
| #define HAVE_SYS_TYPES_H 1
| #define HAVE_SYS_STAT_H 1
| #define HAVE_STDLIB_H 1
| #define HAVE_STRING_H 1
| #define HAVE_MEMORY_H 1
| #define HAVE_STRINGS_H 1
| #define HAVE_INTTYPES_H 1
| #define HAVE_STDINT_H 1
| #define HAVE_UNISTD_H 1
| #define HAVE_DLFCN_H 1
| /* end confdefs.h. */
| #include <ac_nonexistent.h>
configure:8245: checking the maximum length of command line arguments
configure:8337: result: 32768
configure:8348: checking command to parse /usr/bin/x86_64-pc-linux-gnu-nm -B output from x86_64-pc-linux-gnu-gcc object
configure:8444: x86_64-pc-linux-gnu-g++ -c -march=athlon64 -O2 -pipe -frename-registers -ffunction-sections conftest.cpp >&5
configure:8447: $? = 0
configure:8451: /usr/bin/x86_64-pc-linux-gnu-nm -B conftest.o \| sed -n -e 's/^.*[ ]\([ABCDGIRSTW][ABCDGIRSTW]*\)[ ][ ]*\([_A-Za-z][_A-Za-z0-9]*\)$/\1 \2 \2/p' \> conftest.nm
configure:8454: $? = 0
configure:8506: x86_64-pc-linux-gnu-g++ -o conftest -march=athlon64 -O2 -pipe -frename-registers -ffunction-sections conftest.cpp conftstm.o >&5
configure:8509: $? = 0
configure:8547: result: ok
configure:8551: checking for objdir
configure:8566: result: .libs
configure:8618: checking for x86_64-pc-linux-gnu-ar
configure:8634: found /usr/bin/x86_64-pc-linux-gnu-ar
configure:8645: result: x86_64-pc-linux-gnu-ar
configure:8714: checking for x86_64-pc-linux-gnu-ranlib
configure:8730: found /usr/bin/x86_64-pc-linux-gnu-ranlib
configure:8741: result: x86_64-pc-linux-gnu-ranlib
configure:8810: checking for x86_64-pc-linux-gnu-strip
configure:8826: found /usr/bin/x86_64-pc-linux-gnu-strip
configure:8837: result: x86_64-pc-linux-gnu-strip
configure:9178: checking if x86_64-pc-linux-gnu-gcc static flag works
configure:9206: result: yes
configure:9228: checking if x86_64-pc-linux-gnu-gcc supports -fno-rtti -fno-exceptions
configure:9246: x86_64-pc-linux-gnu-gcc -c -march=athlon64 -O2 -pipe -frename-registers -ffunction-sections -fno-rtti -fno-exceptions conftest.c >&5
cc1: warning: command line option "-fno-rtti" is valid for C++/ObjC++ but not for C
cc1: warning: command line option "-fno-rtti" is valid for C++/ObjC++ but not for C
configure:9250: $? = 0
configure:9263: result: no
configure:9278: checking for x86_64-pc-linux-gnu-gcc option to produce PIC
configure:9482: result: -fPIC
configure:9490: checking if x86_64-pc-linux-gnu-gcc PIC flag -fPIC works
configure:9508: x86_64-pc-linux-gnu-gcc -c -march=athlon64 -O2 -pipe -frename-registers -ffunction-sections -fPIC -DPIC conftest.c >&5
configure:9512: $? = 0
configure:9525: result: yes
configure:9549: checking if x86_64-pc-linux-gnu-gcc supports -c -o file.o
configure:9570: x86_64-pc-linux-gnu-gcc -c -march=athlon64 -O2 -pipe -frename-registers -ffunction-sections -o out/conftest2.o conftest.c >&5
configure:9574: $? = 0
configure:9596: result: yes
configure:9622: checking whether the x86_64-pc-linux-gnu-gcc linker (/usr/x86_64-pc-linux-gnu/bin/ld -m elf_x86_64) supports shared libraries
configure:10546: result: yes
configure:10572: checking whether -lc should be explicitly linked in
configure:10577: x86_64-pc-linux-gnu-gcc -c -march=athlon64 -O2 -pipe -frename-registers -ffunction-sections conftest.c >&5
configure:10580: $? = 0
configure:10594: x86_64-pc-linux-gnu-gcc -shared conftest.o -v -Wl,-soname -Wl,conftest -o conftest 2\>\&1 \| grep -lc \>/dev/null 2\>\&1
configure:10597: $? = 0
configure:10609: result: no
configure:10617: checking dynamic linker characteristics
configure:11163: result: GNU/Linux ld.so
configure:11167: checking how to hardcode library paths into programs
configure:11192: result: immediate
configure:11206: checking whether stripping libraries is possible
configure:11211: result: yes
configure:11350: checking for shl_load
configure:11406: x86_64-pc-linux-gnu-gcc -o conftest -march=athlon64 -O2 -pipe -frename-registers -ffunction-sections conftest.c >&5
/var/tmp/portage/xine-lib-1.1.3_pre20060914/temp/ccEWvhKz.o: In function `main':
conftest.c:(.text.main+0x7): undefined reference to `shl_load'
collect2: ld returned 1 exit status
configure:11412: $? = 1
configure: failed program was:
| /* confdefs.h. */
| #define PACKAGE_NAME ""
| #define PACKAGE_TARNAME ""
| #define PACKAGE_VERSION ""
| #define PACKAGE_STRING ""
| #define PACKAGE_BUGREPORT ""
| #define XINE_MAJOR 1
| #define XINE_MINOR 1
| #define XINE_SUB 3
| #define XINE_TEXTDOMAIN "libxine1"
| #define PACKAGE "xine-lib"
| #define VERSION "1.1.3"
| #define STDC_HEADERS 1
| #define HAVE_SYS_TYPES_H 1
| #define HAVE_SYS_STAT_H 1
| #define HAVE_STDLIB_H 1
| #define HAVE_STRING_H 1
| #define HAVE_MEMORY_H 1
| #define HAVE_STRINGS_H 1
| #define HAVE_INTTYPES_H 1
| #define HAVE_STDINT_H 1
| #define HAVE_UNISTD_H 1
| #define HAVE_DLFCN_H 1
| /* end confdefs.h. */
| /* Define shl_load to an innocuous variant, in case <limits.h> declares shl_load.
| For example, HP-UX 11i <limits.h> declares gettimeofday. */
| #define shl_load innocuous_shl_load
|
| /* System header to define __stub macros and hopefully few prototypes,
| which can conflict with char shl_load (); below.
| Prefer <limits.h> to <assert.h> if __STDC__ is defined, since
| <limits.h> exists even on freestanding compilers. */
|
| #ifdef __STDC__
| # include <limits.h>
| #else
| # include <assert.h>
| #endif
|
| #undef shl_load
|
| /* Override any GCC internal prototype to avoid an error.
| Use char because int might match the return type of a GCC
| builtin and then its argument prototype would still apply. */
| #ifdef __cplusplus
| extern "C"
| #endif
| char shl_load ();
| /* The GNU C library defines this for functions which it implements
| to always fail with ENOSYS. Some functions are actually named
| something starting with __ and the normal name is an alias. */
| #if defined __stub_shl_load || defined __stub___shl_load
| choke me
| #endif
|
| int
| main ()
| {
| return shl_load ();
| ;
| return 0;
| }
configure:11445: result: no
configure:11450: checking for shl_load in -ldld
configure:11485: x86_64-pc-linux-gnu-gcc -o conftest -march=athlon64 -O2 -pipe -frename-registers -ffunction-sections conftest.c -ldld >&5
/usr/lib/gcc/x86_64-pc-linux-gnu/3.4.4/../../../../x86_64-pc-linux-gnu/bin/ld: cannot find -ldld
collect2: ld returned 1 exit status
configure:11491: $? = 1
configure: failed program was:
| /* confdefs.h. */
| #define PACKAGE_NAME ""
| #define PACKAGE_TARNAME ""
| #define PACKAGE_VERSION ""
| #define PACKAGE_STRING ""
| #define PACKAGE_BUGREPORT ""
| #define XINE_MAJOR 1
| #define XINE_MINOR 1
| #define XINE_SUB 3
| #define XINE_TEXTDOMAIN "libxine1"
| #define PACKAGE "xine-lib"
| #define VERSION "1.1.3"
| #define STDC_HEADERS 1
| #define HAVE_SYS_TYPES_H 1
| #define HAVE_SYS_STAT_H 1
| #define HAVE_STDLIB_H 1
| #define HAVE_STRING_H 1
| #define HAVE_MEMORY_H 1
| #define HAVE_STRINGS_H 1
| #define HAVE_INTTYPES_H 1
| #define HAVE_STDINT_H 1
| #define HAVE_UNISTD_H 1
| #define HAVE_DLFCN_H 1
| /* end confdefs.h. */
|
| /* Override any GCC internal prototype to avoid an error.
| Use char because int might match the return type of a GCC
| builtin and then its argument prototype would still apply. */
| #ifdef __cplusplus
| extern "C"
| #endif
| char shl_load ();
| int
| main ()
| {
| return shl_load ();
| ;
| return 0;
| }
configure:11525: result: no
configure:11530: checking for dlopen
configure:11586: x86_64-pc-linux-gnu-gcc -o conftest -march=athlon64 -O2 -pipe -frename-registers -ffunction-sections conftest.c >&5
/var/tmp/portage/xine-lib-1.1.3_pre20060914/temp/ccKi0GoH.o: In function `main':
conftest.c:(.text.main+0x7): undefined reference to `dlopen'
collect2: ld returned 1 exit status
configure:11592: $? = 1
configure: failed program was:
| /* confdefs.h. */
| #define PACKAGE_NAME ""
| #define PACKAGE_TARNAME ""
| #define PACKAGE_VERSION ""
| #define PACKAGE_STRING ""
| #define PACKAGE_BUGREPORT ""
| #define XINE_MAJOR 1
| #define XINE_MINOR 1
| #define XINE_SUB 3
| #define XINE_TEXTDOMAIN "libxine1"
| #define PACKAGE "xine-lib"
| #define VERSION "1.1.3"
| #define STDC_HEADERS 1
| #define HAVE_SYS_TYPES_H 1
| #define HAVE_SYS_STAT_H 1
| #define HAVE_STDLIB_H 1
| #define HAVE_STRING_H 1
| #define HAVE_MEMORY_H 1
| #define HAVE_STRINGS_H 1
| #define HAVE_INTTYPES_H 1
| #define HAVE_STDINT_H 1
| #define HAVE_UNISTD_H 1
| #define HAVE_DLFCN_H 1
| /* end confdefs.h. */
| /* Define dlopen to an innocuous variant, in case <limits.h> declares dlopen.
| For example, HP-UX 11i <limits.h> declares gettimeofday. */
| #define dlopen innocuous_dlopen
|
| /* System header to define __stub macros and hopefully few prototypes,
| which can conflict with char dlopen (); below.
| Prefer <limits.h> to <assert.h> if __STDC__ is defined, since
| <limits.h> exists even on freestanding compilers. */
|
| #ifdef __STDC__
| # include <limits.h>
| #else
| # include <assert.h>
| #endif
|
| #undef dlopen
|
| /* Override any GCC internal prototype to avoid an error.
| Use char because int might match the return type of a GCC
| builtin and then its argument prototype would still apply. */
| #ifdef __cplusplus
| extern "C"
| #endif
| char dlopen ();
| /* The GNU C library defines this for functions which it implements
| to always fail with ENOSYS. Some functions are actually named
| something starting with __ and the normal name is an alias. */
| #if defined __stub_dlopen || defined __stub___dlopen
| choke me
| #endif
|
| int
| main ()
| {
| return dlopen ();
| ;
| return 0;
| }
configure:11625: result: no
configure:11630: checking for dlopen in -ldl
configure:11665: x86_64-pc-linux-gnu-gcc -o conftest -march=athlon64 -O2 -pipe -frename-registers -ffunction-sections conftest.c -ldl >&5
configure:11671: $? = 0
configure:11678: test -z "$ac_c_werror_flag" || test ! -s conftest.err
configure:11681: $? = 0
configure:11688: test -s conftest
configure:11691: $? = 0
configure:11705: result: yes
configure:11906: checking whether a program can dlopen itself
configure:11978: x86_64-pc-linux-gnu-gcc -o conftest -march=athlon64 -O2 -pipe -frename-registers -ffunction-sections -DHAVE_DLFCN_H -Wl,--export-dynamic conftest.c -ldl >&5
configure:11981: $? = 0
configure:11999: result: yes
configure:12004: checking whether a statically linked program can dlopen itself
configure:12076: x86_64-pc-linux-gnu-gcc -o conftest -march=athlon64 -O2 -pipe -frename-registers -ffunction-sections -DHAVE_DLFCN_H -Wl,--export-dynamic conftest.c -ldl >&5
configure:12079: $? = 0
configure:12097: result: yes
configure:12120: checking if libtool supports shared libraries
configure:12122: result: yes
configure:12125: checking whether to build shared libraries
configure:12146: result: yes
configure:12149: checking whether to build static libraries
configure:12153: result: no
configure:12245: creating libtool
configure:12823: checking for ld used by x86_64-pc-linux-gnu-g++
configure:12890: result: /usr/x86_64-pc-linux-gnu/bin/ld -m elf_x86_64
configure:12899: checking if the linker (/usr/x86_64-pc-linux-gnu/bin/ld -m elf_x86_64) is GNU ld
configure:12914: result: yes
configure:12965: checking whether the x86_64-pc-linux-gnu-g++ linker (/usr/x86_64-pc-linux-gnu/bin/ld -m elf_x86_64) supports shared libraries
configure:13880: result: yes
configure:13902: x86_64-pc-linux-gnu-g++ -c -march=athlon64 -O2 -pipe -frename-registers -ffunction-sections conftest.cc >&5
configure:13905: $? = 0
configure:14001: checking for x86_64-pc-linux-gnu-g++ option to produce PIC
configure:14269: result: -fPIC
configure:14277: checking if x86_64-pc-linux-gnu-g++ PIC flag -fPIC works
configure:14295: x86_64-pc-linux-gnu-g++ -c -march=athlon64 -O2 -pipe -frename-registers -ffunction-sections -fPIC -DPIC conftest.cc >&5
configure:14299: $? = 0
configure:14312: result: yes
configure:14336: checking if x86_64-pc-linux-gnu-g++ supports -c -o file.o
configure:14357: x86_64-pc-linux-gnu-g++ -c -march=athlon64 -O2 -pipe -frename-registers -ffunction-sections -o out/conftest2.o conftest.cc >&5
configure:14361: $? = 0
configure:14383: result: yes
configure:14409: checking whether the x86_64-pc-linux-gnu-g++ linker (/usr/x86_64-pc-linux-gnu/bin/ld -m elf_x86_64) supports shared libraries
configure:14434: result: yes
configure:14505: checking dynamic linker characteristics
configure:15051: result: GNU/Linux ld.so
configure:15055: checking how to hardcode library paths into programs
configure:15080: result: immediate
configure:15094: checking whether stripping libraries is possible
configure:15099: result: yes
configure:15238: checking for shl_load
configure:15333: result: no
configure:15338: checking for shl_load in -ldld
configure:15413: result: no
configure:15418: checking for dlopen
configure:15513: result: no
configure:15518: checking for dlopen in -ldl
configure:15593: result: yes
configure:15794: checking whether a program can dlopen itself
configure:15887: result: yes
configure:15892: checking whether a statically linked program can dlopen itself
configure:15985: result: yes
configure:22952: checking for ld used by GCC
configure:23016: result: /usr/x86_64-pc-linux-gnu/bin/ld -m elf_x86_64
configure:23025: checking if the linker (/usr/x86_64-pc-linux-gnu/bin/ld -m elf_x86_64) is GNU ld
configure:23038: result: yes
configure:23045: checking for shared library run path origin
configure:23058: result: done
configure:23501: checking for iconv
configure:23533: x86_64-pc-linux-gnu-gcc -o conftest -march=athlon64 -O2 -pipe -frename-registers -ffunction-sections conftest.c >&5
configure:23539: $? = 0
configure:23546: test -z "$ac_c_werror_flag" || test ! -s conftest.err
configure:23549: $? = 0
configure:23556: test -s conftest
configure:23559: $? = 0
configure:23641: result: yes
configure:23664: checking for iconv declaration
configure:23703: x86_64-pc-linux-gnu-gcc -c -march=athlon64 -O2 -pipe -frename-registers -ffunction-sections conftest.c >&5
configure:23709: $? = 0
configure:23716: test -z "$ac_c_werror_flag" || test ! -s conftest.err
configure:23719: $? = 0
configure:23726: test -s conftest.o
configure:23729: $? = 0
configure:23745: result:
extern size_t iconv (iconv_t cd, char * *inbuf, size_t *inbytesleft, char * *outbuf, size_t *outbytesleft);
configure:23805: checking whether NLS is requested
configure:23814: result: yes
configure:23852: checking for msgfmt
configure: trying /usr/bin/msgfmt...
0 translated messages.
configure:23884: result: /usr/bin/msgfmt
configure:23893: checking for gmsgfmt
configure:23911: found /usr/bin/gmsgfmt
configure:23924: result: /usr/bin/gmsgfmt
configure:23964: checking for xgettext
configure: trying /usr/bin/xgettext...
/usr/bin/xgettext: warning: file `/dev/null' extension `' is unknown; will try C
configure:23996: result: /usr/bin/xgettext
configure:24036: checking for msgmerge
configure: trying /usr/bin/msgmerge...
configure:24067: result: /usr/bin/msgmerge
configure:24118: checking for CFPreferencesCopyAppValue
configure:24148: x86_64-pc-linux-gnu-gcc -o conftest -march=athlon64 -O2 -pipe -frename-registers -ffunction-sections -I/System/Library/Frameworks/CoreFoundation.framework/Headers conftest.c -framework CoreFoundation >&5
x86_64-pc-linux-gnu-gcc: CoreFoundation: No such file or directory
cc1: error: unrecognized command line option "-framework"
configure:24154: $? = 1
configure: failed program was:
| /* confdefs.h. */
| #define PACKAGE_NAME ""
| #define PACKAGE_TARNAME ""
| #define PACKAGE_VERSION ""
| #define PACKAGE_STRING ""
| #define PACKAGE_BUGREPORT ""
| #define XINE_MAJOR 1
| #define XINE_MINOR 1
| #define XINE_SUB 3
| #define XINE_TEXTDOMAIN "libxine1"
| #define PACKAGE "xine-lib"
| #define VERSION "1.1.3"
| #define STDC_HEADERS 1
| #define HAVE_SYS_TYPES_H 1
| #define HAVE_SYS_STAT_H 1
| #define HAVE_STDLIB_H 1
| #define HAVE_STRING_H 1
| #define HAVE_MEMORY_H 1
| #define HAVE_STRINGS_H 1
| #define HAVE_INTTYPES_H 1
| #define HAVE_STDINT_H 1
| #define HAVE_UNISTD_H 1
| #define HAVE_DLFCN_H 1
| #define HAVE_ICONV 1
| #define ICONV_CONST
| /* end confdefs.h. */
| #include <CFPreferences.h>
| int
| main ()
| {
| CFPreferencesCopyAppValue(NULL, NULL)
| ;
| return 0;
| }
configure:24189: result: no
configure:24198: checking for CFLocaleCopyCurrent
configure:24228: x86_64-pc-linux-gnu-gcc -o conftest -march=athlon64 -O2 -pipe -frename-registers -ffunction-sections -I/System/Library/Frameworks/CoreFoundation.framework/Headers conftest.c -framework CoreFoundation >&5
x86_64-pc-linux-gnu-gcc: CoreFoundation: No such file or directory
cc1: error: unrecognized command line option "-framework"
configure:24234: $? = 1
configure: failed program was:
| /* confdefs.h. */
| #define PACKAGE_NAME ""
| #define PACKAGE_TARNAME ""
| #define PACKAGE_VERSION ""
| #define PACKAGE_STRING ""
| #define PACKAGE_BUGREPORT ""
| #define XINE_MAJOR 1
| #define XINE_MINOR 1
| #define XINE_SUB 3
| #define XINE_TEXTDOMAIN "libxine1"
| #define PACKAGE "xine-lib"
| #define VERSION "1.1.3"
| #define STDC_HEADERS 1
| #define HAVE_SYS_TYPES_H 1
| #define HAVE_SYS_STAT_H 1
| #define HAVE_STDLIB_H 1
| #define HAVE_STRING_H 1
| #define HAVE_MEMORY_H 1
| #define HAVE_STRINGS_H 1
| #define HAVE_INTTYPES_H 1
| #define HAVE_STDINT_H 1
| #define HAVE_UNISTD_H 1
| #define HAVE_DLFCN_H 1
| #define HAVE_ICONV 1
| #define ICONV_CONST
| /* end confdefs.h. */
| #include <CFLocale.h>
| int
| main ()
| {
| CFLocaleCopyCurrent();
| ;
| return 0;
| }
configure:24269: result: no
configure:24286: checking whether NLS is requested
configure:24295: result: yes
configure:24313: checking for GNU gettext in libc
configure:24342: x86_64-pc-linux-gnu-gcc -o conftest -march=athlon64 -O2 -pipe -frename-registers -ffunction-sections conftest.c >&5
configure:24348: $? = 0
configure:24355: test -z "$ac_c_werror_flag" || test ! -s conftest.err
configure:24358: $? = 0
configure:24365: test -s conftest
configure:24368: $? = 0
configure:24381: result: yes
configure:25143: checking whether to use NLS
configure:25145: result: yes
configure:25148: checking where the gettext function comes from
configure:25159: result: libc
configure:25222: checking for plural forms in GNU msgfmt
configure:25235: result: yes
configure:25252: checking for nl_langinfo
configure:25308: x86_64-pc-linux-gnu-gcc -o conftest -march=athlon64 -O2 -pipe -frename-registers -ffunction-sections conftest.c >&5
configure:25314: $? = 0
configure:25321: test -z "$ac_c_werror_flag" || test ! -s conftest.err
configure:25324: $? = 0
configure:25331: test -s conftest
configure:25334: $? = 0
configure:25348: result: yes
configure:25360: checking whether byte ordering is bigendian
configure:25392: x86_64-pc-linux-gnu-gcc -c -march=athlon64 -O2 -pipe -frename-registers -ffunction-sections conftest.c >&5
configure:25398: $? = 0
configure:25405: test -z "$ac_c_werror_flag" || test ! -s conftest.err
configure:25408: $? = 0
configure:25415: test -s conftest.o
configure:25418: $? = 0
configure:25447: x86_64-pc-linux-gnu-gcc -c -march=athlon64 -O2 -pipe -frename-registers -ffunction-sections conftest.c >&5
conftest.c: In function `main':
conftest.c:38: error: `not' undeclared (first use in this function)
conftest.c:38: error: (Each undeclared identifier is reported only once
conftest.c:38: error: for each function it appears in.)
conftest.c:38: error: parse error before "big"
configure:25453: $? = 1
configure: failed program was:
| /* confdefs.h. */
| #define PACKAGE_NAME ""
| #define PACKAGE_TARNAME ""
| #define PACKAGE_VERSION ""
| #define PACKAGE_STRING ""
| #define PACKAGE_BUGREPORT ""
| #define XINE_MAJOR 1
| #define XINE_MINOR 1
| #define XINE_SUB 3
| #define XINE_TEXTDOMAIN "libxine1"
| #define PACKAGE "xine-lib"
| #define VERSION "1.1.3"
| #define STDC_HEADERS 1
| #define HAVE_SYS_TYPES_H 1
| #define HAVE_SYS_STAT_H 1
| #define HAVE_STDLIB_H 1
| #define HAVE_STRING_H 1
| #define HAVE_MEMORY_H 1
| #define HAVE_STRINGS_H 1
| #define HAVE_INTTYPES_H 1
| #define HAVE_STDINT_H 1
| #define HAVE_UNISTD_H 1
| #define HAVE_DLFCN_H 1
| #define HAVE_ICONV 1
| #define ICONV_CONST
| #define ENABLE_NLS 1
| #define HAVE_GETTEXT 1
| #define HAVE_DCGETTEXT 1
| #define HAVE_NL_LANGINFO 1
| /* end confdefs.h. */
| #include <sys/types.h>
| #include <sys/param.h>
|
| int
| main ()
| {
| #if BYTE_ORDER != BIG_ENDIAN
| not big endian
| #endif
|
| ;
| return 0;
| }
configure:25627: result: no
configure:25646: checking for an ANSI C-conforming const
configure:25721: x86_64-pc-linux-gnu-gcc -c -march=athlon64 -O2 -pipe -frename-registers -ffunction-sections conftest.c >&5
configure:25727: $? = 0
configure:25734: test -z "$ac_c_werror_flag" || test ! -s conftest.err
configure:25737: $? = 0
configure:25744: test -s conftest.o
configure:25747: $? = 0
configure:25759: result: yes
configure:25769: checking for off_t
configure:25799: x86_64-pc-linux-gnu-gcc -c -march=athlon64 -O2 -pipe -frename-registers -ffunction-sections conftest.c >&5
configure:25805: $? = 0
configure:25812: test -z "$ac_c_werror_flag" || test ! -s conftest.err
configure:25815: $? = 0
configure:25822: test -s conftest.o
configure:25825: $? = 0
configure:25837: result: yes
configure:25849: checking for size_t
configure:25879: x86_64-pc-linux-gnu-gcc -c -march=athlon64 -O2 -pipe -frename-registers -ffunction-sections conftest.c >&5
configure:25885: $? = 0
configure:25892: test -z "$ac_c_werror_flag" || test ! -s conftest.err
configure:25895: $? = 0
configure:25902: test -s conftest.o
configure:25905: $? = 0
configure:25917: result: yes
configure:25929: checking for long
configure:25959: x86_64-pc-linux-gnu-gcc -c -march=athlon64 -O2 -pipe -frename-registers -ffunction-sections conftest.c >&5
configure:25965: $? = 0
configure:25972: test -z "$ac_c_werror_flag" || test ! -s conftest.err
configure:25975: $? = 0
configure:25982: test -s conftest.o
configure:25985: $? = 0
configure:25997: result: yes
configure:26000: checking size of long
configure:26388: x86_64-pc-linux-gnu-gcc -o conftest -march=athlon64 -O2 -pipe -frename-registers -ffunction-sections conftest.c >&5
configure:26391: $? = 0
configure:26397: ./conftest
configure:26400: $? = 0
configure:26422: result: 8
configure:26430: checking for inttypes.h
configure:26435: result: yes
configure:27166: checking for ssize_t
configure:27196: x86_64-pc-linux-gnu-gcc -c -march=athlon64 -O2 -pipe -frename-registers -ffunction-sections conftest.c >&5
configure:27202: $? = 0
configure:27209: test -z "$ac_c_werror_flag" || test ! -s conftest.err
configure:27212: $? = 0
configure:27219: test -s conftest.o
configure:27222: $? = 0
configure:27234: result: yes
configure:27287: checking for pthread_create in -lpthread
configure:27322: x86_64-pc-linux-gnu-gcc -o conftest -march=athlon64 -O2 -pipe -frename-registers -ffunction-sections conftest.c -lpthread -lpthread >&5
configure:27328: $? = 0
configure:27335: test -z "$ac_c_werror_flag" || test ! -s conftest.err
configure:27338: $? = 0
configure:27345: test -s conftest
configure:27348: $? = 0
configure:27362: result: yes
configure:27382: checking for recursive mutex support in pthread
configure:27413: x86_64-pc-linux-gnu-gcc -c -march=athlon64 -O2 -pipe -frename-registers -ffunction-sections conftest.c >&5
configure:27419: $? = 0
configure:27426: test -z "$ac_c_werror_flag" || test ! -s conftest.err
configure:27429: $? = 0
configure:27436: test -s conftest.o
configure:27439: $? = 0
configure:27458: result: yes
configure:27513: checking for dlopen in -lc
configure:27548: x86_64-pc-linux-gnu-gcc -o conftest -march=athlon64 -O2 -pipe -frename-registers -ffunction-sections conftest.c -lc >&5
/var/tmp/portage/xine-lib-1.1.3_pre20060914/temp/ccrHhVFI.o: In function `main':
conftest.c:(.text.main+0x7): undefined reference to `dlopen'
collect2: ld returned 1 exit status
configure:27554: $? = 1
configure: failed program was:
| /* confdefs.h. */
| #define PACKAGE_NAME ""
| #define PACKAGE_TARNAME ""
| #define PACKAGE_VERSION ""
| #define PACKAGE_STRING ""
| #define PACKAGE_BUGREPORT ""
| #define XINE_MAJOR 1
| #define XINE_MINOR 1
| #define XINE_SUB 3
| #define XINE_TEXTDOMAIN "libxine1"
| #define PACKAGE "xine-lib"
| #define VERSION "1.1.3"
| #define STDC_HEADERS 1
| #define HAVE_SYS_TYPES_H 1
| #define HAVE_SYS_STAT_H 1
| #define HAVE_STDLIB_H 1
| #define HAVE_STRING_H 1
| #define HAVE_MEMORY_H 1
| #define HAVE_STRINGS_H 1
| #define HAVE_INTTYPES_H 1
| #define HAVE_STDINT_H 1
| #define HAVE_UNISTD_H 1
| #define HAVE_DLFCN_H 1
| #define HAVE_ICONV 1
| #define ICONV_CONST
| #define ENABLE_NLS 1
| #define HAVE_GETTEXT 1
| #define HAVE_DCGETTEXT 1
| #define HAVE_NL_LANGINFO 1
| #define SIZEOF_LONG 8
| #define _GNU_SOURCE 1
| /* end confdefs.h. */
|
| /* Override any GCC internal prototype to avoid an error.
| Use char because int might match the return type of a GCC
| builtin and then its argument prototype would still apply. */
| #ifdef __cplusplus
| extern "C"
| #endif
| char dlopen ();
| int
| main ()
| {
| return dlopen ();
| ;
| return 0;
| }
configure:27588: result: no
configure:27597: checking for dlopen in -ldl
configure:27672: result: yes
configure:27779: checking libdir name
configure:27786: x86_64-pc-linux-gnu-gcc -c -march=athlon64 -O2 -pipe -frename-registers -ffunction-sections conftest.c >&5
configure:27789: $? = 0
configure:27809: result: lib64
configure:27830: checking for x86_64-pc-linux-gnu-pkg-config
configure:27863: result: no
configure:27873: checking for pkg-config
configure:27891: found /usr/bin/pkg-config
configure:27903: result: /usr/bin/pkg-config
configure:27932: checking pkg-config is at least version 0.9.0
configure:27935: result: yes
configure:27946: checking for FFMPEG
configure:27954: $PKG_CONFIG --exists --print-errors "libavcodec >= 51.11.0"
configure:27957: $? = 0
configure:27972: $PKG_CONFIG --exists --print-errors "libavcodec >= 51.11.0"
configure:27975: $? = 0
configure:28051: result: yes
configure:28057: checking for FFMPEG_POSTPROC
configure:28065: $PKG_CONFIG --exists --print-errors "libpostproc >= 51.11.0"
configure:28068: $? = 0
configure:28083: $PKG_CONFIG --exists --print-errors "libpostproc >= 51.11.0"
configure:28086: $? = 0
configure:28162: result: yes
configure:28183:
*********************************************************************
xine is configured with external ffmpeg.
This requires the same version of ffmpeg what is included in xine and
you should know what you do. If some problems occur, please try to
use internal ffmpeg.
*********************************************************************
configure:28293: checking whether lrintf is declared
configure:28327: x86_64-pc-linux-gnu-gcc -c -march=athlon64 -O2 -pipe -frename-registers -ffunction-sections conftest.c >&5
configure:28333: $? = 0
configure:28340: test -z "$ac_c_werror_flag" || test ! -s conftest.err
configure:28343: $? = 0
configure:28350: test -s conftest.o
configure:28353: $? = 0
configure:28365: result: yes
configure:28382: checking whether rintf is declared
configure:28415: x86_64-pc-linux-gnu-gcc -c -march=athlon64 -O2 -pipe -frename-registers -ffunction-sections conftest.c >&5
configure:28421: $? = 0
configure:28428: test -z "$ac_c_werror_flag" || test ! -s conftest.err
configure:28431: $? = 0
configure:28438: test -s conftest.o
configure:28441: $? = 0
configure:28453: result: yes
configure:28497: checking for mlib_VideoAddBlock_U8_S16 in -lmlib
configure:28532: x86_64-pc-linux-gnu-gcc -o conftest -march=athlon64 -O2 -pipe -frename-registers -ffunction-sections conftest.c -lmlib -L/opt/SUNWmlib/lib >&5
/usr/lib/gcc/x86_64-pc-linux-gnu/3.4.4/../../../../x86_64-pc-linux-gnu/bin/ld: cannot find -lmlib
collect2: ld returned 1 exit status
configure:28538: $? = 1
configure: failed program was:
| /* confdefs.h. */
| #define PACKAGE_NAME ""
| #define PACKAGE_TARNAME ""
| #define PACKAGE_VERSION ""
| #define PACKAGE_STRING ""
| #define PACKAGE_BUGREPORT ""
| #define XINE_MAJOR 1
| #define XINE_MINOR 1
| #define XINE_SUB 3
| #define XINE_TEXTDOMAIN "libxine1"
| #define PACKAGE "xine-lib"
| #define VERSION "1.1.3"
| #define STDC_HEADERS 1
| #define HAVE_SYS_TYPES_H 1
| #define HAVE_SYS_STAT_H 1
| #define HAVE_STDLIB_H 1
| #define HAVE_STRING_H 1
| #define HAVE_MEMORY_H 1
| #define HAVE_STRINGS_H 1
| #define HAVE_INTTYPES_H 1
| #define HAVE_STDINT_H 1
| #define HAVE_UNISTD_H 1
| #define HAVE_DLFCN_H 1
| #define HAVE_ICONV 1
| #define ICONV_CONST
| #define ENABLE_NLS 1
| #define HAVE_GETTEXT 1
| #define HAVE_DCGETTEXT 1
| #define HAVE_NL_LANGINFO 1
| #define SIZEOF_LONG 8
| #define _GNU_SOURCE 1
| #define HAVE_FFMPEG 1
| #define HAVE_LRINTF 1
| #define _ISOC9X_SOURCE 1
| #define HAVE_RINTF 1
| /* end confdefs.h. */
|
| /* Override any GCC internal prototype to avoid an error.
| Use char because int might match the return type of a GCC
| builtin and then its argument prototype would still apply. */
| #ifdef __cplusplus
| extern "C"
| #endif
| char mlib_VideoAddBlock_U8_S16 ();
| int
| main ()
| {
| return mlib_VideoAddBlock_U8_S16 ();
| ;
| return 0;
| }
configure:28572: result: no
configure:28778: checking for X
configure:28893: x86_64-pc-linux-gnu-gcc -E conftest.c
configure:28899: $? = 0
configure:28955: x86_64-pc-linux-gnu-gcc -o conftest -march=athlon64 -O2 -pipe -frename-registers -ffunction-sections conftest.c -lXt >&5
configure:28961: $? = 0
configure:28968: test -z "$ac_c_werror_flag" || test ! -s conftest.err
configure:28971: $? = 0
configure:28978: test -s conftest
configure:28981: $? = 0
configure:29036: result: libraries , headers
configure:29239: x86_64-pc-linux-gnu-gcc -o conftest -march=athlon64 -O2 -pipe -frename-registers -ffunction-sections conftest.c -lX11 >&5
configure:29245: $? = 0
configure:29252: test -z "$ac_c_werror_flag" || test ! -s conftest.err
configure:29255: $? = 0
configure:29262: test -s conftest
configure:29265: $? = 0
configure:29450: checking for gethostbyname
configure:29506: x86_64-pc-linux-gnu-gcc -o conftest -march=athlon64 -O2 -pipe -frename-registers -ffunction-sections conftest.c >&5
configure:29512: $? = 0
configure:29519: test -z "$ac_c_werror_flag" || test ! -s conftest.err
configure:29522: $? = 0
configure:29529: test -s conftest
configure:29532: $? = 0
configure:29545: result: yes
configure:29722: checking for connect
configure:29778: x86_64-pc-linux-gnu-gcc -o conftest -march=athlon64 -O2 -pipe -frename-registers -ffunction-sections conftest.c >&5
configure:29784: $? = 0
configure:29791: test -z "$ac_c_werror_flag" || test ! -s conftest.err
configure:29794: $? = 0
configure:29801: test -s conftest
configure:29804: $? = 0
configure:29817: result: yes
configure:29905: checking for remove
configure:29961: x86_64-pc-linux-gnu-gcc -o conftest -march=athlon64 -O2 -pipe -frename-registers -ffunction-sections conftest.c >&5
configure:29967: $? = 0
configure:29974: test -z "$ac_c_werror_flag" || test ! -s conftest.err
configure:29977: $? = 0
configure:29984: test -s conftest
configure:29987: $? = 0
configure:30000: result: yes
configure:30088: checking for shmat
configure:30144: x86_64-pc-linux-gnu-gcc -o conftest -march=athlon64 -O2 -pipe -frename-registers -ffunction-sections conftest.c >&5
configure:30150: $? = 0
configure:30157: test -z "$ac_c_werror_flag" || test ! -s conftest.err
configure:30160: $? = 0
configure:30167: test -s conftest
configure:30170: $? = 0
configure:30183: result: yes
configure:30280: checking for IceConnectionNumber in -lICE
configure:30315: x86_64-pc-linux-gnu-gcc -o conftest -march=athlon64 -O2 -pipe -frename-registers -ffunction-sections conftest.c -lICE >&5
configure:30321: $? = 0
configure:30328: test -z "$ac_c_werror_flag" || test ! -s conftest.err
configure:30331: $? = 0
configure:30338: test -s conftest
configure:30341: $? = 0
configure:30355: result: yes
configure:30406: checking for socket in -lsocket
configure:30441: x86_64-pc-linux-gnu-gcc -o conftest -march=athlon64 -O2 -pipe -frename-registers -ffunction-sections conftest.c -lsocket >&5
/usr/lib/gcc/x86_64-pc-linux-gnu/3.4.4/../../../../x86_64-pc-linux-gnu/bin/ld: cannot find -lsocket
collect2: ld returned 1 exit status
configure:30447: $? = 1
configure: failed program was:
| /* confdefs.h. */
| #define PACKAGE_NAME ""
| #define PACKAGE_TARNAME ""
| #define PACKAGE_VERSION ""
| #define PACKAGE_STRING ""
| #define PACKAGE_BUGREPORT ""
| #define XINE_MAJOR 1
| #define XINE_MINOR 1
| #define XINE_SUB 3
| #define XINE_TEXTDOMAIN "libxine1"
| #define PACKAGE "xine-lib"
| #define VERSION "1.1.3"
| #define STDC_HEADERS 1
| #define HAVE_SYS_TYPES_H 1
| #define HAVE_SYS_STAT_H 1
| #define HAVE_STDLIB_H 1
| #define HAVE_STRING_H 1
| #define HAVE_MEMORY_H 1
| #define HAVE_STRINGS_H 1
| #define HAVE_INTTYPES_H 1
| #define HAVE_STDINT_H 1
| #define HAVE_UNISTD_H 1
| #define HAVE_DLFCN_H 1
| #define HAVE_ICONV 1
| #define ICONV_CONST
| #define ENABLE_NLS 1
| #define HAVE_GETTEXT 1
| #define HAVE_DCGETTEXT 1
| #define HAVE_NL_LANGINFO 1
| #define SIZEOF_LONG 8
| #define _GNU_SOURCE 1
| #define HAVE_FFMPEG 1
| #define HAVE_LRINTF 1
| #define _ISOC9X_SOURCE 1
| #define HAVE_RINTF 1
| #define HAVE_X11 1
| #define LIBX11_SO "libX11.so.6"
| #define LIBXV_SO "libXv.so.1"
| /* end confdefs.h. */
|
| /* Override any GCC internal prototype to avoid an error.
| Use char because int might match the return type of a GCC
| builtin and then its argument prototype would still apply. */
| #ifdef __cplusplus
| extern "C"
| #endif
| char socket ();
| int
| main ()
| {
| return socket ();
| ;
| return 0;
| }
configure:30481: result: no
configure:30487: checking for gethostbyname in -lnsl
configure:30522: x86_64-pc-linux-gnu-gcc -o conftest -march=athlon64 -O2 -pipe -frename-registers -ffunction-sections conftest.c -lnsl >&5
configure:30528: $? = 0
configure:30535: test -z "$ac_c_werror_flag" || test ! -s conftest.err
configure:30538: $? = 0
configure:30545: test -s conftest
configure:30548: $? = 0
configure:30562: result: yes
configure:30572: checking for socklen_t
configure:30610: x86_64-pc-linux-gnu-g++ -c -march=athlon64 -O2 -pipe -frename-registers -ffunction-sections conftest.cpp >&5
configure:30616: $? = 0
configure:30623: test -z "$ac_cxx_werror_flag" || test ! -s conftest.err
configure:30626: $? = 0
configure:30633: test -s conftest.o
configure:30636: $? = 0
configure:30721: result: socklen_t
configure:30770: checking for gzsetparams in -lz
configure:30805: x86_64-pc-linux-gnu-gcc -o conftest -march=athlon64 -O2 -pipe -frename-registers -ffunction-sections conftest.c -lz -lz >&5
configure:30811: $? = 0
configure:30818: test -z "$ac_c_werror_flag" || test ! -s conftest.err
configure:30821: $? = 0
configure:30828: test -s conftest
configure:30831: $? = 0
configure:30845: result: yes
configure:30858: checking zlib.h usability
configure:30875: x86_64-pc-linux-gnu-gcc -c -march=athlon64 -O2 -pipe -frename-registers -ffunction-sections conftest.c >&5
configure:30881: $? = 0
configure:30888: test -z "$ac_c_werror_flag" || test ! -s conftest.err
configure:30891: $? = 0
configure:30898: test -s conftest.o
configure:30901: $? = 0
configure:30912: result: yes
configure:30916: checking zlib.h presence
configure:30931: x86_64-pc-linux-gnu-gcc -E conftest.c
configure:30937: $? = 0
configure:30958: result: yes
configure:30986: checking for zlib.h
configure:30993: result: yes
configure:31018: checking for clock_getres in -lrt
configure:31053: x86_64-pc-linux-gnu-gcc -o conftest -march=athlon64 -O2 -pipe -frename-registers -ffunction-sections conftest.c -lrt >&5
configure:31059: $? = 0
configure:31066: test -z "$ac_c_werror_flag" || test ! -s conftest.err
configure:31069: $? = 0
configure:31076: test -s conftest
configure:31079: $? = 0
configure:31093: result: yes
configure:31130: checking for glBegin in -lGL
configure:31166: x86_64-pc-linux-gnu-gcc -o conftest -march=athlon64 -O2 -pipe -frename-registers -ffunction-sections conftest.c -lGL -lSM -lICE
>&5
configure:31172: $? = 0
configure:31179: test -z "$ac_c_werror_flag" || test ! -s conftest.err
configure:31182: $? = 0
configure:31189: test -s conftest
configure:31192: $? = 0
configure:31206: result: yes
configure:31209: checking for tan in -lm
configure:31245: x86_64-pc-linux-gnu-gcc -o conftest -march=athlon64 -O2 -pipe -frename-registers -ffunction-sections conftest.c -lm -lSM -lICE -lGL -lm
>&5
conftest.c:49: warning: conflicting types for built-in function 'tan'
configure:31251: $? = 0
configure:31258: test -z "$ac_c_werror_flag" || test ! -s conftest.err
configure:31261: $? = 0
configure:31268: test -s conftest
configure:31271: $? = 0
configure:31285: result: yes
configure:31298: checking GL/gl.h usability
configure:31315: x86_64-pc-linux-gnu-gcc -c -march=athlon64 -O2 -pipe -frename-registers -ffunction-sections conftest.c >&5
configure:31321: $? = 0
configure:31328: test -z "$ac_c_werror_flag" || test ! -s conftest.err
configure:31331: $? = 0
configure:31338: test -s conftest.o
configure:31341: $? = 0
configure:31352: result: yes
configure:31356: checking GL/gl.h presence
configure:31371: x86_64-pc-linux-gnu-gcc -E conftest.c
configure:31377: $? = 0
configure:31398: result: yes
configure:31426: checking for GL/gl.h
configure:31433: result: yes
configure:31446: checking for gluPerspective in -lGLU
configure:31482: x86_64-pc-linux-gnu-gcc -o conftest -march=athlon64 -O2 -pipe -frename-registers -ffunction-sections conftest.c -lGLU -lSM -lICE -lGL -lm -lGLU
>&5
configure:31488: $? = 0
configure:31495: test -z "$ac_c_werror_flag" || test ! -s conftest.err
configure:31498: $? = 0
configure:31505: test -s conftest
configure:31508: $? = 0
configure:31522: result: yes
configure:31535: checking GL/glu.h usability
configure:31552: x86_64-pc-linux-gnu-gcc -c -march=athlon64 -O2 -pipe -frename-registers -ffunction-sections conftest.c >&5
configure:31558: $? = 0
configure:31565: test -z "$ac_c_werror_flag" || test ! -s conftest.err
configure:31568: $? = 0
configure:31575: test -s conftest.o
configure:31578: $? = 0
configure:31589: result: yes
configure:31593: checking GL/glu.h presence
configure:31608: x86_64-pc-linux-gnu-gcc -E conftest.c
configure:31614: $? = 0
configure:31635: result: yes
configure:31663: checking for GL/glu.h
configure:31670: result: yes
configure:31675: checking if GLU is sane
configure:31701: x86_64-pc-linux-gnu-gcc -o conftest -march=athlon64 -O2 -pipe -frename-registers -ffunction-sections conftest.c -lGL -lm -lGLU >&5
configure:31707: $? = 0
configure:31714: test -z "$ac_c_werror_flag" || test ! -s conftest.err
configure:31717: $? = 0
configure:31724: test -s conftest
configure:31727: $? = 0
configure:31736: result: yes
configure:32034: checking X11/extensions/XShm.h usability
configure:32051: x86_64-pc-linux-gnu-gcc -c -march=athlon64 -O2 -pipe -frename-registers -ffunction-sections conftest.c >&5
In file included from conftest.c:77:
/usr/include/X11/extensions/XShm.h:56: error: parse error before "Bool"
/usr/include/X11/extensions/XShm.h:58: error: parse error before "drawable"
/usr/include/X11/extensions/XShm.h:63: error: parse error before '}' token
/usr/include/X11/extensions/XShm.h:69: error: parse error before "Bool"
/usr/include/X11/extensions/XShm.h:74: error: parse error before "XShmQueryExtension"
/usr/include/X11/extensions/XShm.h:75: error: parse error before '*' token
/usr/include/X11/extensions/XShm.h:79: error: parse error before '*' token
/usr/include/X11/extensions/XShm.h:82: error: parse error before "XShmQueryVersion"
/usr/include/X11/extensions/XShm.h:83: error: parse error before '*' token
/usr/include/X11/extensions/XShm.h:90: error: parse error before '*' token
/usr/include/X11/extensions/XShm.h:93: error: parse error before "XShmAttach"
/usr/include/X11/extensions/XShm.h:94: error: parse error before '*' token
/usr/include/X11/extensions/XShm.h:98: error: parse error before "XShmDetach"
/usr/include/X11/extensions/XShm.h:99: error: parse error before '*' token
/usr/include/X11/extensions/XShm.h:103: error: parse error before "XShmPutImage"
/usr/include/X11/extensions/XShm.h:104: error: parse error before '*' token
/usr/include/X11/extensions/XShm.h:117: error: parse error before "XShmGetImage"
/usr/include/X11/extensions/XShm.h:118: error: parse error before '*' token
/usr/include/X11/extensions/XShm.h:126: error: parse error before '*' token
/usr/include/X11/extensions/XShm.h:127: error: parse error before '*' token
/usr/include/X11/extensions/XShm.h:137: error: parse error before "XShmCreatePixmap"
/usr/include/X11/extensions/XShm.h:138: error: parse error before '*' token
configure:32057: $? = 1
configure: failed program was:
| /* confdefs.h. */
| #define PACKAGE_NAME ""
| #define PACKAGE_TARNAME ""
| #define PACKAGE_VERSION ""
| #define PACKAGE_STRING ""
| #define PACKAGE_BUGREPORT ""
| #define XINE_MAJOR 1
| #define XINE_MINOR 1
| #define XINE_SUB 3
| #define XINE_TEXTDOMAIN "libxine1"
| #define PACKAGE "xine-lib"
| #define VERSION "1.1.3"
| #define STDC_HEADERS 1
| #define HAVE_SYS_TYPES_H 1
| #define HAVE_SYS_STAT_H 1
| #define HAVE_STDLIB_H 1
| #define HAVE_STRING_H 1
| #define HAVE_MEMORY_H 1
| #define HAVE_STRINGS_H 1
| #define HAVE_INTTYPES_H 1
| #define HAVE_STDINT_H 1
| #define HAVE_UNISTD_H 1
| #define HAVE_DLFCN_H 1
| #define HAVE_ICONV 1
| #define ICONV_CONST
| #define ENABLE_NLS 1
| #define HAVE_GETTEXT 1
| #define HAVE_DCGETTEXT 1
| #define HAVE_NL_LANGINFO 1
| #define SIZEOF_LONG 8
| #define _GNU_SOURCE 1
| #define HAVE_FFMPEG 1
| #define HAVE_LRINTF 1
| #define _ISOC9X_SOURCE 1
| #define HAVE_RINTF 1
| #define HAVE_X11 1
| #define LIBX11_SO "libX11.so.6"
| #define LIBXV_SO "libXv.so.1"
| #define ENABLE_IPV6 1
| #define HAVE_POSIX_TIMERS 1
| #define HAVE_OPENGL 1
| #define HAVE_GLU 1
| /* end confdefs.h. */
| #include <stdio.h>
| #if HAVE_SYS_TYPES_H
| # include <sys/types.h>
| #endif
| #if HAVE_SYS_STAT_H
| # include <sys/stat.h>
| #endif
| #if STDC_HEADERS
| # include <stdlib.h>
| # include <stddef.h>
| #else
| # if HAVE_STDLIB_H
| # include <stdlib.h>
| # endif
| #endif
| #if HAVE_STRING_H
| # if !STDC_HEADERS && HAVE_MEMORY_H
| # include <memory.h>
| # endif
| # include <string.h>
| #endif
| #if HAVE_STRINGS_H
| # include <strings.h>
| #endif
| #if HAVE_INTTYPES_H
| # include <inttypes.h>
| #endif
| #if HAVE_STDINT_H
| # include <stdint.h>
| #endif
| #if HAVE_UNISTD_H
| # include <unistd.h>
| #endif
| #include <X11/extensions/XShm.h>
configure:32088: result: no
configure:32092: checking X11/extensions/XShm.h presence
configure:32107: x86_64-pc-linux-gnu-gcc -E conftest.c
configure:32113: $? = 0
configure:32134: result: yes
configure:32147: WARNING: X11/extensions/XShm.h: present but cannot be compiled
configure:32149: WARNING: X11/extensions/XShm.h: check for missing prerequisite headers?
configure:32151: WARNING: X11/extensions/XShm.h: see the Autoconf documentation
configure:32153: WARNING: X11/extensions/XShm.h: section "Present But Cannot Be Compiled"
configure:32155: WARNING: X11/extensions/XShm.h: proceeding with the preprocessor's result
configure:32157: WARNING: X11/extensions/XShm.h: in the future, the compiler will take precedence
configure:32162: checking for X11/extensions/XShm.h
configure:32170: result: yes
configure:32227: checking for libXv.so
configure:32230: result: found libXv.so in /usr/lib64
configure:32310: checking for XvShmCreateImage in -lXv
configure:32345: x86_64-pc-linux-gnu-gcc -o conftest -march=athlon64 -O2 -pipe -frename-registers -ffunction-sections conftest.c -lXv -lSM -lICE -lXext >&5
configure:32351: $? = 0
configure:32358: test -z "$ac_c_werror_flag" || test ! -s conftest.err
configure:32361: $? = 0
configure:32368: test -s conftest
configure:32371: $? = 0
configure:32385: result: yes
configure:32506: checking whether to enable the xxmc plugin with vld extensions
configure:32508: result:
configure:32512: checking for XvMCPutSlice in -lXvMCW
configure:32547: x86_64-pc-linux-gnu-gcc -o conftest -march=athlon64 -O2 -pipe -frename-registers -ffunction-sections conftest.c -lXvMCW -L -lSM -lICE -lXv -lXext >&5
configure:32553: $? = 0
configure:32560: test -z "$ac_c_werror_flag" || test ! -s conftest.err
configure:32563: $? = 0
configure:32570: test -s conftest
configure:32573: $? = 0
configure:32588: result: yes
configure:32709: checking X11/extensions/vldXvMC.h usability
configure:32726: x86_64-pc-linux-gnu-gcc -c -march=athlon64 -O2 -pipe -frename-registers -ffunction-sections conftest.c >&5
configure:32732: $? = 0
configure:32739: test -z "$ac_c_werror_flag" || test ! -s conftest.err
configure:32742: $? = 0
configure:32749: test -s conftest.o
configure:32752: $? = 0
configure:32763: result: yes
configure:32767: checking X11/extensions/vldXvMC.h presence
configure:32782: x86_64-pc-linux-gnu-gcc -E conftest.c
configure:32788: $? = 0
configure:32809: result: yes
configure:32837: checking for X11/extensions/vldXvMC.h
configure:32845: result: yes
configure:33068: checking X11/extensions/XvMC.h usability
configure:33085: x86_64-pc-linux-gnu-gcc -c -march=athlon64 -O2 -pipe -frename-registers -ffunction-sections conftest.c >&5
configure:33091: $? = 0
configure:33098: test -z "$ac_c_werror_flag" || test ! -s conftest.err
configure:33101: $? = 0
configure:33108: test -s conftest.o
configure:33111: $? = 0
configure:33122: result: yes
configure:33126: checking X11/extensions/XvMC.h presence
configure:33141: x86_64-pc-linux-gnu-gcc -E conftest.c
configure:33147: $? = 0
configure:33168: result: yes
configure:33196: checking for X11/extensions/XvMC.h
configure:33204: result: yes
configure:33227: result: *** Enabling xxmc plugin with vld extensions.
configure:33281: checking whether to enable the xvmc plugin
configure:33283: result:
configure:33287: checking for XvMCCreateContext in -lXvMCW
configure:33322: x86_64-pc-linux-gnu-gcc -o conftest -march=athlon64 -O2 -pipe -frename-registers -ffunction-sections conftest.c -lXvMCW -L -lSM -lICE -lXv -lXext >&5
configure:33328: $? = 0
configure:33335: test -z "$ac_c_werror_flag" || test ! -s conftest.err
configure:33338: $? = 0
configure:33345: test -s conftest
configure:33348: $? = 0
configure:33363: result: yes
configure:33473: checking for X11/extensions/XvMC.h
configure:33479: result: yes
configure:33641: result: *** Enabling old xvmc plugin.
configure:33673: checking for XineramaQueryExtension in -lXinerama
configure:33708: x86_64-pc-linux-gnu-gcc -o conftest -march=athlon64 -O2 -pipe -frename-registers -ffunction-sections conftest.c -lXinerama -lSM -lICE -lXext >&5
configure:33714: $? = 0
configure:33721: test -z "$ac_c_werror_flag" || test ! -s conftest.err
configure:33724: $? = 0
configure:33731: test -s conftest
configure:33734: $? = 0
configure:33748: result: yes
configure:34662: checking sys/fbio.h usability
configure:34679: x86_64-pc-linux-gnu-gcc -c -march=athlon64 -O2 -pipe -frename-registers -ffunction-sections conftest.c >&5
conftest.c:86:22: sys/fbio.h: No such file or directory
configure:34685: $? = 1
configure: failed program was:
| /* confdefs.h. */
| #define PACKAGE_NAME ""
| #define PACKAGE_TARNAME ""
| #define PACKAGE_VERSION ""
| #define PACKAGE_STRING ""
| #define PACKAGE_BUGREPORT ""
| #define XINE_MAJOR 1
| #define XINE_MINOR 1
| #define XINE_SUB 3
| #define XINE_TEXTDOMAIN "libxine1"
| #define PACKAGE "xine-lib"
| #define VERSION "1.1.3"
| #define STDC_HEADERS 1
| #define HAVE_SYS_TYPES_H 1
| #define HAVE_SYS_STAT_H 1
| #define HAVE_STDLIB_H 1
| #define HAVE_STRING_H 1
| #define HAVE_MEMORY_H 1
| #define HAVE_STRINGS_H 1
| #define HAVE_INTTYPES_H 1
| #define HAVE_STDINT_H 1
| #define HAVE_UNISTD_H 1
| #define HAVE_DLFCN_H 1
| #define HAVE_ICONV 1
| #define ICONV_CONST
| #define ENABLE_NLS 1
| #define HAVE_GETTEXT 1
| #define HAVE_DCGETTEXT 1
| #define HAVE_NL_LANGINFO 1
| #define SIZEOF_LONG 8
| #define _GNU_SOURCE 1
| #define HAVE_FFMPEG 1
| #define HAVE_LRINTF 1
| #define _ISOC9X_SOURCE 1
| #define HAVE_RINTF 1
| #define HAVE_X11 1
| #define LIBX11_SO "libX11.so.6"
| #define LIBXV_SO "libXv.so.1"
| #define ENABLE_IPV6 1
| #define HAVE_POSIX_TIMERS 1
| #define HAVE_OPENGL 1
| #define HAVE_GLU 1
| #define HAVE_X11_EXTENSIONS_XSHM_H 1
| #define HAVE_XV 1
| #define HAVE_X11_EXTENSIONS_VLDXVMC_H 1
| #define HAVE_VLDXVMC 1
| #define HAVE_X11_EXTENSIONS_XVMC_H 1
| #define HAVE_XXMC 1
| #define HAVE_X11_EXTENSIONS_XVMC_H 1
| #define HAVE_XVMC 1
| #define HAVE_XINERAMA 1
| /* end confdefs.h. */
| #include <stdio.h>
| #if HAVE_SYS_TYPES_H
| # include <sys/types.h>
| #endif
| #if HAVE_SYS_STAT_H
| # include <sys/stat.h>
| #endif
| #if STDC_HEADERS
| # include <stdlib.h>
| # include <stddef.h>
| #else
| # if HAVE_STDLIB_H
| # include <stdlib.h>
| # endif
| #endif
| #if HAVE_STRING_H
| # if !STDC_HEADERS && HAVE_MEMORY_H
| # include <memory.h>
| # endif
| # include <string.h>
| #endif
| #if HAVE_STRINGS_H
| # include <strings.h>
| #endif
| #if HAVE_INTTYPES_H
| # include <inttypes.h>
| #endif
| #if HAVE_STDINT_H
| # include <stdint.h>
| #endif
| #if HAVE_UNISTD_H
| # include <unistd.h>
| #endif
| #include <sys/fbio.h>
configure:34716: result: no
configure:34720: checking sys/fbio.h presence
configure:34735: x86_64-pc-linux-gnu-gcc -E conftest.c
conftest.c:53:22: sys/fbio.h: No such file or directory
configure:34741: $? = 1
configure: failed program was:
| /* confdefs.h. */
| #define PACKAGE_NAME ""
| #define PACKAGE_TARNAME ""
| #define PACKAGE_VERSION ""
| #define PACKAGE_STRING ""
| #define PACKAGE_BUGREPORT ""
| #define XINE_MAJOR 1
| #define XINE_MINOR 1
| #define XINE_SUB 3
| #define XINE_TEXTDOMAIN "libxine1"
| #define PACKAGE "xine-lib"
| #define VERSION "1.1.3"
| #define STDC_HEADERS 1
| #define HAVE_SYS_TYPES_H 1
| #define HAVE_SYS_STAT_H 1
| #define HAVE_STDLIB_H 1
| #define HAVE_STRING_H 1
| #define HAVE_MEMORY_H 1
| #define HAVE_STRINGS_H 1
| #define HAVE_INTTYPES_H 1
| #define HAVE_STDINT_H 1
| #define HAVE_UNISTD_H 1
| #define HAVE_DLFCN_H 1
| #define HAVE_ICONV 1
| #define ICONV_CONST
| #define ENABLE_NLS 1
| #define HAVE_GETTEXT 1
| #define HAVE_DCGETTEXT 1
| #define HAVE_NL_LANGINFO 1
| #define SIZEOF_LONG 8
| #define _GNU_SOURCE 1
| #define HAVE_FFMPEG 1
| #define HAVE_LRINTF 1
| #define _ISOC9X_SOURCE 1
| #define HAVE_RINTF 1
| #define HAVE_X11 1
| #define LIBX11_SO "libX11.so.6"
| #define LIBXV_SO "libXv.so.1"
| #define ENABLE_IPV6 1
| #define HAVE_POSIX_TIMERS 1
| #define HAVE_OPENGL 1
| #define HAVE_GLU 1
| #define HAVE_X11_EXTENSIONS_XSHM_H 1
| #define HAVE_XV 1
| #define HAVE_X11_EXTENSIONS_VLDXVMC_H 1
| #define HAVE_VLDXVMC 1
| #define HAVE_X11_EXTENSIONS_XVMC_H 1
| #define HAVE_XXMC 1
| #define HAVE_X11_EXTENSIONS_XVMC_H 1
| #define HAVE_XVMC 1
| #define HAVE_XINERAMA 1
| /* end confdefs.h. */
| #include <sys/fbio.h>
configure:34762: result: no
configure:34790: checking for sys/fbio.h
configure:34797: result: no
configure:34823: checking for XDgaGrabDrawable in -ldga
configure:34858: x86_64-pc-linux-gnu-gcc -o conftest -march=athlon64 -O2 -pipe -frename-registers -ffunction-sections -I/usr/openwin/include -L/usr/openwin/lib conftest.c -ldga >&5
/usr/lib/gcc/x86_64-pc-linux-gnu/3.4.4/../../../../x86_64-pc-linux-gnu/bin/ld: cannot find -ldga
collect2: ld returned 1 exit status
configure:34864: $? = 1
configure: failed program was:
| /* confdefs.h. */
| #define PACKAGE_NAME ""
| #define PACKAGE_TARNAME ""
| #define PACKAGE_VERSION ""
| #define PACKAGE_STRING ""
| #define PACKAGE_BUGREPORT ""
| #define XINE_MAJOR 1
| #define XINE_MINOR 1
| #define XINE_SUB 3
| #define XINE_TEXTDOMAIN "libxine1"
| #define PACKAGE "xine-lib"
| #define VERSION "1.1.3"
| #define STDC_HEADERS 1
| #define HAVE_SYS_TYPES_H 1
| #define HAVE_SYS_STAT_H 1
| #define HAVE_STDLIB_H 1
| #define HAVE_STRING_H 1
| #define HAVE_MEMORY_H 1
| #define HAVE_STRINGS_H 1
| #define HAVE_INTTYPES_H 1
| #define HAVE_STDINT_H 1
| #define HAVE_UNISTD_H 1
| #define HAVE_DLFCN_H 1
| #define HAVE_ICONV 1
| #define ICONV_CONST
| #define ENABLE_NLS 1
| #define HAVE_GETTEXT 1
| #define HAVE_DCGETTEXT 1
| #define HAVE_NL_LANGINFO 1
| #define SIZEOF_LONG 8
| #define _GNU_SOURCE 1
| #define HAVE_FFMPEG 1
| #define HAVE_LRINTF 1
| #define _ISOC9X_SOURCE 1
| #define HAVE_RINTF 1
| #define HAVE_X11 1
| #define LIBX11_SO "libX11.so.6"
| #define LIBXV_SO "libXv.so.1"
| #define ENABLE_IPV6 1
| #define HAVE_POSIX_TIMERS 1
| #define HAVE_OPENGL 1
| #define HAVE_GLU 1
| #define HAVE_X11_EXTENSIONS_XSHM_H 1
| #define HAVE_XV 1
| #define HAVE_X11_EXTENSIONS_VLDXVMC_H 1
| #define HAVE_VLDXVMC 1
| #define HAVE_X11_EXTENSIONS_XVMC_H 1
| #define HAVE_XXMC 1
| #define HAVE_X11_EXTENSIONS_XVMC_H 1
| #define HAVE_XVMC 1
| #define HAVE_XINERAMA 1
| /* end confdefs.h. */
|
| /* Override any GCC internal prototype to avoid an error.
| Use char because int might match the return type of a GCC
| builtin and then its argument prototype would still apply. */
| #ifdef __cplusplus
| extern "C"
| #endif
| char XDgaGrabDrawable ();
| int
| main ()
| {
| return XDgaGrabDrawable ();
| ;
| return 0;
| }
configure:34898: result: no
configure:35090: checking linux/fb.h usability
configure:35107: x86_64-pc-linux-gnu-gcc -c -march=athlon64 -O2 -pipe -frename-registers -ffunction-sections conftest.c >&5
configure:35113: $? = 0
configure:35120: test -z "$ac_c_werror_flag" || test ! -s conftest.err
configure:35123: $? = 0
configure:35130: test -s conftest.o
configure:35133: $? = 0
configure:35144: result: yes
configure:35148: checking linux/fb.h presence
configure:35163: x86_64-pc-linux-gnu-gcc -E conftest.c
configure:35169: $? = 0
configure:35190: result: yes
configure:35218: checking for linux/fb.h
configure:35225: result: yes
configure:35296: checking for x86_64-pc-linux-gnu-pkg-config
configure:35326: result: /usr/bin/pkg-config
configure:35451: checking for SDL
configure:35459: $PKG_CONFIG --exists --print-errors "sdl"
configure:35462: $? = 0
configure:35477: $PKG_CONFIG --exists --print-errors "sdl"
configure:35480: $? = 0
configure:35514: result: yes
configure:35546: checking for Libstk
configure:35562: result: no
configure:35564: result: *** All of Libstk dependent parts will be disabled ***
configure:35688: checking for DirectX
configure:35725: x86_64-pc-linux-gnu-gcc -c -march=athlon64 -O2 -pipe -frename-registers -ffunction-sections conftest.c >&5
conftest.c:4:21: windows.h: No such file or directory
conftest.c:5:19: ddraw.h: No such file or directory
conftest.c:6:20: dsound.h: No such file or directory
configure:35731: $? = 1
configure: failed program was:
|
| #include <stddef.h>
|
| #include <windows.h>
| #include <ddraw.h>
| #include <dsound.h>
|
| int main() {
| DirectDrawCreate(0, NULL, 0);
| DirectsoundCreate(0, NULL, 0);
|
| return 0;
| }
|
configure:35780: result: no
configure:35782: result: *** All DirectX dependent parts will be disabled ***
configure:36327: result: DXR3 plugins will not be built.
configure:36867: checking for vidix support
configure:36887: result: no
configure:36890: checking for DHA linux kernel module build
configure:36896: result: no
configure:36932: checking for mknod
configure:36948: found /bin/mknod
configure:36960: result: mknod
configure:36970: checking for depmod
configure:36987: found /sbin/depmod
configure:36999: result: depmod
configure:37020: checking for VORBIS
configure:37028: $PKG_CONFIG --exists --print-errors "ogg vorbis"
configure:37031: $? = 0
configure:37046: $PKG_CONFIG --exists --print-errors "ogg vorbis"
configure:37049: $? = 0
configure:37083: result: yes
configure:37118: checking for THEORA
configure:37126: $PKG_CONFIG --exists --print-errors "ogg theora"
Package theora was not found in the pkg-config search path.
Perhaps you should add the directory containing `theora.pc'
to the PKG_CONFIG_PATH environment variable
No package 'theora' found
configure:37129: $? = 1
configure:37144: $PKG_CONFIG --exists --print-errors "ogg theora"
Package theora was not found in the pkg-config search path.
Perhaps you should add the directory containing `theora.pc'
to the PKG_CONFIG_PATH environment variable
No package 'theora' found
configure:37147: $? = 1
No package 'theora' found
configure:37186: error: Theora support requested, but libtheora not found
## ---------------- ##
## Cache variables. ##
## ---------------- ##
ac_cv_build=x86_64-pc-linux-gnu
ac_cv_c_bigendian=no
ac_cv_c_compiler_gnu=yes
ac_cv_c_const=yes
ac_cv_c_inline=inline
ac_cv_cxx_compiler_gnu=yes
ac_cv_env_ALSA_CFLAGS_set=
ac_cv_env_ALSA_CFLAGS_value=
ac_cv_env_ALSA_LIBS_set=
ac_cv_env_ALSA_LIBS_value=
ac_cv_env_CACA_CFLAGS_set=
ac_cv_env_CACA_CFLAGS_value=
ac_cv_env_CACA_LIBS_set=
ac_cv_env_CACA_LIBS_value=
ac_cv_env_CCC_set=
ac_cv_env_CCC_value=
ac_cv_env_CC_set=
ac_cv_env_CC_value=
ac_cv_env_CFLAGS_set=set
ac_cv_env_CFLAGS_value='-march=athlon64 -O2 -pipe -frename-registers -ffunction-sections'
ac_cv_env_CPPFLAGS_set=
ac_cv_env_CPPFLAGS_value=
ac_cv_env_CPP_set=
ac_cv_env_CPP_value=
ac_cv_env_CXXCPP_set=
ac_cv_env_CXXCPP_value=
ac_cv_env_CXXFLAGS_set=set
ac_cv_env_CXXFLAGS_value='-march=athlon64 -O2 -pipe -frename-registers -ffunction-sections'
ac_cv_env_CXX_set=
ac_cv_env_CXX_value=
ac_cv_env_ESD_CFLAGS_set=
ac_cv_env_ESD_CFLAGS_value=
ac_cv_env_ESD_LIBS_set=
ac_cv_env_ESD_LIBS_value=
ac_cv_env_FFMPEG_CFLAGS_set=
ac_cv_env_FFMPEG_CFLAGS_value=
ac_cv_env_FFMPEG_LIBS_set=
ac_cv_env_FFMPEG_LIBS_value=
ac_cv_env_FFMPEG_POSTPROC_CFLAGS_set=
ac_cv_env_FFMPEG_POSTPROC_CFLAGS_value=
ac_cv_env_FFMPEG_POSTPROC_LIBS_set=
ac_cv_env_FFMPEG_POSTPROC_LIBS_value=
ac_cv_env_FT2_CFLAGS_set=
ac_cv_env_FT2_CFLAGS_value=
ac_cv_env_FT2_LIBS_set=
ac_cv_env_FT2_LIBS_value=
ac_cv_env_FUSIONSOUND_CFLAGS_set=
ac_cv_env_FUSIONSOUND_CFLAGS_value=
ac_cv_env_FUSIONSOUND_LIBS_set=
ac_cv_env_FUSIONSOUND_LIBS_value=
ac_cv_env_GDK_PIXBUF_CFLAGS_set=
ac_cv_env_GDK_PIXBUF_CFLAGS_value=
ac_cv_env_GDK_PIXBUF_LIBS_set=
ac_cv_env_GDK_PIXBUF_LIBS_value=
ac_cv_env_GNOME_VFS_CFLAGS_set=
ac_cv_env_GNOME_VFS_CFLAGS_value=
ac_cv_env_GNOME_VFS_LIBS_set=
ac_cv_env_GNOME_VFS_LIBS_value=
ac_cv_env_JACK_CFLAGS_set=
ac_cv_env_JACK_CFLAGS_value=
ac_cv_env_JACK_LIBS_set=
ac_cv_env_JACK_LIBS_value=
ac_cv_env_LDFLAGS_set=
ac_cv_env_LDFLAGS_value=
ac_cv_env_LIBDTS_CFLAGS_set=
ac_cv_env_LIBDTS_CFLAGS_value=
ac_cv_env_LIBDTS_LIBS_set=
ac_cv_env_LIBDTS_LIBS_value=
ac_cv_env_LIBMAD_CFLAGS_set=
ac_cv_env_LIBMAD_CFLAGS_value=
ac_cv_env_LIBMAD_LIBS_set=
ac_cv_env_LIBMAD_LIBS_value=
ac_cv_env_LIBMODPLUG_CFLAGS_set=
ac_cv_env_LIBMODPLUG_CFLAGS_value=
ac_cv_env_LIBMODPLUG_LIBS_set=
ac_cv_env_LIBMODPLUG_LIBS_value=
ac_cv_env_PKG_CONFIG_set=
ac_cv_env_PKG_CONFIG_value=
ac_cv_env_PULSEAUDIO_CFLAGS_set=
ac_cv_env_PULSEAUDIO_CFLAGS_value=
ac_cv_env_PULSEAUDIO_LIBS_set=
ac_cv_env_PULSEAUDIO_LIBS_value=
ac_cv_env_SDL_CFLAGS_set=
ac_cv_env_SDL_CFLAGS_value=
ac_cv_env_SDL_LIBS_set=
ac_cv_env_SDL_LIBS_value=
ac_cv_env_SPEEX_CFLAGS_set=
ac_cv_env_SPEEX_CFLAGS_value=
ac_cv_env_SPEEX_LIBS_set=
ac_cv_env_SPEEX_LIBS_value=
ac_cv_env_THEORA_CFLAGS_set=
ac_cv_env_THEORA_CFLAGS_value=
ac_cv_env_THEORA_LIBS_set=
ac_cv_env_THEORA_LIBS_value=
ac_cv_env_VORBIS_CFLAGS_set=
ac_cv_env_VORBIS_CFLAGS_value=
ac_cv_env_VORBIS_LIBS_set=
ac_cv_env_VORBIS_LIBS_value=
ac_cv_env_WAND_CFLAGS_set=
ac_cv_env_WAND_CFLAGS_value=
ac_cv_env_WAND_LIBS_set=
ac_cv_env_WAND_LIBS_value=
ac_cv_env_XMKMF_set=
ac_cv_env_XMKMF_value=
ac_cv_env_build_alias_set=set
ac_cv_env_build_alias_value=x86_64-pc-linux-gnu
ac_cv_env_host_alias_set=set
ac_cv_env_host_alias_value=x86_64-pc-linux-gnu
ac_cv_env_target_alias_set=
ac_cv_env_target_alias_value=
ac_cv_func_connect=yes
ac_cv_func_dlopen=no
ac_cv_func_gethostbyname=yes
ac_cv_func_nl_langinfo=yes
ac_cv_func_remove=yes
ac_cv_func_shl_load=no
ac_cv_func_shmat=yes
ac_cv_have_decl_lrintf=yes
ac_cv_have_decl_rintf=yes
ac_cv_have_x='have_x=yes ac_x_includes='\'''\'' ac_x_libraries='\'''\'''
ac_cv_header_GL_gl_h=yes
ac_cv_header_GL_glu_h=yes
ac_cv_header_X11_extensions_XShm_h=yes
ac_cv_header_X11_extensions_XvMC_h=yes
ac_cv_header_X11_extensions_vldXvMC_h=yes
ac_cv_header_dlfcn_h=yes
ac_cv_header_inttypes_h=yes
ac_cv_header_linux_fb_h=yes
ac_cv_header_memory_h=yes
ac_cv_header_stdc=yes
ac_cv_header_stdint_h=yes
ac_cv_header_stdlib_h=yes
ac_cv_header_string_h=yes
ac_cv_header_strings_h=yes
ac_cv_header_sys_fbio_h=no
ac_cv_header_sys_stat_h=yes
ac_cv_header_sys_types_h=yes
ac_cv_header_unistd_h=yes
ac_cv_header_zlib_h=yes
ac_cv_host=x86_64-pc-linux-gnu
ac_cv_lib_GLU_gluPerspective=yes
ac_cv_lib_GL_glBegin=yes
ac_cv_lib_ICE_IceConnectionNumber=yes
ac_cv_lib_Xinerama_XineramaQueryExtension=yes
ac_cv_lib_XvMCW___XvMCCreateContext=yes
ac_cv_lib_XvMCW___XvMCPutSlice=yes
ac_cv_lib_Xv_XvShmCreateImage=yes
ac_cv_lib_c_dlopen=no
ac_cv_lib_cposix_strerror=no
ac_cv_lib_dga_XDgaGrabDrawable=no
ac_cv_lib_dl_dlopen=yes
ac_cv_lib_dld_shl_load=no
ac_cv_lib_m_tan=yes
ac_cv_lib_mlib_mlib_VideoAddBlock_U8_S16=no
ac_cv_lib_nsl_gethostbyname=yes
ac_cv_lib_pthread_pthread_create=yes
ac_cv_lib_rt_clock_getres=yes
ac_cv_lib_socket_socket=no
ac_cv_lib_z_gzsetparams=yes
ac_cv_objext=o
ac_cv_path_EGREP='/bin/grep -E'
ac_cv_path_GMSGFMT=/usr/bin/gmsgfmt
ac_cv_path_GREP=/bin/grep
ac_cv_path_MSGFMT=/usr/bin/msgfmt
ac_cv_path_MSGMERGE=/usr/bin/msgmerge
ac_cv_path_PKG_CONFIG=/usr/bin/pkg-config
ac_cv_path_XGETTEXT=/usr/bin/xgettext
ac_cv_path_ac_pt_PKG_CONFIG=/usr/bin/pkg-config
ac_cv_path_install='/bin/install -c'
ac_cv_prog_AR=x86_64-pc-linux-gnu-ar
ac_cv_prog_AWK=gawk
ac_cv_prog_CC=x86_64-pc-linux-gnu-gcc
ac_cv_prog_CPP='x86_64-pc-linux-gnu-gcc -E'
ac_cv_prog_CXX=x86_64-pc-linux-gnu-g++
ac_cv_prog_CXXCPP='x86_64-pc-linux-gnu-g++ -E'
ac_cv_prog_DEPMOD=depmod
ac_cv_prog_MKNOD=mknod
ac_cv_prog_RANLIB=x86_64-pc-linux-gnu-ranlib
ac_cv_prog_STRIP=x86_64-pc-linux-gnu-strip
ac_cv_prog_cc_c89=
ac_cv_prog_cc_g=yes
ac_cv_prog_cxx_g=yes
ac_cv_prog_make_make_set=yes
ac_cv_sizeof_long=8
ac_cv_socklen_t=socklen_t
ac_cv_type_long=yes
ac_cv_type_off_t=yes
ac_cv_type_size_t=yes
ac_cv_type_ssize_t=yes
acl_cv_hardcode_direct=no
acl_cv_hardcode_libdir_flag_spec='${wl}-rpath ${wl}$libdir'
acl_cv_hardcode_libdir_separator=
acl_cv_hardcode_minus_L=no
acl_cv_libext=a
acl_cv_path_LD='/usr/x86_64-pc-linux-gnu/bin/ld -m elf_x86_64'
acl_cv_prog_gnu_ld=yes
acl_cv_rpath=done
acl_cv_shlibext=so
acl_cv_wl=-Wl,
am_cv_CC_dependencies_compiler_type=none
am_cv_CXX_dependencies_compiler_type=none
am_cv_func_iconv=yes
am_cv_lib_iconv=no
am_cv_proto_iconv='extern size_t iconv (iconv_t cd, char * *inbuf, size_t *inbytesleft, char * *outbuf, size_t *outbytesleft);'
am_cv_proto_iconv_arg1=
gt_cv_func_CFLocaleCopyCurrent=no
gt_cv_func_CFPreferencesCopyAppValue=no
gt_cv_func_gnugettext1_libc=yes
lt_cv_deplibs_check_method=pass_all
lt_cv_dlopen=dlopen
lt_cv_dlopen_libs=-ldl
lt_cv_dlopen_self=yes
lt_cv_dlopen_self_static=yes
lt_cv_file_magic_cmd='$MAGIC_CMD'
lt_cv_file_magic_test_file=
lt_cv_ld_reload_flag=-r
lt_cv_objdir=.libs
lt_cv_path_LD=/usr/x86_64-pc-linux-gnu/bin/ld
lt_cv_path_LDCXX='/usr/x86_64-pc-linux-gnu/bin/ld -m elf_x86_64'
lt_cv_path_MAGIC_CMD=/usr/bin/file
lt_cv_path_NM='/usr/bin/x86_64-pc-linux-gnu-nm -B'
lt_cv_path_SED=/bin/sed
lt_cv_prog_compiler_c_o=yes
lt_cv_prog_compiler_c_o_CXX=yes
lt_cv_prog_compiler_rtti_exceptions=no
lt_cv_prog_gnu_ld=yes
lt_cv_prog_gnu_ldcxx=yes
lt_cv_sys_global_symbol_pipe='sed -n -e '\''s/^.*[ ]\([ABCDGIRSTW][ABCDGIRSTW]*\)[ ][ ]*\([_A-Za-z][_A-Za-z0-9]*\)$/\1 \2 \2/p'\'''
lt_cv_sys_global_symbol_to_c_name_address='sed -n -e '\''s/^: \([^ ]*\) $/ {\"\1\", (lt_ptr) 0},/p'\'' -e '\''s/^[BCDEGRST] \([^ ]*\) \([^ ]*\)$/ {"\2", (lt_ptr) \&\2},/p'\'''
lt_cv_sys_global_symbol_to_cdecl='sed -n -e '\''s/^. .* \(.*\)$/extern int \1;/p'\'''
lt_cv_sys_max_cmd_len=32768
lt_lt_cv_prog_compiler_c_o='"yes"'
lt_lt_cv_prog_compiler_c_o_CXX='"yes"'
lt_lt_cv_sys_global_symbol_pipe='"sed -n -e '\''s/^.*[ ]\\([ABCDGIRSTW][ABCDGIRSTW]*\\)[ ][ ]*\\([_A-Za-z][_A-Za-z0-9]*\\)\$/\\1 \\2 \\2/p'\''"'
lt_lt_cv_sys_global_symbol_to_c_name_address='"sed -n -e '\''s/^: \\([^ ]*\\) \$/ {\\\"\\1\\\", (lt_ptr) 0},/p'\'' -e '\''s/^[BCDEGRST] \\([^ ]*\\) \\([^ ]*\\)\$/ {\"\\2\", (lt_ptr) \\&\\2},/p'\''"'
lt_lt_cv_sys_global_symbol_to_cdecl='"sed -n -e '\''s/^. .* \\(.*\\)\$/extern int \\1;/p'\''"'
pkg_cv_FFMPEG_CFLAGS='-I/usr/include/ffmpeg '
pkg_cv_FFMPEG_LIBS='-lavcodec -lz -lmp3lame -lxvidcore -lfaac -lfaad -ldl -lvorbisenc -lavutil -lvorbis -lm -logg '
pkg_cv_FFMPEG_POSTPROC_CFLAGS='-I/usr/include/postproc '
pkg_cv_FFMPEG_POSTPROC_LIBS='-lpostproc '
pkg_cv_SDL_CFLAGS='-D_GNU_SOURCE=1 -D_REENTRANT -I/usr/include/SDL '
pkg_cv_SDL_LIBS='-lSDL -lpthread '
pkg_cv_VORBIS_CFLAGS=' '
pkg_cv_VORBIS_LIBS='-lvorbis -lm -logg '
xine_cv_cc_64bit_output=yes
## ----------------- ##
## Output variables. ##
## ----------------- ##
A52_FALSE=''
A52_TRUE=''
AAINFO=''
AALIB_CFLAGS=''
AALIB_CONFIG=''
AALIB_LIBS=''
ACLOCAL='${SHELL} /var/tmp/portage/xine-lib-1.1.3_pre20060914/work/xine-lib-1.1.3_pre20060914/missing --run aclocal-1.9'
ACLOCAL_DIR=''
ALSA_CFLAGS=''
ALSA_LIBS=''
AMDEPBACKSLASH=''
AMDEP_FALSE=''
AMDEP_TRUE='#'
AMTAR='${SHELL} /var/tmp/portage/xine-lib-1.1.3_pre20060914/work/xine-lib-1.1.3_pre20060914/missing --run tar'
AR='x86_64-pc-linux-gnu-ar'
ARTS_CFLAGS=''
ARTS_CONFIG=''
ARTS_LIBS=''
AS='as'
ASFLAGS=''
AUTOCONF='${SHELL} /var/tmp/portage/xine-lib-1.1.3_pre20060914/work/xine-lib-1.1.3_pre20060914/missing --run autoconf'
AUTOHEADER='${SHELL} /var/tmp/portage/xine-lib-1.1.3_pre20060914/work/xine-lib-1.1.3_pre20060914/missing --run autoheader'
AUTOMAKE='${SHELL} /var/tmp/portage/xine-lib-1.1.3_pre20060914/work/xine-lib-1.1.3_pre20060914/missing --run automake-1.9'
AWK='gawk'
BUILD_ASF_FALSE=''
BUILD_ASF_TRUE=''
BUILD_DHA_KMOD_FALSE=''
BUILD_DHA_KMOD_TRUE='#'
BUILD_DMX_IMAGE_FALSE=''
BUILD_DMX_IMAGE_TRUE=''
BUILD_FAAD_FALSE=''
BUILD_FAAD_TRUE=''
CACA_CFLAGS=''
CACA_LIBS=''
CC='x86_64-pc-linux-gnu-gcc'
CCAS='$(CC)'
CCASCOMPILE='$(LIBTOOL) --mode=compile $(CCAS) $(AM_ASFLAGS) $(CCASFLAGS)'
CCASFLAGS='$(CFLAGS)'
CCDEPMODE='depmode=none'
CFLAGS='-march=athlon64 -O2 -pipe -frename-registers -ffunction-sections'
CPP='x86_64-pc-linux-gnu-gcc -E'
CPPFLAGS=' '
CXX='x86_64-pc-linux-gnu-g++'
CXXCPP='x86_64-pc-linux-gnu-g++ -E'
CXXDEPMODE='depmode=none'
CXXFLAGS='-march=athlon64 -O2 -pipe -frename-registers -ffunction-sections'
CYGPATH_W='echo'
DEBUG_CFLAGS=''
DEFS=''
DEPCOMP=''
DEPDIR='.deps'
DEPMOD='depmod'
DIRECTFB_CFLAGS=''
DIRECTFB_LIBS=''
DIRECTX_AUDIO_LIBS=' -ldsound'
DIRECTX_CPPFLAGS=''
DIRECTX_VIDEO_LIBS=' -lgdi32 -lddraw'
DLLTOOL='dlltool'
DTS_FALSE=''
DTS_TRUE=''
DVDNAV_CFLAGS=''
DVDNAV_CONFIG=''
DVDNAV_LIBS=''
DYNAMIC_LD_LIBS='-ldl'
ECHO='echo'
ECHO_C=''
ECHO_N='-n'
ECHO_T=''
EGREP='/bin/grep -E'
ENABLE_VCD_FALSE=''
ENABLE_VCD_TRUE=''
ENABLE_VIS_FALSE=''
ENABLE_VIS_TRUE=''
ESD_CFLAGS=''
ESD_LIBS=''
EXEEXT=''
EXTERNAL_A52DEC_FALSE=''
EXTERNAL_A52DEC_TRUE=''
EXTERNAL_LIBDTS_FALSE=''
EXTERNAL_LIBDTS_TRUE=''
EXTERNAL_LIBMAD_FALSE=''
EXTERNAL_LIBMAD_TRUE=''
EXTRA_X_CFLAGS=''
EXTRA_X_LIBS='-L/usr/lib64 -lXv -lXext'
FFMPEG_CFLAGS='-I/usr/include/ffmpeg '
FFMPEG_LIBS='-lavcodec -lz -lmp3lame -lxvidcore -lfaac -lfaad -ldl -lvorbisenc -lavutil -lvorbis -lm -logg '
FFMPEG_POSTPROC_CFLAGS='-I/usr/include/postproc '
FFMPEG_POSTPROC_LIBS='-lpostproc '
FIG2DEV=''
FT2_CFLAGS=''
FT2_LIBS=''
FUSIONSOUND_CFLAGS=''
FUSIONSOUND_LIBS=''
GDK_PIXBUF_CFLAGS=''
GDK_PIXBUF_LIBS=''
GENERATED_INTTYPES_H_FALSE=''
GENERATED_INTTYPES_H_TRUE='#'
GLU_LIBS='-lGLU'
GMSGFMT='/usr/bin/gmsgfmt'
GNOME_VFS_CFLAGS=''
GNOME_VFS_LIBS=''
GOOM_LIBS=''
GREP='/bin/grep'
HAVE_AA_FALSE=''
HAVE_AA_TRUE='#'
HAVE_ALSA_FALSE=''
HAVE_ALSA_TRUE=''
HAVE_ARMV4L_FALSE=''
HAVE_ARMV4L_TRUE=''
HAVE_ARTS_FALSE=''
HAVE_ARTS_TRUE=''
HAVE_BSDI_CDROM=''
HAVE_CACA_FALSE=''
HAVE_CACA_TRUE='#'
HAVE_CDROM_IOCTLS_FALSE=''
HAVE_CDROM_IOCTLS_TRUE=''
HAVE_COREAUDIO_FALSE=''
HAVE_COREAUDIO_TRUE='#'
HAVE_DARWIN_CDROM=''
HAVE_DIRECTFB_FALSE=''
HAVE_DIRECTFB_TRUE='#'
HAVE_DIRECTX_FALSE=''
HAVE_DIRECTX_TRUE='#'
HAVE_DVDNAV_FALSE=''
HAVE_DVDNAV_TRUE=''
HAVE_DXR3_FALSE=''
HAVE_DXR3_TRUE='#'
HAVE_ESD_FALSE=''
HAVE_ESD_TRUE=''
HAVE_FB_FALSE=''
HAVE_FB_TRUE='#'
HAVE_FFMMX_FALSE=''
HAVE_FFMMX_TRUE=''
HAVE_FFMPEG_FALSE='#'
HAVE_FFMPEG_TRUE=''
HAVE_FIG2DEV_FALSE=''
HAVE_FIG2DEV_TRUE=''
HAVE_FLAC_FALSE=''
HAVE_FLAC_TRUE=''
HAVE_FREEBSD_CDROM=''
HAVE_FUSIONSOUND_FALSE=''
HAVE_FUSIONSOUND_TRUE=''
HAVE_GDK_PIXBUF_FALSE=''
HAVE_GDK_PIXBUF_TRUE=''
HAVE_GNOME_VFS_FALSE=''
HAVE_GNOME_VFS_TRUE=''
HAVE_IRIXAL_FALSE=''
HAVE_IRIXAL_TRUE=''
HAVE_JACK=''
HAVE_JACK_FALSE=''
HAVE_JACK_TRUE=''
HAVE_LIBFAME_FALSE=''
HAVE_LIBFAME_TRUE='#'
HAVE_LIBMNG_FALSE=''
HAVE_LIBMNG_TRUE=''
HAVE_LIBRTE_FALSE=''
HAVE_LIBRTE_TRUE='#'
HAVE_LIBSMBCLIENT_FALSE=''
HAVE_LIBSMBCLIENT_TRUE=''
HAVE_LINUX_CDROM=''
HAVE_LINUX_FALSE=''
HAVE_LINUX_TRUE='#'
HAVE_MACOSX_VIDEO_FALSE=''
HAVE_MACOSX_VIDEO_TRUE='#'
HAVE_MLIB_FALSE=''
HAVE_MLIB_TRUE='#'
HAVE_OPENGL_FALSE='#'
HAVE_OPENGL_TRUE=''
HAVE_OSS_FALSE=''
HAVE_OSS_TRUE=''
HAVE_PULSEAUDIO_FALSE=''
HAVE_PULSEAUDIO_TRUE='#'
HAVE_SDL_FALSE='#'
HAVE_SDL_TRUE=''
HAVE_SGMLTOOLS_FALSE=''
HAVE_SGMLTOOLS_TRUE=''
HAVE_SOLARIS_CDROM=''
HAVE_SPEEX_FALSE=''
HAVE_SPEEX_TRUE=''
HAVE_STK_FALSE=''
HAVE_STK_TRUE='#'
HAVE_SUNAUDIO_FALSE=''
HAVE_SUNAUDIO_TRUE=''
HAVE_SUNDGA_FALSE=''
HAVE_SUNDGA_TRUE='#'
HAVE_SUNFB_FALSE=''
HAVE_SUNFB_TRUE='#'
HAVE_SYNCFB_FALSE='#'
HAVE_SYNCFB_TRUE=''
HAVE_THEORA_FALSE=''
HAVE_THEORA_TRUE=''
HAVE_V4L_FALSE=''
HAVE_V4L_TRUE='#'
HAVE_VCDNAV_FALSE=''
HAVE_VCDNAV_TRUE=''
HAVE_VIDIX_FALSE=''
HAVE_VIDIX_TRUE='#'
HAVE_VLDXVMC_FALSE='#'
HAVE_VLDXVMC_TRUE=''
HAVE_VORBIS_FALSE='#'
HAVE_VORBIS_TRUE=''
HAVE_W32DLL_FALSE=''
HAVE_W32DLL_TRUE=''
HAVE_WAND_FALSE=''
HAVE_WAND_TRUE=''
HAVE_WIN32_CDROM=''
HAVE_X11_FALSE='#'
HAVE_X11_TRUE=''
HAVE_XVMC_FALSE='#'
HAVE_XVMC_TRUE=''
HAVE_XV_FALSE='#'
HAVE_XV_TRUE=''
HAVE_XXMC_FALSE='#'
HAVE_XXMC_TRUE=''
HOST_OS_DARWIN_FALSE=''
HOST_OS_DARWIN_TRUE=''
IMPURE_TEXT_LDFLAGS=''
INCLUDES=''
INSTALL_DATA='${INSTALL} -m 644'
INSTALL_M4_FALSE=''
INSTALL_M4_TRUE=''
INSTALL_PROGRAM='${INSTALL}'
INSTALL_SCRIPT='${INSTALL}'
INSTALL_STRIP_PROGRAM='${SHELL} $(install_sh) -c -s'
INTLLIBS=''
INTL_MACOSX_LIBS=''
IRIXAL_CFLAGS=''
IRIXAL_LIBS=''
IRIXAL_STATIC_LIB=''
JACK_CFLAGS=''
JACK_LIBS=''
KSTAT_LIBS=''
LDFLAGS=''
LIBCDIO_CFLAGS=''
LIBCDIO_LIBS=''
LIBDTS_CFLAGS=''
LIBDTS_LIBS=''
LIBFAME_CFLAGS=''
LIBFAME_CONFIG=''
LIBFAME_LIBS=''
LIBFFMPEG_CPPFLAGS=''
LIBFLAC_CFLAGS=''
LIBFLAC_LIBS=''
LIBICONV=''
LIBINTL=''
LIBISO9660_LIBS=''
LIBMAD_CFLAGS=''
LIBMAD_LIBS=''
LIBMODPLUG_CFLAGS=''
LIBMODPLUG_LIBS=''
LIBMPEG2_CFLAGS=''
LIBNAME='libxine1'
LIBOBJS=''
LIBS=''
LIBSMBCLIENT_LIBS=''
LIBSTK_CFLAGS=''
LIBSTK_LIBS=''
LIBTOOL='$(SHELL) $(top_builddir)/libtool'
LIBTOOL_DEPS='./ltmain.sh'
LIBVCDINFO_LIBS=''
LIBVCD_CFLAGS=''
LIBVCD_LIBS=''
LIBVCD_SYSDEP=''
LINUX_CDROM_TIMEOUT=''
LINUX_INCLUDE='-I/usr/src/linux/include'
LN_S='ln -s'
LTLIBICONV=''
LTLIBINTL=''
LTLIBOBJS=''
MAD_FALSE=''
MAD_TRUE=''
MAKEINFO='${SHELL} /var/tmp/portage/xine-lib-1.1.3_pre20060914/work/xine-lib-1.1.3_pre20060914/missing --run makeinfo'
MKINSTALLDIRS='$(top_builddir)/./mkinstalldirs'
MKNOD='mknod'
MLIB_CFLAGS=''
MLIB_LIBS=''
MNG_LIBS=''
MSGFMT='/usr/bin/msgfmt'
MSGMERGE='/usr/bin/msgmerge'
NET_LIBS='-lnsl '
OBJC=''
OBJCDEPMODE=''
OBJCFLAGS=''
OBJDUMP='objdump'
OBJEXT='o'
OPENGL_CFLAGS=''
OPENGL_LIBS='-lGL -lm'
PACKAGE='xine-lib'
PACKAGE_BUGREPORT=''
PACKAGE_NAME=''
PACKAGE_STRING=''
PACKAGE_TARNAME=''
PACKAGE_VERSION=''
PASS1_CFLAGS=''
PASS2_CFLAGS=''
PATH_SEPARATOR=':'
PKG_CONFIG='/usr/bin/pkg-config'
POSUB='po'
PPC_ARCH_FALSE=''
PPC_ARCH_TRUE='#'
PULSEAUDIO_CFLAGS=''
PULSEAUDIO_LIBS=''
RANLIB='x86_64-pc-linux-gnu-ranlib'
RT_LIBS='-lrt'
SDL_CFLAGS='-D_GNU_SOURCE=1 -D_REENTRANT -I/usr/include/SDL '
SDL_LIBS='-lSDL -lpthread '
SET_MAKE=''
SGMLTOOLS=''
SHELL='/bin/sh'
SPEC_VERSION='1.1.3'
SPEEX_CFLAGS=''
SPEEX_LIBS=''
STATIC=''
STRIP='x86_64-pc-linux-gnu-strip'
SUNDGA_CFLAGS=''
SUNDGA_LIBS=''
TAR_NAME='xine-lib-1.1.3'
THEORA_CFLAGS=''
THEORA_LIBS=''
THREAD_CPPFLAGS=''
THREAD_LIBS='-lpthread'
USE_NLS='yes'
VERSION='1.1.3'
VISIBILITY_FLAG=''
VORBIS_CFLAGS=' '
VORBIS_LIBS='-lvorbis -lm -logg '
W32DLL_DEP=''
W32_NO_OPTIMIZE=''
WAND_CFLAGS=''
WAND_LIBS=''
WIN32_CPPFLAGS=''
WIN32_FALSE=''
WIN32_TRUE='#'
XGETTEXT='/usr/bin/xgettext'
XINE_ACFLAGS=''
XINE_BIN_AGE=''
XINE_BUILD_CC=''
XINE_BUILD_DATE=''
XINE_BUILD_OS=''
XINE_CONFIG_PREFIX=''
XINE_DATADIR=''
XINE_FONTDIR=''
XINE_FONTPATH=''
XINE_IFACE_AGE=''
XINE_LOCALEDIR=''
XINE_LOCALEPATH=''
XINE_LT_AGE='14'
XINE_LT_CURRENT='15'
XINE_LT_REVISION='0'
XINE_MAJOR='1'
XINE_MINOR='1'
XINE_PLUGINDIR=''
XINE_PLUGINPATH=''
XINE_SCRIPTPATH=''
XINE_SUB='3'
XMKMF=''
XVMC_LIB='-L -lXvMCW'
XV_LIB='-lXv'
XXMC_LIB='-L -lXvMCW'
X_CFLAGS=''
X_EXTRA_LIBS=''
X_LIBS=' -lXinerama'
X_PRE_LIBS=' -lSM -lICE'
ZLIB_CPPFLAGS=''
ZLIB_LIBS='-lz'
ac_ct_CC=''
ac_ct_CXX=''
am__fastdepCC_FALSE=''
am__fastdepCC_TRUE='#'
am__fastdepCXX_FALSE=''
am__fastdepCXX_TRUE='#'
am__fastdepOBJC_FALSE=''
am__fastdepOBJC_TRUE=''
am__include='include'
am__leading_dot='.'
am__quote=''
am__tar='${AMTAR} chof - "$$tardir"'
am__untar='${AMTAR} xf -'
bindir='${exec_prefix}/bin'
build='x86_64-pc-linux-gnu'
build_alias='x86_64-pc-linux-gnu'
build_cpu='x86_64'
build_os='linux-gnu'
build_vendor='pc'
datadir='/usr/share'
datarootdir='${prefix}/share'
docdir='${datarootdir}/doc/${PACKAGE}'
dvidir='${docdir}'
exec_prefix='NONE'
host='x86_64-pc-linux-gnu'
host_alias='x86_64-pc-linux-gnu'
host_cpu='x86_64'
host_os='linux-gnu'
host_vendor='pc'
htmldir='${docdir}'
includedir='${prefix}/include'
infodir='/usr/share/info'
install_sh='/var/tmp/portage/xine-lib-1.1.3_pre20060914/work/xine-lib-1.1.3_pre20060914/install-sh'
libdir='/usr/lib64'
libexecdir='${exec_prefix}/libexec'
localedir='${datarootdir}/locale'
localstatedir='/var/lib'
mandir='/usr/share/man'
mkdir_p='mkdir -p --'
oldincludedir='/usr/include'
pdfdir='${docdir}'
prefix='/usr'
program_transform_name='s,x,x,'
psdir='${docdir}'
sbindir='${exec_prefix}/sbin'
sharedstatedir='${prefix}/com'
sysconfdir='/etc'
target_alias=''
w32_path=''
## ----------- ##
## confdefs.h. ##
## ----------- ##
#define PACKAGE_NAME ""
#define PACKAGE_TARNAME ""
#define PACKAGE_VERSION ""
#define PACKAGE_STRING ""
#define PACKAGE_BUGREPORT ""
#define XINE_MAJOR 1
#define XINE_MINOR 1
#define XINE_SUB 3
#define XINE_TEXTDOMAIN "libxine1"
#define PACKAGE "xine-lib"
#define VERSION "1.1.3"
#define STDC_HEADERS 1
#define HAVE_SYS_TYPES_H 1
#define HAVE_SYS_STAT_H 1
#define HAVE_STDLIB_H 1
#define HAVE_STRING_H 1
#define HAVE_MEMORY_H 1
#define HAVE_STRINGS_H 1
#define HAVE_INTTYPES_H 1
#define HAVE_STDINT_H 1
#define HAVE_UNISTD_H 1
#define HAVE_DLFCN_H 1
#define HAVE_ICONV 1
#define ICONV_CONST
#define ENABLE_NLS 1
#define HAVE_GETTEXT 1
#define HAVE_DCGETTEXT 1
#define HAVE_NL_LANGINFO 1
#define SIZEOF_LONG 8
#define _GNU_SOURCE 1
#define HAVE_FFMPEG 1
#define HAVE_LRINTF 1
#define _ISOC9X_SOURCE 1
#define HAVE_RINTF 1
#define HAVE_X11 1
#define LIBX11_SO "libX11.so.6"
#define LIBXV_SO "libXv.so.1"
#define ENABLE_IPV6 1
#define HAVE_POSIX_TIMERS 1
#define HAVE_OPENGL 1
#define HAVE_GLU 1
#define HAVE_X11_EXTENSIONS_XSHM_H 1
#define HAVE_XV 1
#define HAVE_X11_EXTENSIONS_VLDXVMC_H 1
#define HAVE_VLDXVMC 1
#define HAVE_X11_EXTENSIONS_XVMC_H 1
#define HAVE_XXMC 1
#define HAVE_X11_EXTENSIONS_XVMC_H 1
#define HAVE_XVMC 1
#define HAVE_XINERAMA 1
#define HAVE_FB 1
#define HAVE_SDL 1
configure: exit 1