krb_check_auth.c:56: error: conflicting types for 'krb_check_auth'
./krb-protos.h:175: error: previous declaration of 'krb_check_auth' was here
krb_check_auth.c: In function 'krb_check_auth':
krb_check_auth.c:61: warning: passing argument 3 of 'krb_rd_priv' from incompati
ble pointer type
make[2]: *** [krb_check_auth.lo] Error 1
make[2]: Leaving directory `/var/tmp/portage/kth-krb-1.2.2-r2/work/krb4-1.2.2/li
b/krb'
make[1]: *** [all-recursive] Error 1
make[1]: Leaving directory `/var/tmp/portage/kth-krb-1.2.2-r2/work/krb4-1.2.2/li
b'
make: *** [all-recursive] Error 1
!!! ERROR: app-crypt/kth-krb-1.2.2-r2 failed.
Call stack:
ebuild.sh, line 1546: Called dyn_compile
ebuild.sh, line 937: Called src_compile
kth-krb-1.2.2-r2.ebuild, line 46: Called die
!!! (no error message)
!!! If you need support, post the topmost build error, and the call stack if rel
evant.