rendered paste bodyThis file contains any messages produced by compilers while
running configure, to aid debugging if configure makes a mistake.
It was created by ArcEmu configure 1.5, which was
generated by GNU Autoconf 2.65. Invocation command line was
$ ./configure --prefix=/usr --enable-optimize
## --------- ##
## Platform. ##
## --------- ##
hostname = ioni-laptop
uname -m = x86_64
uname -r = 2.6.32-ARCH
uname -s = Linux
uname -v = #7 SMP PREEMPT Fri Dec 4 15:39:16 CET 2009
/usr/bin/uname -p = unknown
/bin/uname -X = unknown
/bin/arch = x86_64
/usr/bin/arch -k = unknown
/usr/convex/getsysinfo = unknown
/usr/bin/hostinfo = unknown
/bin/machine = unknown
/usr/bin/oslevel = unknown
/bin/universe = unknown
PATH: /opt/wine/bin
PATH: /bin
PATH: /usr/bin
PATH: /sbin
PATH: /usr/sbin
PATH: /usr/share/java/apache-ant/bin
PATH: /opt/java/bin
PATH: /opt/java/jre/bin
PATH: /usr/bin/perlbin/site
PATH: /usr/bin/perlbin/vendor
PATH: /usr/bin/perlbin/core
## ----------- ##
## Core tests. ##
## ----------- ##
configure:2539: checking for a BSD-compatible install
configure:2607: result: /bin/install -c
configure:2618: checking whether build environment is sane
configure:2668: result: yes
configure:2809: checking for a thread-safe mkdir -p
configure:2848: result: /bin/mkdir -p
configure:2861: checking for gawk
configure:2877: found /bin/gawk
configure:2888: result: gawk
configure:2899: checking whether make sets $(MAKE)
configure:2921: result: yes
configure:3002: checking whether to enable maintainer-specific portions of Makefiles
configure:3011: result: no
configure:3074: checking for gcc
configure:3090: found /usr/bin/gcc
configure:3101: result: gcc
configure:3330: checking for C compiler version
configure:3339: gcc --version >&5
gcc (GCC) 4.4.2
Copyright (C) 2009 Free Software Foundation, Inc.
This is free software; see the source for copying conditions. There is NO
warranty; not even for MERCHANTABILITY or FITNESS FOR A PARTICULAR PURPOSE.
configure:3350: $? = 0
configure:3339: gcc -v >&5
Using built-in specs.
Target: x86_64-unknown-linux-gnu
Configured with: ../configure --prefix=/usr --enable-shared --enable-languages=c,c++,fortran,objc,obj-c++,ada --enable-threads=posix --mandir=/usr/share/man --infodir=/usr/share/info --enable-__cxa_atexit --disable-multilib --libdir=/usr/lib --libexecdir=/usr/lib --enable-clocale=gnu --disable-libstdcxx-pch --with-tune=generic
Thread model: posix
gcc version 4.4.2 (GCC)
configure:3350: $? = 0
configure:3339: gcc -V >&5
gcc: '-V' option must have argument
configure:3350: $? = 1
configure:3339: gcc -qversion >&5
gcc: unrecognized option '-qversion'
gcc: no input files
configure:3350: $? = 1
configure:3370: checking whether the C compiler works
configure:3392: gcc -march=x86-64 -mtune=generic -O2 -pipe -L/usr/lib -L/usr/local/lib conftest.c >&5
configure:3396: $? = 0
configure:3445: result: yes
configure:3448: checking for C compiler default output file name
configure:3450: result: a.out
configure:3456: checking for suffix of executables
configure:3463: gcc -o conftest -march=x86-64 -mtune=generic -O2 -pipe -L/usr/lib -L/usr/local/lib conftest.c >&5
configure:3467: $? = 0
configure:3489: result:
configure:3511: checking whether we are cross compiling
configure:3519: gcc -o conftest -march=x86-64 -mtune=generic -O2 -pipe -L/usr/lib -L/usr/local/lib conftest.c >&5
configure:3523: $? = 0
configure:3530: ./conftest
configure:3534: $? = 0
configure:3549: result: no
configure:3554: checking for suffix of object files
configure:3576: gcc -c -march=x86-64 -mtune=generic -O2 -pipe conftest.c >&5
configure:3580: $? = 0
configure:3601: result: o
configure:3605: checking whether we are using the GNU C compiler
configure:3624: gcc -c -march=x86-64 -mtune=generic -O2 -pipe conftest.c >&5
configure:3624: $? = 0
configure:3633: result: yes
configure:3642: checking whether gcc accepts -g
configure:3662: gcc -c -g conftest.c >&5
configure:3662: $? = 0
configure:3703: result: yes
configure:3720: checking for gcc option to accept ISO C89
configure:3784: gcc -c -march=x86-64 -mtune=generic -O2 -pipe conftest.c >&5
configure:3784: $? = 0
configure:3797: result: none needed
configure:3828: checking for style of include used by make
configure:3856: result: GNU
configure:3881: checking dependency style of gcc
configure:3991: result: gcc3
configure:4064: checking for g++
configure:4080: found /usr/bin/g++
configure:4091: result: g++
configure:4118: checking for C++ compiler version
configure:4127: g++ --version >&5
g++ (GCC) 4.4.2
Copyright (C) 2009 Free Software Foundation, Inc.
This is free software; see the source for copying conditions. There is NO
warranty; not even for MERCHANTABILITY or FITNESS FOR A PARTICULAR PURPOSE.
configure:4138: $? = 0
configure:4127: g++ -v >&5
Using built-in specs.
Target: x86_64-unknown-linux-gnu
Configured with: ../configure --prefix=/usr --enable-shared --enable-languages=c,c++,fortran,objc,obj-c++,ada --enable-threads=posix --mandir=/usr/share/man --infodir=/usr/share/info --enable-__cxa_atexit --disable-multilib --libdir=/usr/lib --libexecdir=/usr/lib --enable-clocale=gnu --disable-libstdcxx-pch --with-tune=generic
Thread model: posix
gcc version 4.4.2 (GCC)
configure:4138: $? = 0
configure:4127: g++ -V >&5
g++: '-V' option must have argument
configure:4138: $? = 1
configure:4127: g++ -qversion >&5
g++: unrecognized option '-qversion'
g++: no input files
configure:4138: $? = 1
configure:4142: checking whether we are using the GNU C++ compiler
configure:4161: g++ -c -march=x86-64 -mtune=generic -O2 -pipe conftest.cpp >&5
configure:4161: $? = 0
configure:4170: result: yes
configure:4179: checking whether g++ accepts -g
configure:4199: g++ -c -g conftest.cpp >&5
configure:4199: $? = 0
configure:4240: result: yes
configure:4265: checking dependency style of g++
configure:4375: result: gcc3
configure:4419: checking build system type
configure:4433: result: x86_64-unknown-linux-gnu
configure:4453: checking host system type
configure:4466: result: x86_64-unknown-linux-gnu
configure:4486: checking for a sed that does not truncate output
configure:4550: result: /bin/sed
configure:4568: checking for grep that handles long lines and -e
configure:4626: result: /bin/grep
configure:4631: checking for egrep
configure:4693: result: /bin/grep -E
configure:4698: checking for fgrep
configure:4760: result: /bin/grep -F
configure:4795: checking for ld used by gcc
configure:4862: result: /usr/bin/ld
configure:4869: checking if the linker (/usr/bin/ld) is GNU ld
configure:4884: result: yes
configure:4896: checking for BSD- or MS-compatible name lister (nm)
configure:4945: result: /usr/bin/nm -B
configure:5063: checking the name lister (/usr/bin/nm -B) interface
configure:5070: gcc -c -march=x86-64 -mtune=generic -O2 -pipe conftest.c >&5
configure:5073: /usr/bin/nm -B "conftest.o"
configure:5076: output
0000000000000000 B some_variable
configure:5083: result: BSD nm
configure:5086: checking whether ln -s works
configure:5090: result: yes
configure:5098: checking the maximum length of command line arguments
configure:5218: result: 1572864
configure:5235: checking whether the shell understands some XSI constructs
configure:5245: result: yes
configure:5249: checking whether the shell understands "+="
configure:5255: result: yes
configure:5290: checking for /usr/bin/ld option to reload object files
configure:5297: result: -r
configure:5366: checking for objdump
configure:5382: found /usr/bin/objdump
configure:5393: result: objdump
configure:5425: checking how to recognize dependent libraries
configure:5621: result: pass_all
configure:5681: checking for ar
configure:5697: found /usr/bin/ar
configure:5708: result: ar
configure:5786: checking for strip
configure:5802: found /usr/bin/strip
configure:5813: result: strip
configure:5885: checking for ranlib
configure:5901: found /usr/bin/ranlib
configure:5912: result: ranlib
configure:6002: checking command to parse /usr/bin/nm -B output from gcc object
configure:6120: gcc -c -march=x86-64 -mtune=generic -O2 -pipe conftest.c >&5
configure:6123: $? = 0
configure:6127: /usr/bin/nm -B conftest.o \| sed -n -e 's/^.*[ ]\([ABCDGIRSTW][ABCDGIRSTW]*\)[ ][ ]*\([_A-Za-z][_A-Za-z0-9]*\)$/\1 \2 \2/p' \> conftest.nm
configure:6130: $? = 0
configure:6184: gcc -o conftest -march=x86-64 -mtune=generic -O2 -pipe -L/usr/lib -L/usr/local/lib conftest.c conftstm.o >&5
configure:6187: $? = 0
configure:6225: result: ok
configure:6321: gcc -c -march=x86-64 -mtune=generic -O2 -pipe conftest.c >&5
configure:6324: $? = 0
configure:7034: checking how to run the C preprocessor
configure:7065: gcc -E conftest.c
configure:7065: $? = 0
configure:7079: gcc -E conftest.c
conftest.c:11:28: error: ac_nonexistent.h: No such file or directory
configure:7079: $? = 1
configure: failed program was:
| /* confdefs.h */
| #define PACKAGE_NAME "ArcEmu"
| #define PACKAGE_TARNAME "arcemu"
| #define PACKAGE_VERSION "1.5"
| #define PACKAGE_STRING "ArcEmu 1.5"
| #define PACKAGE_BUGREPORT "www.arcemu.org"
| #define PACKAGE_URL ""
| #define PACKAGE "arcemu"
| #define VERSION "1.5"
| /* end confdefs.h. */
| #include <ac_nonexistent.h>
configure:7104: result: gcc -E
configure:7124: gcc -E conftest.c
configure:7124: $? = 0
configure:7138: gcc -E conftest.c
conftest.c:11:28: error: ac_nonexistent.h: No such file or directory
configure:7138: $? = 1
configure: failed program was:
| /* confdefs.h */
| #define PACKAGE_NAME "ArcEmu"
| #define PACKAGE_TARNAME "arcemu"
| #define PACKAGE_VERSION "1.5"
| #define PACKAGE_STRING "ArcEmu 1.5"
| #define PACKAGE_BUGREPORT "www.arcemu.org"
| #define PACKAGE_URL ""
| #define PACKAGE "arcemu"
| #define VERSION "1.5"
| /* end confdefs.h. */
| #include <ac_nonexistent.h>
configure:7167: checking for ANSI C header files
configure:7187: gcc -c -march=x86-64 -mtune=generic -O2 -pipe conftest.c >&5
configure:7187: $? = 0
configure:7260: gcc -o conftest -march=x86-64 -mtune=generic -O2 -pipe -L/usr/lib -L/usr/local/lib conftest.c >&5
configure:7260: $? = 0
configure:7260: ./conftest
configure:7260: $? = 0
configure:7271: result: yes
configure:7284: checking for sys/types.h
configure:7284: gcc -c -march=x86-64 -mtune=generic -O2 -pipe conftest.c >&5
configure:7284: $? = 0
configure:7284: result: yes
configure:7284: checking for sys/stat.h
configure:7284: gcc -c -march=x86-64 -mtune=generic -O2 -pipe conftest.c >&5
configure:7284: $? = 0
configure:7284: result: yes
configure:7284: checking for stdlib.h
configure:7284: gcc -c -march=x86-64 -mtune=generic -O2 -pipe conftest.c >&5
configure:7284: $? = 0
configure:7284: result: yes
configure:7284: checking for string.h
configure:7284: gcc -c -march=x86-64 -mtune=generic -O2 -pipe conftest.c >&5
configure:7284: $? = 0
configure:7284: result: yes
configure:7284: checking for memory.h
configure:7284: gcc -c -march=x86-64 -mtune=generic -O2 -pipe conftest.c >&5
configure:7284: $? = 0
configure:7284: result: yes
configure:7284: checking for strings.h
configure:7284: gcc -c -march=x86-64 -mtune=generic -O2 -pipe conftest.c >&5
configure:7284: $? = 0
configure:7284: result: yes
configure:7284: checking for inttypes.h
configure:7284: gcc -c -march=x86-64 -mtune=generic -O2 -pipe conftest.c >&5
configure:7284: $? = 0
configure:7284: result: yes
configure:7284: checking for stdint.h
configure:7284: gcc -c -march=x86-64 -mtune=generic -O2 -pipe conftest.c >&5
configure:7284: $? = 0
configure:7284: result: yes
configure:7284: checking for unistd.h
configure:7284: gcc -c -march=x86-64 -mtune=generic -O2 -pipe conftest.c >&5
configure:7284: $? = 0
configure:7284: result: yes
configure:7299: checking for dlfcn.h
configure:7299: gcc -c -march=x86-64 -mtune=generic -O2 -pipe conftest.c >&5
configure:7299: $? = 0
configure:7299: result: yes
configure:7424: checking for C++ compiler version
configure:7433: g++ --version >&5
g++ (GCC) 4.4.2
Copyright (C) 2009 Free Software Foundation, Inc.
This is free software; see the source for copying conditions. There is NO
warranty; not even for MERCHANTABILITY or FITNESS FOR A PARTICULAR PURPOSE.
configure:7444: $? = 0
configure:7433: g++ -v >&5
Using built-in specs.
Target: x86_64-unknown-linux-gnu
Configured with: ../configure --prefix=/usr --enable-shared --enable-languages=c,c++,fortran,objc,obj-c++,ada --enable-threads=posix --mandir=/usr/share/man --infodir=/usr/share/info --enable-__cxa_atexit --disable-multilib --libdir=/usr/lib --libexecdir=/usr/lib --enable-clocale=gnu --disable-libstdcxx-pch --with-tune=generic
Thread model: posix
gcc version 4.4.2 (GCC)
configure:7444: $? = 0
configure:7433: g++ -V >&5
g++: '-V' option must have argument
configure:7444: $? = 1
configure:7433: g++ -qversion >&5
g++: unrecognized option '-qversion'
g++: no input files
configure:7444: $? = 1
configure:7448: checking whether we are using the GNU C++ compiler
configure:7476: result: yes
configure:7485: checking whether g++ accepts -g
configure:7546: result: yes
configure:7571: checking dependency style of g++
configure:7681: result: gcc3
configure:7704: checking how to run the C++ preprocessor
configure:7731: g++ -E conftest.cpp
configure:7731: $? = 0
configure:7745: g++ -E conftest.cpp
conftest.cpp:22:28: error: ac_nonexistent.h: No such file or directory
configure:7745: $? = 1
configure: failed program was:
| /* confdefs.h */
| #define PACKAGE_NAME "ArcEmu"
| #define PACKAGE_TARNAME "arcemu"
| #define PACKAGE_VERSION "1.5"
| #define PACKAGE_STRING "ArcEmu 1.5"
| #define PACKAGE_BUGREPORT "www.arcemu.org"
| #define PACKAGE_URL ""
| #define PACKAGE "arcemu"
| #define VERSION "1.5"
| #define STDC_HEADERS 1
| #define HAVE_SYS_TYPES_H 1
| #define HAVE_SYS_STAT_H 1
| #define HAVE_STDLIB_H 1
| #define HAVE_STRING_H 1
| #define HAVE_MEMORY_H 1
| #define HAVE_STRINGS_H 1
| #define HAVE_INTTYPES_H 1
| #define HAVE_STDINT_H 1
| #define HAVE_UNISTD_H 1
| #define HAVE_DLFCN_H 1
| /* end confdefs.h. */
| #include <ac_nonexistent.h>
configure:7770: result: g++ -E
configure:7790: g++ -E conftest.cpp
configure:7790: $? = 0
configure:7804: g++ -E conftest.cpp
conftest.cpp:22:28: error: ac_nonexistent.h: No such file or directory
configure:7804: $? = 1
configure: failed program was:
| /* confdefs.h */
| #define PACKAGE_NAME "ArcEmu"
| #define PACKAGE_TARNAME "arcemu"
| #define PACKAGE_VERSION "1.5"
| #define PACKAGE_STRING "ArcEmu 1.5"
| #define PACKAGE_BUGREPORT "www.arcemu.org"
| #define PACKAGE_URL ""
| #define PACKAGE "arcemu"
| #define VERSION "1.5"
| #define STDC_HEADERS 1
| #define HAVE_SYS_TYPES_H 1
| #define HAVE_SYS_STAT_H 1
| #define HAVE_STDLIB_H 1
| #define HAVE_STRING_H 1
| #define HAVE_MEMORY_H 1
| #define HAVE_STRINGS_H 1
| #define HAVE_INTTYPES_H 1
| #define HAVE_STDINT_H 1
| #define HAVE_UNISTD_H 1
| #define HAVE_DLFCN_H 1
| /* end confdefs.h. */
| #include <ac_nonexistent.h>
configure:8010: checking for objdir
configure:8025: result: .libs
configure:8321: checking if gcc supports -fno-rtti -fno-exceptions
configure:8339: gcc -c -march=x86-64 -mtune=generic -O2 -pipe -fno-rtti -fno-exceptions conftest.c >&5
cc1: warning: command line option "-fno-rtti" is valid for C++/ObjC++ but not for C
configure:8343: $? = 0
configure:8356: result: no
configure:8376: checking for gcc option to produce PIC
configure:8648: result: -fPIC -DPIC
configure:8660: checking if gcc PIC flag -fPIC -DPIC works
configure:8678: gcc -c -march=x86-64 -mtune=generic -O2 -pipe -fPIC -DPIC -DPIC conftest.c >&5
configure:8682: $? = 0
configure:8695: result: yes
configure:8719: checking if gcc static flag -static works
configure:8747: result: yes
configure:8762: checking if gcc supports -c -o file.o
configure:8783: gcc -c -march=x86-64 -mtune=generic -O2 -pipe -o out/conftest2.o conftest.c >&5
configure:8787: $? = 0
configure:8809: result: yes
configure:8817: checking if gcc supports -c -o file.o
configure:8864: result: yes
configure:8897: checking whether the gcc linker (/usr/bin/ld -m elf_x86_64) supports shared libraries
configure:9883: result: yes
configure:9920: checking whether -lc should be explicitly linked in
configure:9925: gcc -c -march=x86-64 -mtune=generic -O2 -pipe conftest.c >&5
configure:9928: $? = 0
configure:9943: gcc -shared conftest.o -v -Wl,-soname -Wl,conftest -o conftest 2\>\&1 \| /bin/grep -lc \>/dev/null 2\>\&1
configure:9946: $? = 0
configure:9958: result: no
configure:10122: checking dynamic linker characteristics
configure:10555: gcc -o conftest -march=x86-64 -mtune=generic -O2 -pipe -L/usr/lib -L/usr/local/lib -Wl,-rpath -Wl,/foo conftest.c >&5
configure:10555: $? = 0
configure:10773: result: GNU/Linux ld.so
configure:10875: checking how to hardcode library paths into programs
configure:10900: result: immediate
configure:11420: checking whether stripping libraries is possible
configure:11425: result: yes
configure:11460: checking if libtool supports shared libraries
configure:11462: result: yes
configure:11465: checking whether to build shared libraries
configure:11486: result: yes
configure:11489: checking whether to build static libraries
configure:11493: result: yes
configure:11643: checking for ld used by g++
configure:11710: result: /usr/bin/ld -m elf_x86_64
configure:11717: checking if the linker (/usr/bin/ld -m elf_x86_64) is GNU ld
configure:11732: result: yes
configure:11787: checking whether the g++ linker (/usr/bin/ld -m elf_x86_64) supports shared libraries
configure:12700: result: yes
configure:12728: g++ -c -march=x86-64 -mtune=generic -O2 -pipe conftest.cpp >&5
configure:12731: $? = 0
configure:12913: checking for g++ option to produce PIC
configure:13230: result: -fPIC -DPIC
configure:13239: checking if g++ PIC flag -fPIC -DPIC works
configure:13257: g++ -c -march=x86-64 -mtune=generic -O2 -pipe -fPIC -DPIC -DPIC conftest.cpp >&5
configure:13261: $? = 0
configure:13274: result: yes
configure:13295: checking if g++ static flag -static works
configure:13323: result: yes
configure:13335: checking if g++ supports -c -o file.o
configure:13356: g++ -c -march=x86-64 -mtune=generic -O2 -pipe -o out/conftest2.o conftest.cpp >&5
configure:13360: $? = 0
configure:13382: result: yes
configure:13387: checking if g++ supports -c -o file.o
configure:13434: result: yes
configure:13464: checking whether the g++ linker (/usr/bin/ld -m elf_x86_64) supports shared libraries
configure:13490: result: yes
configure:13627: checking dynamic linker characteristics
configure:14008: g++ -o conftest -march=x86-64 -mtune=generic -O2 -pipe -L/usr/lib -L/usr/local/lib -Wl,-rpath -Wl,/foo conftest.cpp >&5
configure:14008: $? = 0
configure:14226: result: GNU/Linux ld.so
configure:14277: checking how to hardcode library paths into programs
configure:14302: result: immediate
configure:14381: checking uname -s for detecting host operating system
configure:14391: result: Linux
configure:14406: checking uname -m for detecting host operating system architecture
configure:14419: result: x64 feel teh power
configure:14436: checking whether byte ordering is bigendian
configure:14451: gcc -c -march=x86-64 -mtune=generic -O2 -pipe conftest.c >&5
conftest.c:25: error: expected '=', ',', ';', 'asm' or '__attribute__' before 'a'
configure:14451: $? = 1
configure: failed program was:
| /* confdefs.h */
| #define PACKAGE_NAME "ArcEmu"
| #define PACKAGE_TARNAME "arcemu"
| #define PACKAGE_VERSION "1.5"
| #define PACKAGE_STRING "ArcEmu 1.5"
| #define PACKAGE_BUGREPORT "www.arcemu.org"
| #define PACKAGE_URL ""
| #define PACKAGE "arcemu"
| #define VERSION "1.5"
| #define STDC_HEADERS 1
| #define HAVE_SYS_TYPES_H 1
| #define HAVE_SYS_STAT_H 1
| #define HAVE_STDLIB_H 1
| #define HAVE_STRING_H 1
| #define HAVE_MEMORY_H 1
| #define HAVE_STRINGS_H 1
| #define HAVE_INTTYPES_H 1
| #define HAVE_STDINT_H 1
| #define HAVE_UNISTD_H 1
| #define HAVE_DLFCN_H 1
| #define LT_OBJDIR ".libs/"
| #define X64 1
| /* end confdefs.h. */
| #ifndef __APPLE_CC__
| not a universal capable compiler
| #endif
| typedef int dummy;
|
configure:14496: gcc -c -march=x86-64 -mtune=generic -O2 -pipe conftest.c >&5
configure:14496: $? = 0
configure:14514: gcc -c -march=x86-64 -mtune=generic -O2 -pipe conftest.c >&5
conftest.c: In function 'main':
conftest.c:31: error: 'not' undeclared (first use in this function)
conftest.c:31: error: (Each undeclared identifier is reported only once
conftest.c:31: error: for each function it appears in.)
conftest.c:31: error: expected ';' before 'big'
configure:14514: $? = 1
configure: failed program was:
| /* confdefs.h */
| #define PACKAGE_NAME "ArcEmu"
| #define PACKAGE_TARNAME "arcemu"
| #define PACKAGE_VERSION "1.5"
| #define PACKAGE_STRING "ArcEmu 1.5"
| #define PACKAGE_BUGREPORT "www.arcemu.org"
| #define PACKAGE_URL ""
| #define PACKAGE "arcemu"
| #define VERSION "1.5"
| #define STDC_HEADERS 1
| #define HAVE_SYS_TYPES_H 1
| #define HAVE_SYS_STAT_H 1
| #define HAVE_STDLIB_H 1
| #define HAVE_STRING_H 1
| #define HAVE_MEMORY_H 1
| #define HAVE_STRINGS_H 1
| #define HAVE_INTTYPES_H 1
| #define HAVE_STDINT_H 1
| #define HAVE_UNISTD_H 1
| #define HAVE_DLFCN_H 1
| #define LT_OBJDIR ".libs/"
| #define X64 1
| /* end confdefs.h. */
| #include <sys/types.h>
| #include <sys/param.h>
|
| int
| main ()
| {
| #if BYTE_ORDER != BIG_ENDIAN
| not big endian
| #endif
|
| ;
| return 0;
| }
configure:14642: result: no
configure:14664: checking for svn
configure:14680: found /usr/bin/svn
configure:14691: result: yes
configure:14709: checking if g++ supports C++0x features without additional flags
configure:14746: g++ -c -march=x86-64 -mtune=generic -O2 -pipe -I/usr/include -I/usr/local/include -Wall -fno-strict-aliasing conftest.cpp >&5
conftest.cpp:29: warning: identifier 'static_assert' will become a keyword in C++0x
conftest.cpp:35: warning: identifier 'decltype' will become a keyword in C++0x
conftest.cpp:29: error: expected identifier before 'sizeof'
conftest.cpp:29: error: expected ',' or '...' before 'sizeof'
conftest.cpp:29: error: ISO C++ forbids declaration of 'static_assert' with no type
conftest.cpp:32: error: '>>' should be '> >' within a nested template argument list
conftest.cpp:35: error: expected constructor, destructor, or type conversion before '(' token
conftest.cpp:39: error: expected unqualified-id before '&&' token
configure:14746: $? = 1
configure: failed program was:
| /* confdefs.h */
| #define PACKAGE_NAME "ArcEmu"
| #define PACKAGE_TARNAME "arcemu"
| #define PACKAGE_VERSION "1.5"
| #define PACKAGE_STRING "ArcEmu 1.5"
| #define PACKAGE_BUGREPORT "www.arcemu.org"
| #define PACKAGE_URL ""
| #define PACKAGE "arcemu"
| #define VERSION "1.5"
| #define STDC_HEADERS 1
| #define HAVE_SYS_TYPES_H 1
| #define HAVE_SYS_STAT_H 1
| #define HAVE_STDLIB_H 1
| #define HAVE_STRING_H 1
| #define HAVE_MEMORY_H 1
| #define HAVE_STRINGS_H 1
| #define HAVE_INTTYPES_H 1
| #define HAVE_STDINT_H 1
| #define HAVE_UNISTD_H 1
| #define HAVE_DLFCN_H 1
| #define LT_OBJDIR ".libs/"
| #define X64 1
| #define USING_LITTLE_ENDIAN 1
| /* end confdefs.h. */
|
| template <typename T>
| struct check
| {
| static_assert(sizeof(int) <= sizeof(T), "not big enough");
| };
|
| typedef check<check<bool>> right_angle_brackets;
|
| int a;
| decltype(a) b;
|
| typedef check<int> check_type;
| check_type c;
| check_type&& cr = c;
| int
| main ()
| {
|
| ;
| return 0;
| }
configure:14760: result: no
configure:14763: checking if g++ supports C++0x features with -std=c++0x
configure:14802: g++ -c -march=x86-64 -mtune=generic -O2 -pipe -I/usr/include -I/usr/local/include -Wall -fno-strict-aliasing -std=c++0x conftest.cpp >&5
configure:14802: $? = 0
configure:14817: result: yes
configure:14820: checking if g++ supports C++0x features with -std=gnu++0x
configure:14859: g++ -c -march=x86-64 -mtune=generic -O2 -pipe -I/usr/include -I/usr/local/include -Wall -fno-strict-aliasing -std=gnu++0x conftest.cpp >&5
configure:14859: $? = 0
configure:14874: result: yes
configure:15059: checking for the pthreads library -lpthreads
configure:15092: gcc -o conftest -march=x86-64 -mtune=generic -O2 -pipe -I/usr/include -I/usr/local/include -Wall -fno-strict-aliasing -L/usr/lib -L/usr/local/lib conftest.c -lpthreads >&5
conftest.c: In function 'main':
conftest.c:31: warning: null argument where non-null required (argument 1)
conftest.c:32: warning: null argument where non-null required (argument 1)
conftest.c:32: warning: null argument where non-null required (argument 3)
conftest.c:30: warning: 'th' is used uninitialized in this function
/usr/bin/ld: cannot find -lpthreads
collect2: ld returned 1 exit status
configure:15092: $? = 1
configure: failed program was:
| /* confdefs.h */
| #define PACKAGE_NAME "ArcEmu"
| #define PACKAGE_TARNAME "arcemu"
| #define PACKAGE_VERSION "1.5"
| #define PACKAGE_STRING "ArcEmu 1.5"
| #define PACKAGE_BUGREPORT "www.arcemu.org"
| #define PACKAGE_URL ""
| #define PACKAGE "arcemu"
| #define VERSION "1.5"
| #define STDC_HEADERS 1
| #define HAVE_SYS_TYPES_H 1
| #define HAVE_SYS_STAT_H 1
| #define HAVE_STDLIB_H 1
| #define HAVE_STRING_H 1
| #define HAVE_MEMORY_H 1
| #define HAVE_STRINGS_H 1
| #define HAVE_INTTYPES_H 1
| #define HAVE_STDINT_H 1
| #define HAVE_UNISTD_H 1
| #define HAVE_DLFCN_H 1
| #define LT_OBJDIR ".libs/"
| #define X64 1
| #define USING_LITTLE_ENDIAN 1
| #define HAVE_STDCXX_0X /**/
| /* end confdefs.h. */
| #include <pthread.h>
| int
| main ()
| {
| pthread_t th; pthread_join(th, 0);
| pthread_attr_init(0); pthread_cleanup_push(0, 0);
| pthread_create(0,0,0,0); pthread_cleanup_pop(0);
| ;
| return 0;
| }
configure:15101: result: no
configure:15004: checking whether pthreads work without any flags
configure:15092: gcc -o conftest -march=x86-64 -mtune=generic -O2 -pipe -I/usr/include -I/usr/local/include -Wall -fno-strict-aliasing -L/usr/lib -L/usr/local/lib conftest.c >&5
conftest.c: In function 'main':
conftest.c:31: warning: null argument where non-null required (argument 1)
conftest.c:32: warning: null argument where non-null required (argument 1)
conftest.c:32: warning: null argument where non-null required (argument 3)
conftest.c:30: warning: 'th' is used uninitialized in this function
/tmp/cc9AlZRY.o: In function `main':
conftest.c:(.text+0xa): undefined reference to `pthread_join'
conftest.c:(.text+0x27): undefined reference to `__pthread_register_cancel'
conftest.c:(.text+0x34): undefined reference to `pthread_create'
conftest.c:(.text+0x3c): undefined reference to `__pthread_unregister_cancel'
collect2: ld returned 1 exit status
configure:15092: $? = 1
configure: failed program was:
| /* confdefs.h */
| #define PACKAGE_NAME "ArcEmu"
| #define PACKAGE_TARNAME "arcemu"
| #define PACKAGE_VERSION "1.5"
| #define PACKAGE_STRING "ArcEmu 1.5"
| #define PACKAGE_BUGREPORT "www.arcemu.org"
| #define PACKAGE_URL ""
| #define PACKAGE "arcemu"
| #define VERSION "1.5"
| #define STDC_HEADERS 1
| #define HAVE_SYS_TYPES_H 1
| #define HAVE_SYS_STAT_H 1
| #define HAVE_STDLIB_H 1
| #define HAVE_STRING_H 1
| #define HAVE_MEMORY_H 1
| #define HAVE_STRINGS_H 1
| #define HAVE_INTTYPES_H 1
| #define HAVE_STDINT_H 1
| #define HAVE_UNISTD_H 1
| #define HAVE_DLFCN_H 1
| #define LT_OBJDIR ".libs/"
| #define X64 1
| #define USING_LITTLE_ENDIAN 1
| #define HAVE_STDCXX_0X /**/
| /* end confdefs.h. */
| #include <pthread.h>
| int
| main ()
| {
| pthread_t th; pthread_join(th, 0);
| pthread_attr_init(0); pthread_cleanup_push(0, 0);
| pthread_create(0,0,0,0); pthread_cleanup_pop(0);
| ;
| return 0;
| }
configure:15101: result: no
configure:15009: checking whether pthreads work with -Kthread
configure:15092: gcc -o conftest -march=x86-64 -mtune=generic -O2 -pipe -I/usr/include -I/usr/local/include -Wall -fno-strict-aliasing -Kthread -L/usr/lib -L/usr/local/lib conftest.c >&5
gcc: unrecognized option '-Kthread'
conftest.c: In function 'main':
conftest.c:31: warning: null argument where non-null required (argument 1)
conftest.c:32: warning: null argument where non-null required (argument 1)
conftest.c:32: warning: null argument where non-null required (argument 3)
conftest.c:30: warning: 'th' is used uninitialized in this function
/tmp/cclw5WI3.o: In function `main':
conftest.c:(.text+0xa): undefined reference to `pthread_join'
conftest.c:(.text+0x27): undefined reference to `__pthread_register_cancel'
conftest.c:(.text+0x34): undefined reference to `pthread_create'
conftest.c:(.text+0x3c): undefined reference to `__pthread_unregister_cancel'
collect2: ld returned 1 exit status
configure:15092: $? = 1
configure: failed program was:
| /* confdefs.h */
| #define PACKAGE_NAME "ArcEmu"
| #define PACKAGE_TARNAME "arcemu"
| #define PACKAGE_VERSION "1.5"
| #define PACKAGE_STRING "ArcEmu 1.5"
| #define PACKAGE_BUGREPORT "www.arcemu.org"
| #define PACKAGE_URL ""
| #define PACKAGE "arcemu"
| #define VERSION "1.5"
| #define STDC_HEADERS 1
| #define HAVE_SYS_TYPES_H 1
| #define HAVE_SYS_STAT_H 1
| #define HAVE_STDLIB_H 1
| #define HAVE_STRING_H 1
| #define HAVE_MEMORY_H 1
| #define HAVE_STRINGS_H 1
| #define HAVE_INTTYPES_H 1
| #define HAVE_STDINT_H 1
| #define HAVE_UNISTD_H 1
| #define HAVE_DLFCN_H 1
| #define LT_OBJDIR ".libs/"
| #define X64 1
| #define USING_LITTLE_ENDIAN 1
| #define HAVE_STDCXX_0X /**/
| /* end confdefs.h. */
| #include <pthread.h>
| int
| main ()
| {
| pthread_t th; pthread_join(th, 0);
| pthread_attr_init(0); pthread_cleanup_push(0, 0);
| pthread_create(0,0,0,0); pthread_cleanup_pop(0);
| ;
| return 0;
| }
configure:15101: result: no
configure:15009: checking whether pthreads work with -kthread
configure:15092: gcc -o conftest -march=x86-64 -mtune=generic -O2 -pipe -I/usr/include -I/usr/local/include -Wall -fno-strict-aliasing -kthread -L/usr/lib -L/usr/local/lib conftest.c >&5
gcc: unrecognized option '-kthread'
conftest.c: In function 'main':
conftest.c:31: warning: null argument where non-null required (argument 1)
conftest.c:32: warning: null argument where non-null required (argument 1)
conftest.c:32: warning: null argument where non-null required (argument 3)
conftest.c:30: warning: 'th' is used uninitialized in this function
/tmp/ccxNPJq8.o: In function `main':
conftest.c:(.text+0xa): undefined reference to `pthread_join'
conftest.c:(.text+0x27): undefined reference to `__pthread_register_cancel'
conftest.c:(.text+0x34): undefined reference to `pthread_create'
conftest.c:(.text+0x3c): undefined reference to `__pthread_unregister_cancel'
collect2: ld returned 1 exit status
configure:15092: $? = 1
configure: failed program was:
| /* confdefs.h */
| #define PACKAGE_NAME "ArcEmu"
| #define PACKAGE_TARNAME "arcemu"
| #define PACKAGE_VERSION "1.5"
| #define PACKAGE_STRING "ArcEmu 1.5"
| #define PACKAGE_BUGREPORT "www.arcemu.org"
| #define PACKAGE_URL ""
| #define PACKAGE "arcemu"
| #define VERSION "1.5"
| #define STDC_HEADERS 1
| #define HAVE_SYS_TYPES_H 1
| #define HAVE_SYS_STAT_H 1
| #define HAVE_STDLIB_H 1
| #define HAVE_STRING_H 1
| #define HAVE_MEMORY_H 1
| #define HAVE_STRINGS_H 1
| #define HAVE_INTTYPES_H 1
| #define HAVE_STDINT_H 1
| #define HAVE_UNISTD_H 1
| #define HAVE_DLFCN_H 1
| #define LT_OBJDIR ".libs/"
| #define X64 1
| #define USING_LITTLE_ENDIAN 1
| #define HAVE_STDCXX_0X /**/
| /* end confdefs.h. */
| #include <pthread.h>
| int
| main ()
| {
| pthread_t th; pthread_join(th, 0);
| pthread_attr_init(0); pthread_cleanup_push(0, 0);
| pthread_create(0,0,0,0); pthread_cleanup_pop(0);
| ;
| return 0;
| }
configure:15101: result: no
configure:15059: checking for the pthreads library -llthread
configure:15092: gcc -o conftest -march=x86-64 -mtune=generic -O2 -pipe -I/usr/include -I/usr/local/include -Wall -fno-strict-aliasing -L/usr/lib -L/usr/local/lib conftest.c -llthread >&5
conftest.c: In function 'main':
conftest.c:31: warning: null argument where non-null required (argument 1)
conftest.c:32: warning: null argument where non-null required (argument 1)
conftest.c:32: warning: null argument where non-null required (argument 3)
conftest.c:30: warning: 'th' is used uninitialized in this function
/usr/bin/ld: cannot find -llthread
collect2: ld returned 1 exit status
configure:15092: $? = 1
configure: failed program was:
| /* confdefs.h */
| #define PACKAGE_NAME "ArcEmu"
| #define PACKAGE_TARNAME "arcemu"
| #define PACKAGE_VERSION "1.5"
| #define PACKAGE_STRING "ArcEmu 1.5"
| #define PACKAGE_BUGREPORT "www.arcemu.org"
| #define PACKAGE_URL ""
| #define PACKAGE "arcemu"
| #define VERSION "1.5"
| #define STDC_HEADERS 1
| #define HAVE_SYS_TYPES_H 1
| #define HAVE_SYS_STAT_H 1
| #define HAVE_STDLIB_H 1
| #define HAVE_STRING_H 1
| #define HAVE_MEMORY_H 1
| #define HAVE_STRINGS_H 1
| #define HAVE_INTTYPES_H 1
| #define HAVE_STDINT_H 1
| #define HAVE_UNISTD_H 1
| #define HAVE_DLFCN_H 1
| #define LT_OBJDIR ".libs/"
| #define X64 1
| #define USING_LITTLE_ENDIAN 1
| #define HAVE_STDCXX_0X /**/
| /* end confdefs.h. */
| #include <pthread.h>
| int
| main ()
| {
| pthread_t th; pthread_join(th, 0);
| pthread_attr_init(0); pthread_cleanup_push(0, 0);
| pthread_create(0,0,0,0); pthread_cleanup_pop(0);
| ;
| return 0;
| }
configure:15101: result: no
configure:15009: checking whether pthreads work with -pthread
configure:15092: gcc -o conftest -march=x86-64 -mtune=generic -O2 -pipe -I/usr/include -I/usr/local/include -Wall -fno-strict-aliasing -pthread -L/usr/lib -L/usr/local/lib conftest.c >&5
conftest.c: In function 'main':
conftest.c:31: warning: null argument where non-null required (argument 1)
conftest.c:32: warning: null argument where non-null required (argument 1)
conftest.c:32: warning: null argument where non-null required (argument 3)
conftest.c:30: warning: 'th' is used uninitialized in this function
configure:15092: $? = 0
configure:15101: result: yes
configure:15120: checking for joinable pthread attribute
configure:15135: gcc -o conftest -march=x86-64 -mtune=generic -O2 -pipe -I/usr/include -I/usr/local/include -Wall -fno-strict-aliasing -pthread -L/usr/lib -L/usr/local/lib conftest.c >&5
configure:15135: $? = 0
configure:15141: result: PTHREAD_CREATE_JOINABLE
configure:15151: checking if more special flags are required for pthreads
configure:15158: result: no
configure:15244: checking for compress in -lz
configure:15269: gcc -o conftest -march=x86-64 -mtune=generic -O2 -pipe -I/usr/include -I/usr/local/include -Wall -fno-strict-aliasing -pthread -L/usr/lib -L/usr/local/lib conftest.c -lz >&5
configure:15269: $? = 0
configure:15278: result: yes
configure:15291: checking for ftime in -lcompat
configure:15316: gcc -o conftest -march=x86-64 -mtune=generic -O2 -pipe -I/usr/include -I/usr/local/include -Wall -fno-strict-aliasing -pthread -L/usr/lib -L/usr/local/lib conftest.c -lcompat -lz >&5
/usr/bin/ld: cannot find -lcompat
collect2: ld returned 1 exit status
configure:15316: $? = 1
configure: failed program was:
| /* confdefs.h */
| #define PACKAGE_NAME "ArcEmu"
| #define PACKAGE_TARNAME "arcemu"
| #define PACKAGE_VERSION "1.5"
| #define PACKAGE_STRING "ArcEmu 1.5"
| #define PACKAGE_BUGREPORT "www.arcemu.org"
| #define PACKAGE_URL ""
| #define PACKAGE "arcemu"
| #define VERSION "1.5"
| #define STDC_HEADERS 1
| #define HAVE_SYS_TYPES_H 1
| #define HAVE_SYS_STAT_H 1
| #define HAVE_STDLIB_H 1
| #define HAVE_STRING_H 1
| #define HAVE_MEMORY_H 1
| #define HAVE_STRINGS_H 1
| #define HAVE_INTTYPES_H 1
| #define HAVE_STDINT_H 1
| #define HAVE_UNISTD_H 1
| #define HAVE_DLFCN_H 1
| #define LT_OBJDIR ".libs/"
| #define X64 1
| #define USING_LITTLE_ENDIAN 1
| #define HAVE_STDCXX_0X /**/
| #define HAVE_LIBZ 1
| /* end confdefs.h. */
|
| /* Override any GCC internal prototype to avoid an error.
| Use char because int might match the return type of a GCC
| builtin and then its argument prototype would still apply. */
| #ifdef __cplusplus
| extern "C"
| #endif
| char ftime ();
| int
| main ()
| {
| return ftime ();
| ;
| return 0;
| }
configure:15325: result: no
configure:15437: checking for ssl
configure:15704: checking detecting network socket engine
configure:15707: result: epoll
configure:15711: checking sys/epoll.h usability
configure:15711: gcc -c -march=x86-64 -mtune=generic -O2 -pipe -I/usr/include -I/usr/local/include -Wall -fno-strict-aliasing -pthread -I/usr/include/openssl -DHAVE_SSL -O2 -pipe -fomit-frame-pointer conftest.c >&5
configure:15711: $? = 0
configure:15711: result: yes
configure:15711: checking sys/epoll.h presence
configure:15711: gcc -E conftest.c
configure:15711: $? = 0
configure:15711: result: yes
configure:15711: checking for sys/epoll.h
configure:15711: result: yes
configure:15721: checking for epoll_ctl
configure:15721: gcc -o conftest -march=x86-64 -mtune=generic -O2 -pipe -I/usr/include -I/usr/local/include -Wall -fno-strict-aliasing -pthread -I/usr/include/openssl -DHAVE_SSL -O2 -pipe -fomit-frame-pointer -L/usr/lib -L/usr/local/lib -L/usr/lib -lz -lssl -lcrypto conftest.c -lz -lssl -lcrypto >&5
configure:15721: $? = 0
configure:15721: result: yes
configure:15862: checking for mysql_config
configure:15880: found /usr/bin/mysql_config
configure:15893: result: /usr/bin/mysql_config
configure:15904: checking for MySQL libraries
configure:15917: result: yes
configure:15932: checking if MySQL version is >= 5.0
configure:15959: result: yes
configure:15980: checking lib pcre
configure:15995: result: (testing)
configure:15997: checking for pcre_study in -lpcre
configure:16022: gcc -o conftest -march=x86-64 -mtune=generic -O2 -pipe -I/usr/include -I/usr/local/include -Wall -fno-strict-aliasing -pthread -I/usr/include/openssl -DHAVE_SSL -O2 -pipe -fomit-frame-pointer -I/usr/include/mysql -fPIC -pipe -fno-strict-aliasing -DUNIV_LINUX -DUNIV_LINUX -L/usr/lib -L/usr/local/lib -L/usr/lib -lz -lssl -lcrypto -Wl,--hash-style=gnu -Wl,--as-needed -rdynamic -L/usr/lib/mysql -lmysqlclient -lz -lcrypt -lnsl -lm conftest.c -lpcre -lz -lssl -lcrypto >&5
configure:16022: $? = 0
configure:16031: result: yes
configure:16044: checking lib pcre
configure:16046: result: -lpcre
configure:16286: creating ./config.status
## ---------------------- ##
## Running config.status. ##
## ---------------------- ##
This file was extended by ArcEmu config.status 1.5, which was
generated by GNU Autoconf 2.65. Invocation command line was
CONFIG_FILES =
CONFIG_HEADERS =
CONFIG_LINKS =
CONFIG_COMMANDS =
$ ./config.status
on ioni-laptop
config.status:1179: creating Makefile
config.status:1179: creating src/Makefile
config.status:1179: creating src/arcemu-shared/Makefile
config.status:1179: creating src/arcemu-world/Makefile
config.status:1179: creating src/arcemu-logonserver/Makefile
config.status:1179: creating src/arcemu-crashreport/Makefile
config.status:1179: creating src/scripts/Makefile
config.status:1179: creating src/scripts/src/Makefile
config.status:1179: creating src/scripts/src/GossipScripts/Makefile
config.status:1179: creating src/scripts/src/ExtraScripts/Makefile
config.status:1179: creating src/scripts/src/MiscScripts/Makefile
config.status:1179: creating src/scripts/src/InstanceScripts/Makefile
config.status:1179: creating src/scripts/src/ServerStatusPlugin/Makefile
config.status:1179: creating src/scripts/src/SpellHandlers/Makefile
config.status:1179: creating src/scripts/src/LuaEngine/Makefile
config.status:1179: creating src/scripts/src/QuestScripts/Makefile
config.status:1179: creating src/scripts/src/EventScripts/Makefile
config.status:1179: creating src/collision/Makefile
config.status:1179: creating config.h
config.status:1399: executing depfiles commands
config.status:1399: executing libtool commands
## ---------------- ##
## Cache variables. ##
## ---------------- ##
ac_cv_build=x86_64-unknown-linux-gnu
ac_cv_c_bigendian=no
ac_cv_c_compiler_gnu=yes
ac_cv_cxx_compile_cxx0x_cxx=yes
ac_cv_cxx_compile_cxx0x_gxx=yes
ac_cv_cxx_compile_cxx0x_native=no
ac_cv_cxx_compiler_gnu=yes
ac_cv_env_CCC_set=
ac_cv_env_CCC_value=
ac_cv_env_CC_set=
ac_cv_env_CC_value=
ac_cv_env_CFLAGS_set=set
ac_cv_env_CFLAGS_value='-march=x86-64 -mtune=generic -O2 -pipe'
ac_cv_env_CPPFLAGS_set=
ac_cv_env_CPPFLAGS_value=
ac_cv_env_CPP_set=
ac_cv_env_CPP_value=
ac_cv_env_CXXCPP_set=
ac_cv_env_CXXCPP_value=
ac_cv_env_CXXFLAGS_set=set
ac_cv_env_CXXFLAGS_value='-march=x86-64 -mtune=generic -O2 -pipe'
ac_cv_env_CXX_set=
ac_cv_env_CXX_value=
ac_cv_env_LDFLAGS_set=set
ac_cv_env_LDFLAGS_value='-Wl,--hash-style=gnu -Wl,--as-needed'
ac_cv_env_LIBS_set=
ac_cv_env_LIBS_value=
ac_cv_env_build_alias_set=
ac_cv_env_build_alias_value=
ac_cv_env_host_alias_set=
ac_cv_env_host_alias_value=
ac_cv_env_target_alias_set=
ac_cv_env_target_alias_value=
ac_cv_func_epoll_ctl=yes
ac_cv_header_dlfcn_h=yes
ac_cv_header_inttypes_h=yes
ac_cv_header_memory_h=yes
ac_cv_header_stdc=yes
ac_cv_header_stdint_h=yes
ac_cv_header_stdlib_h=yes
ac_cv_header_string_h=yes
ac_cv_header_strings_h=yes
ac_cv_header_sys_epoll_h=yes
ac_cv_header_sys_stat_h=yes
ac_cv_header_sys_types_h=yes
ac_cv_header_unistd_h=yes
ac_cv_host=x86_64-unknown-linux-gnu
ac_cv_lib_compat_ftime_=no
ac_cv_lib_pcre_pcre_study=yes
ac_cv_lib_z_compress=yes
ac_cv_objext=o
ac_cv_path_EGREP='/bin/grep -E'
ac_cv_path_FGREP='/bin/grep -F'
ac_cv_path_GREP=/bin/grep
ac_cv_path_MYSQL_CONFIG=/usr/bin/mysql_config
ac_cv_path_SED=/bin/sed
ac_cv_path_install='/bin/install -c'
ac_cv_path_mkdir=/bin/mkdir
ac_cv_prog_AWK=gawk
ac_cv_prog_CPP='gcc -E'
ac_cv_prog_CXXCPP='g++ -E'
ac_cv_prog_SVN=yes
ac_cv_prog_ac_ct_AR=ar
ac_cv_prog_ac_ct_CC=gcc
ac_cv_prog_ac_ct_CXX=g++
ac_cv_prog_ac_ct_OBJDUMP=objdump
ac_cv_prog_ac_ct_RANLIB=ranlib
ac_cv_prog_ac_ct_STRIP=strip
ac_cv_prog_cc_c89=
ac_cv_prog_cc_g=yes
ac_cv_prog_cxx_g=yes
ac_cv_prog_make_make_set=yes
am_cv_CC_dependencies_compiler_type=gcc3
am_cv_CXX_dependencies_compiler_type=gcc3
lt_cv_deplibs_check_method=pass_all
lt_cv_file_magic_cmd='$MAGIC_CMD'
lt_cv_file_magic_test_file=
lt_cv_ld_reload_flag=-r
lt_cv_nm_interface='BSD nm'
lt_cv_objdir=.libs
lt_cv_path_LD=/usr/bin/ld
lt_cv_path_LDCXX='/usr/bin/ld -m elf_x86_64'
lt_cv_path_NM='/usr/bin/nm -B'
lt_cv_prog_compiler_c_o=yes
lt_cv_prog_compiler_c_o_CXX=yes
lt_cv_prog_compiler_pic_works=yes
lt_cv_prog_compiler_pic_works_CXX=yes
lt_cv_prog_compiler_rtti_exceptions=no
lt_cv_prog_compiler_static_works=yes
lt_cv_prog_compiler_static_works_CXX=yes
lt_cv_prog_gnu_ld=yes
lt_cv_prog_gnu_ldcxx=yes
lt_cv_sys_global_symbol_pipe='sed -n -e '\''s/^.*[ ]\([ABCDGIRSTW][ABCDGIRSTW]*\)[ ][ ]*\([_A-Za-z][_A-Za-z0-9]*\)$/\1 \2 \2/p'\'''
lt_cv_sys_global_symbol_to_c_name_address='sed -n -e '\''s/^: \([^ ]*\) $/ {\"\1\", (void *) 0},/p'\'' -e '\''s/^[ABCDGIRSTW]* \([^ ]*\) \([^ ]*\)$/ {"\2", (void *) \&\2},/p'\'''
lt_cv_sys_global_symbol_to_c_name_address_lib_prefix='sed -n -e '\''s/^: \([^ ]*\) $/ {\"\1\", (void *) 0},/p'\'' -e '\''s/^[ABCDGIRSTW]* \([^ ]*\) \(lib[^ ]*\)$/ {"\2", (void *) \&\2},/p'\'' -e '\''s/^[ABCDGIRSTW]* \([^ ]*\) \([^ ]*\)$/ {"lib\2", (void *) \&\2},/p'\'''
lt_cv_sys_global_symbol_to_cdecl='sed -n -e '\''s/^T .* \(.*\)$/extern int \1();/p'\'' -e '\''s/^[ABCDGIRSTW]* .* \(.*\)$/extern char \1;/p'\'''
lt_cv_sys_max_cmd_len=1572864
## ----------------- ##
## Output variables. ##
## ----------------- ##
ACLOCAL='${SHELL} /home/ioni/Desktop/arcemu/src/arcemu-build/missing --run aclocal-1.11'
AMDEPBACKSLASH='\'
AMDEP_FALSE='#'
AMDEP_TRUE=''
AMTAR='${SHELL} /home/ioni/Desktop/arcemu/src/arcemu-build/missing --run tar'
AR='ar'
ARCH='x64'
AUTOCONF='${SHELL} /home/ioni/Desktop/arcemu/src/arcemu-build/missing --run autoconf'
AUTOHEADER='${SHELL} /home/ioni/Desktop/arcemu/src/arcemu-build/missing --run autoheader'
AUTOMAKE='${SHELL} /home/ioni/Desktop/arcemu/src/arcemu-build/missing --run automake-1.11'
AWK='gawk'
CC='gcc'
CCDEPMODE='depmode=gcc3'
CFLAGS='-march=x86-64 -mtune=generic -O2 -pipe -I/usr/include -I/usr/local/include -Wall -fno-strict-aliasing -pthread -I/usr/include/openssl -DHAVE_SSL -O2 -pipe -fomit-frame-pointer -I/usr/include/mysql -fPIC -pipe -fno-strict-aliasing -DUNIV_LINUX -DUNIV_LINUX '
CPP='gcc -E'
CPPFLAGS=''
CXX='g++'
CXXCPP='g++ -E'
CXXDEPMODE='depmode=gcc3'
CXXFLAGS='-march=x86-64 -mtune=generic -O2 -pipe -I/usr/include -I/usr/local/include -Wall -fno-strict-aliasing -std=gnu++0x -pthread -I/usr/include/openssl -DHAVE_SSL -O2 -pipe -fomit-frame-pointer -I/usr/include/mysql -fPIC -pipe -fno-strict-aliasing -DUNIV_LINUX -DUNIV_LINUX '
CYGPATH_W='echo'
DEFS='-DHAVE_CONFIG_H'
DEPDIR='.deps'
DSYMUTIL=''
DUMPBIN=''
ECHO_C=''
ECHO_N='-n'
ECHO_T=''
EGREP='/bin/grep -E'
EXEEXT=''
FGREP='/bin/grep -F'
GREP='/bin/grep'
HAVE_SSL='yes'
INCLUDES='-I/usr/include -I/usr/local/include'
INSTALL_DATA='${INSTALL} -m 644'
INSTALL_PROGRAM='${INSTALL}'
INSTALL_SCRIPT='${INSTALL}'
INSTALL_STRIP_PROGRAM='$(install_sh) -c -s'
LD='/usr/bin/ld -m elf_x86_64'
LDFLAGS=' -L/usr/lib -L/usr/local/lib -L/usr/lib -lz -lssl -lcrypto -Wl,--hash-style=gnu -Wl,--as-needed -rdynamic -L/usr/lib/mysql -lmysqlclient -lz -lcrypt -lnsl -lm -lpcre'
LIBOBJS=''
LIBS='-lpcre -lz -lssl -lcrypto'
LIBTOOL='$(SHELL) $(top_builddir)/libtool'
LIB_EXPORT='-Wl,--export-dynamic'
LIPO=''
LN_S='ln -s'
LTLIBOBJS=''
MAINT='#'
MAINTAINER_MODE_FALSE=''
MAINTAINER_MODE_TRUE='#'
MAKEINFO='${SHELL} /home/ioni/Desktop/arcemu/src/arcemu-build/missing --run makeinfo'
MKDIR_P='/bin/mkdir -p'
MYSQL_CFLAGS='-I/usr/include/mysql -fPIC -pipe -fno-strict-aliasing -DUNIV_LINUX -DUNIV_LINUX'
MYSQL_CONFIG='/usr/bin/mysql_config'
MYSQL_LDFLAGS='-Wl,--hash-style=gnu -Wl,--as-needed -rdynamic -L/usr/lib/mysql -lmysqlclient -lz -lcrypt -lnsl -lm'
MYSQL_VERSION='5.1.41'
NETWORKING='epoll (Linux)'
NM='/usr/bin/nm -B'
NMEDIT=''
OBJDUMP='objdump'
OBJEXT='o'
OTOOL64=''
OTOOL=''
PACKAGE='arcemu'
PACKAGE_BUGREPORT='www.arcemu.org'
PACKAGE_NAME='ArcEmu'
PACKAGE_STRING='ArcEmu 1.5'
PACKAGE_TARNAME='arcemu'
PACKAGE_URL=''
PACKAGE_VERSION='1.5'
PATH_SEPARATOR=':'
PCRE_CFLAGS=''
PCRE_LIBS='-lpcre'
PG_CONFIG=''
POSTGRESQL_CFLAGS=''
POSTGRESQL_LDFLAGS=''
POSTGRESQL_VERSION=''
PTHREAD_CC='gcc'
PTHREAD_CFLAGS='-pthread'
PTHREAD_LIBS=''
RANLIB='ranlib'
SED='/bin/sed'
SET_MAKE=''
SHELL='/bin/sh'
STRIP='strip'
SVN='yes'
VERSION='1.5'
ac_ct_CC='gcc'
ac_ct_CXX='g++'
ac_ct_DUMPBIN=''
acx_pthread_config=''
am__EXEEXT_FALSE=''
am__EXEEXT_TRUE='#'
am__fastdepCC_FALSE='#'
am__fastdepCC_TRUE=''
am__fastdepCXX_FALSE='#'
am__fastdepCXX_TRUE=''
am__include='include'
am__isrc=''
am__leading_dot='.'
am__quote=''
am__tar='${AMTAR} chof - "$$tardir"'
am__untar='${AMTAR} xf -'
bindir='${exec_prefix}/bin'
build='x86_64-unknown-linux-gnu'
build_alias=''
build_cpu='x86_64'
build_os='linux-gnu'
build_vendor='unknown'
datadir='${datarootdir}'
datarootdir='${prefix}/share'
docdir='${datarootdir}/doc/${PACKAGE_TARNAME}'
dvidir='${docdir}'
exec_prefix='${prefix}'
host='x86_64-unknown-linux-gnu'
host_alias=''
host_cpu='x86_64'
host_os='linux-gnu'
host_vendor='unknown'
htmldir='${docdir}'
includedir='${prefix}/include'
infodir='${datarootdir}/info'
install_sh='${SHELL} /home/ioni/Desktop/arcemu/src/arcemu-build/install-sh'
libdir='${exec_prefix}/lib'
libexecdir='${exec_prefix}/libexec'
localedir='${datarootdir}/locale'
localstatedir='${prefix}/var'
lt_ECHO='echo'
mandir='${datarootdir}/man'
mkdir_p='/bin/mkdir -p'
oldincludedir='/usr/include'
pdfdir='${docdir}'
prefix='/usr'
program_transform_name='s,x,x,'
psdir='${docdir}'
sbindir='${exec_prefix}/sbin'
sharedstatedir='${prefix}/com'
sysconfdir='../etc'
target_alias=''
## ----------- ##
## confdefs.h. ##
## ----------- ##
/* confdefs.h */
#define PACKAGE_NAME "ArcEmu"
#define PACKAGE_TARNAME "arcemu"
#define PACKAGE_VERSION "1.5"
#define PACKAGE_STRING "ArcEmu 1.5"
#define PACKAGE_BUGREPORT "www.arcemu.org"
#define PACKAGE_URL ""
#define PACKAGE "arcemu"
#define VERSION "1.5"
#define STDC_HEADERS 1
#define HAVE_SYS_TYPES_H 1
#define HAVE_SYS_STAT_H 1
#define HAVE_STDLIB_H 1
#define HAVE_STRING_H 1
#define HAVE_MEMORY_H 1
#define HAVE_STRINGS_H 1
#define HAVE_INTTYPES_H 1
#define HAVE_STDINT_H 1
#define HAVE_UNISTD_H 1
#define HAVE_DLFCN_H 1
#define LT_OBJDIR ".libs/"
#define X64 1
#define USING_LITTLE_ENDIAN 1
#define HAVE_STDCXX_0X /**/
#define HAVE_LIBZ 1
#define HAVE_SYS_EPOLL_H 1
#define USE_EPOLL 1
#define HAVE_MYSQL 1
#define HAVE_LIBPCRE 1
#define PREFIX "/usr"
#define SCRIPTDIR "../lib"
#define CONFDIR "../etc"
#define SVN_REVISION_DONE 1
configure: exit 0