All pastes #1704966 Raw Edit

Stuff

public text v1 · immutable
#1704966 ·published 2009-12-07 01:23 UTC
rendered paste body
In file included from /usr/src/linux-2.6.32/arch/x86/include/asm/percpu.h:45,
                 from /usr/src/linux-2.6.32/arch/x86/include/asm/current.h:5,
                 from /usr/src/linux-2.6.32/arch/x86/include/asm/processor.h:15,
                 from include/linux/prefetch.h:14,
                 from include/linux/list.h:6,
                 from include/linux/wait.h:22,
                 from sound/isa/dt019x.c:25:
include/linux/kernel.h: In function 'console_silent':
include/linux/kernel.h:294: internal compiler error: Segmentation fault
Please submit a full bug report,
with preprocessed source if appropriate.
See <http://gcc.gnu.org/bugs.html> for instructions.
make[2]: *** [sound/isa/dt019x.o] Error 1
make[1]: *** [sound/isa] Error 2
make: *** [sound] Error 2
make: *** Waiting for unfinished jobs....
  LD      drivers/atm/built-in.o
  CC [M]  drivers/atm/zatm.o
  CC [M]  drivers/ata/sata_inic162x.o
  CC [M]  fs/ext3/super.o
fs/ext3/super.c: In function '__ext3_journal_stop':
fs/ext3/super.c:3024: internal compiler error: Segmentation fault
Please submit a full bug report,
with preprocessed source if appropriate.
See <http://gcc.gnu.org/bugs.html> for instructions.
make[2]: *** [fs/ext3/super.o] Error 1
make[1]: *** [fs/ext3] Error 2
make: *** [fs] Error 2
  CC [M]  drivers/atm/uPD98402.o
  CC [M]  drivers/ata/pdc_adma.o
drivers/atm/uPD98402.c: In function 'constant_test_bit':
drivers/atm/uPD98402.c:263: internal compiler error: Segmentation fault
Please submit a full bug report,
with preprocessed source if appropriate.
See <http://gcc.gnu.org/bugs.html> for instructions.
make[2]: *** [sound/isa/dt019x.o] Error 1
make[1]: *** [sound/isa] Error 2
make: *** [sound] Error 2
make: *** Waiting for unfinished jobs....
  LD      drivers/atm/built-in.o
  CC [M]  drivers/atm/zatm.o
  CC [M]  drivers/ata/sata_inic162x.o
  CC [M]  fs/ext3/super.o
fs/ext3/super.c: In function '__ext3_journal_stop':
fs/ext3/super.c:3024: internal compiler error: Segmentation fault
Please submit a full bug report,
with preprocessed source if appropriate.
See <http://gcc.gnu.org/bugs.html> for instructions.
make[2]: *** [fs/ext3/super.o] Error 1
make[1]: *** [fs/ext3] Error 2
make: *** [fs] Error 2
  CC [M]  drivers/atm/uPD98402.o
  CC [M]  drivers/ata/pdc_adma.o
drivers/atm/uPD98402.c: In function 'constant_test_bit':
drivers/atm/uPD98402.c:263: internal compiler error: Segmentation fault
Please submit a full bug report,
with preprocessed source if appropriate.
See <http://gcc.gnu.org/bugs.html> for instructions.
make[2]: *** [drivers/atm/uPD98402.o] Error 1
make[2]: *** Waiting for unfinished jobs....
  CC [M]  drivers/ata/pata_ali.o
  LD      drivers/auxdisplay/built-in.o
  CC [M]  drivers/ata/pata_amd.o
make[1]: *** [drivers/atm] Error 2
make[1]: *** Waiting for unfinished jobs....
  CC [M]  drivers/ata/pata_artop.o
  CC [M]  drivers/ata/pata_atp867x.o
  CC [M]  drivers/ata/pata_atiixp.o
drivers/ata/pata_artop.c: In function 'artop_init_one':
drivers/ata/pata_artop.c:425: internal compiler error: Illegal instruction
Please submit a full bug report,
with preprocessed source if appropriate.
See <http://gcc.gnu.org/bugs.html> for instructions.
make[2]: *** [drivers/ata/pata_artop.o] Error 1
make[2]: *** Waiting for unfinished jobs....
make[1]: *** [drivers/ata] Error 2
make: *** [drivers] Error 2
root@substancev-slacktop:/usr/src/linux-2.6.32# ei*aa ing for unfinished jobs....
bash: ei*aa: command not found