CC [M] drivers/gpu/drm/radeon/r600_blit_shaders.o
CC [M] drivers/gpu/drm/radeon/r600_blit_kms.o
CC [M] drivers/gpu/drm/radeon/radeon_pm.o
LD [M] drivers/gpu/drm/radeon/radeon.o
LD drivers/gpu/drm/savage/built-in.o
CC [M] drivers/gpu/drm/savage/savage_drv.o
In file included from include/linux/prefetch.h:14,
from include/linux/list.h:6,
from include/linux/module.h:9,
from include/drm/drmP.h:44,
from drivers/gpu/drm/savage/savage_drv.c:26:
/usr/src/linux-2.6.32-subv/arch/x86/include/asm/processor.h: In function 'native_get_debugreg':
/usr/src/linux-2.6.32-subv/arch/x86/include/asm/processor.h:487: error:
before ';' token
/usr/src/linux-2.6.32-subv/arch/x86/include/asm/processor.h: In function 'native_set_debugreg':
/usr/src/linux-2.6.32-subv/arch/x86/include/asm/processor.h:514: error:
before ';' token
make[4]: *** [drivers/gpu/drm/savage/savage_drv.o] Error 1
make[3]: *** [drivers/gpu/drm/savage] Error 2
make[2]: *** [drivers/gpu/drm] Error 2
make[1]: *** [drivers/gpu] Error 2
make: *** [drivers] Error 2