All pastes #170285 Raw Edit

Stuff

public text v1 · immutable
·published 2006-09-14 14:26 UTC
rendered paste body
                install_prefix="/root/whiterussian/openwrt/build_mipsel/ettercap-NG-0.7.3/ipkg-install" \
                all install
make[3]: Entering directory `/root/whiterussian/openwrt/build_mipsel/ettercap-NG-0.7.3'
Making all in man
make[4]: Entering directory `/root/whiterussian/openwrt/build_mipsel/ettercap-NG-0.7.3/man'
make[4]: Nothing to be done for `all'.
make[4]: Leaving directory `/root/whiterussian/openwrt/build_mipsel/ettercap-NG-0.7.3/man'
Making all in share
make[4]: Entering directory `/root/whiterussian/openwrt/build_mipsel/ettercap-NG-0.7.3/share'
make[4]: Nothing to be done for `all'.
make[4]: Leaving directory `/root/whiterussian/openwrt/build_mipsel/ettercap-NG-0.7.3/share'
Making all in include
make[4]: Entering directory `/root/whiterussian/openwrt/build_mipsel/ettercap-NG-0.7.3/include'
make  all-am
make[5]: Entering directory `/root/whiterussian/openwrt/build_mipsel/ettercap-NG-0.7.3/include'
make[5]: Nothing to be done for `all-am'.
make[5]: Leaving directory `/root/whiterussian/openwrt/build_mipsel/ettercap-NG-0.7.3/include'
make[4]: Leaving directory `/root/whiterussian/openwrt/build_mipsel/ettercap-NG-0.7.3/include'
Making all in include
make[4]: Entering directory `/root/whiterussian/openwrt/build_mipsel/ettercap-NG-0.7.3/include'
make  all-am
make[5]: Entering directory `/root/whiterussian/openwrt/build_mipsel/ettercap-NG-0.7.3/include'
make[5]: Nothing to be done for `all-am'.
make[5]: Leaving directory `/root/whiterussian/openwrt/build_mipsel/ettercap-NG-0.7.3/include'
make[4]: Leaving directory `/root/whiterussian/openwrt/build_mipsel/ettercap-NG-0.7.3/include'
Making all in src
make[4]: Entering directory `/root/whiterussian/openwrt/build_mipsel/ettercap-NG-0.7.3/src'
Making all in os
make[5]: Entering directory `/root/whiterussian/openwrt/build_mipsel/ettercap-NG-0.7.3/src/os'
make[5]: Nothing to be done for `all'.
make[5]: Leaving directory `/root/whiterussian/openwrt/build_mipsel/ettercap-NG-0.7.3/src/os'
Making all in interfaces
make[5]: Entering directory `/root/whiterussian/openwrt/build_mipsel/ettercap-NG-0.7.3/src/interfaces'
Making all in daemon
make[6]: Entering directory `/root/whiterussian/openwrt/build_mipsel/ettercap-NG-0.7.3/src/interfaces/daemon'
make[6]: Nothing to be done for `all'.
make[6]: Leaving directory `/root/whiterussian/openwrt/build_mipsel/ettercap-NG-0.7.3/src/interfaces/daemon'
Making all in text
make[6]: Entering directory `/root/whiterussian/openwrt/build_mipsel/ettercap-NG-0.7.3/src/interfaces/text'
make[6]: Nothing to be done for `all'.
make[6]: Leaving directory `/root/whiterussian/openwrt/build_mipsel/ettercap-NG-0.7.3/src/interfaces/text'
Making all in curses
make[6]: Entering directory `/root/whiterussian/openwrt/build_mipsel/ettercap-NG-0.7.3/src/interfaces/curses'
Making all in widgets
make[7]: Entering directory `/root/whiterussian/openwrt/build_mipsel/ettercap-NG-0.7.3/src/interfaces/curses/widgets'
if /root/whiterussian/openwrt/staging_dir_mipsel/bin/mipsel-linux-uclibc-gcc -DHAVE_CONFIG_H -I. -I. -I../../../../include   -I/root/whiterussian/openwrt/staging_dir_mipsel/usr/include -O2 -funroll-loops -fomit-frame-pointer -Wall -I/root/whiterussian/openwrt/staging_dir_mipsel/usr/include -I/root/whiterussian/openwrt/staging_dir_mipsel/usr/include -I/root/whiterussian/openwrt/staging_dir_mipsel/usr/include -I/root/whiterussian/openwrt/staging_dir_mipsel/usr/include  -I/usr/include/ncurses -Os -pipe -mips32 -mtune=mips32 -funit-at-a-time  -MT libwdg_a-wdg_input.o -MD -MP -MF ".deps/libwdg_a-wdg_input.Tpo" -c -o libwdg_a-wdg_input.o `test -f 'wdg_input.c' || echo './'`wdg_input.c; \
        then mv -f ".deps/libwdg_a-wdg_input.Tpo" ".deps/libwdg_a-wdg_input.Po"; else rm -f ".deps/libwdg_a-wdg_input.Tpo"; exit 1; fi
In file included from wdg_input.c:26:
/usr/include/ncurses/form.h:251: error: parse error before "TYPE_ALPHA"
/usr/include/ncurses/form.h:251: warning: type defaults to `int' in declaration of `TYPE_ALPHA'
/usr/include/ncurses/form.h:251: warning: data definition has no type or storage class
/usr/include/ncurses/form.h:252: error: parse error before "TYPE_ALNUM"
/usr/include/ncurses/form.h:252: warning: type defaults to `int' in declaration of `TYPE_ALNUM'
/usr/include/ncurses/form.h:252: warning: data definition has no type or storage class
/usr/include/ncurses/form.h:253: error: parse error before "TYPE_ENUM"
/usr/include/ncurses/form.h:253: warning: type defaults to `int' in declaration of `TYPE_ENUM'
/usr/include/ncurses/form.h:253: warning: data definition has no type or storage class
/usr/include/ncurses/form.h:254: error: parse error before "TYPE_INTEGER"
/usr/include/ncurses/form.h:254: warning: type defaults to `int' in declaration of `TYPE_INTEGER'
/usr/include/ncurses/form.h:254: warning: data definition has no type or storage class
/usr/include/ncurses/form.h:255: error: parse error before "TYPE_NUMERIC"
/usr/include/ncurses/form.h:255: warning: type defaults to `int' in declaration of `TYPE_NUMERIC'
/usr/include/ncurses/form.h:255: warning: data definition has no type or storage class
/usr/include/ncurses/form.h:256: error: parse error before "TYPE_REGEXP"
/usr/include/ncurses/form.h:256: warning: type defaults to `int' in declaration of `TYPE_REGEXP'
/usr/include/ncurses/form.h:256: warning: data definition has no type or storage class
/usr/include/ncurses/form.h:262: error: parse error before "TYPE_IPV4"
/usr/include/ncurses/form.h:262: warning: type defaults to `int' in declaration of `TYPE_IPV4'
/usr/include/ncurses/form.h:262: warning: data definition has no type or storage class
/usr/include/ncurses/form.h:267: error: parse error before "_nc_Default_Form"
/usr/include/ncurses/form.h:267: warning: type defaults to `int' in declaration of `_nc_Default_Form'
/usr/include/ncurses/form.h:267: warning: data definition has no type or storage class
/usr/include/ncurses/form.h:268: error: parse error before "_nc_Default_Field"
/usr/include/ncurses/form.h:268: warning: type defaults to `int' in declaration of `_nc_Default_Field'
/usr/include/ncurses/form.h:268: warning: data definition has no type or storage class
/usr/include/ncurses/form.h:274: error: parse error before "new_fieldtype"
/usr/include/ncurses/form.h:276: warning: type defaults to `int' in declaration of `new_fieldtype'
/usr/include/ncurses/form.h:277: warning: type defaults to `int' in declaration of `link_fieldtype'
/usr/include/ncurses/form.h:277: warning: data definition has no type or storage class
/usr/include/ncurses/form.h:279: error: parse error before "free_fieldtype"
/usr/include/ncurses/form.h:279: warning: type defaults to `int' in declaration of `free_fieldtype'
/usr/include/ncurses/form.h:279: warning: data definition has no type or storage class
/usr/include/ncurses/form.h:280: error: parse error before "set_fieldtype_arg"
/usr/include/ncurses/form.h:283: warning: type defaults to `int' in declaration of `set_fieldtype_arg'
/usr/include/ncurses/form.h:283: warning: data definition has no type or storage class
/usr/include/ncurses/form.h:284: error: parse error before "set_fieldtype_choice"
/usr/include/ncurses/form.h:286: warning: type defaults to `int' in declaration of `set_fieldtype_choice'
/usr/include/ncurses/form.h:286: warning: data definition has no type or storage class
/usr/include/ncurses/form.h:291: error: parse error before "new_field"
/usr/include/ncurses/form.h:291: warning: type defaults to `int' in declaration of `new_field'
/usr/include/ncurses/form.h:291: warning: data definition has no type or storage class
/usr/include/ncurses/form.h:292: error: parse error before "dup_field"
/usr/include/ncurses/form.h:292: warning: type defaults to `int' in declaration of `dup_field'
/usr/include/ncurses/form.h:292: warning: data definition has no type or storage class
/usr/include/ncurses/form.h:293: error: parse error before "link_field"
/usr/include/ncurses/form.h:293: warning: type defaults to `int' in declaration of `link_field'
/usr/include/ncurses/form.h:293: warning: data definition has no type or storage class
/usr/include/ncurses/form.h:295: error: parse error before "free_field"
/usr/include/ncurses/form.h:295: warning: type defaults to `int' in declaration of `free_field'
/usr/include/ncurses/form.h:295: warning: data definition has no type or storage class
/usr/include/ncurses/form.h:296: error: parse error before "field_info"
/usr/include/ncurses/form.h:296: warning: type defaults to `int' in declaration of `field_info'
/usr/include/ncurses/form.h:296: warning: data definition has no type or storage class
/usr/include/ncurses/form.h:297: error: parse error before "dynamic_field_info"
/usr/include/ncurses/form.h:297: warning: type defaults to `int' in declaration of `dynamic_field_info'
/usr/include/ncurses/form.h:297: warning: data definition has no type or storage class
/usr/include/ncurses/form.h:298: error: parse error before "set_max_field"
/usr/include/ncurses/form.h:298: warning: type defaults to `int' in declaration of `set_max_field'
/usr/include/ncurses/form.h:298: warning: data definition has no type or storage class
/usr/include/ncurses/form.h:299: error: parse error before "move_field"
/usr/include/ncurses/form.h:299: warning: type defaults to `int' in declaration of `move_field'
/usr/include/ncurses/form.h:299: warning: data definition has no type or storage class
/usr/include/ncurses/form.h:300: error: parse error before "set_field_type"
/usr/include/ncurses/form.h:300: warning: type defaults to `int' in declaration of `set_field_type'
/usr/include/ncurses/form.h:300: warning: data definition has no type or storage class
/usr/include/ncurses/form.h:301: error: parse error before "set_new_page"
/usr/include/ncurses/form.h:301: warning: type defaults to `int' in declaration of `set_new_page'
/usr/include/ncurses/form.h:301: warning: data definition has no type or storage class
/usr/include/ncurses/form.h:302: error: parse error before "set_field_just"
/usr/include/ncurses/form.h:302: warning: type defaults to `int' in declaration of `set_field_just'
/usr/include/ncurses/form.h:302: warning: data definition has no type or storage class
/usr/include/ncurses/form.h:303: error: parse error before "field_just"
/usr/include/ncurses/form.h:303: warning: type defaults to `int' in declaration of `field_just'
/usr/include/ncurses/form.h:303: warning: data definition has no type or storage class
/usr/include/ncurses/form.h:304: error: parse error before "set_field_fore"
/usr/include/ncurses/form.h:304: warning: type defaults to `int' in declaration of `set_field_fore'
/usr/include/ncurses/form.h:304: warning: data definition has no type or storage class
/usr/include/ncurses/form.h:305: error: parse error before "set_field_back"
/usr/include/ncurses/form.h:305: warning: type defaults to `int' in declaration of `set_field_back'
/usr/include/ncurses/form.h:305: warning: data definition has no type or storage class
/usr/include/ncurses/form.h:306: error: parse error before "set_field_pad"
/usr/include/ncurses/form.h:306: warning: type defaults to `int' in declaration of `set_field_pad'
/usr/include/ncurses/form.h:306: warning: data definition has no type or storage class
/usr/include/ncurses/form.h:307: error: parse error before "field_pad"
/usr/include/ncurses/form.h:307: warning: type defaults to `int' in declaration of `field_pad'
/usr/include/ncurses/form.h:307: warning: data definition has no type or storage class
/usr/include/ncurses/form.h:308: error: parse error before "set_field_buffer"
/usr/include/ncurses/form.h:308: warning: type defaults to `int' in declaration of `set_field_buffer'
/usr/include/ncurses/form.h:308: warning: data definition has no type or storage class
/usr/include/ncurses/form.h:309: error: parse error before "set_field_status"
/usr/include/ncurses/form.h:309: warning: type defaults to `int' in declaration of `set_field_status'
/usr/include/ncurses/form.h:309: warning: data definition has no type or storage class
/usr/include/ncurses/form.h:310: error: parse error before "set_field_userptr"
/usr/include/ncurses/form.h:310: warning: type defaults to `int' in declaration of `set_field_userptr'
/usr/include/ncurses/form.h:310: warning: data definition has no type or storage class
/usr/include/ncurses/form.h:311: error: parse error before "set_field_opts"
/usr/include/ncurses/form.h:311: warning: type defaults to `int' in declaration of `set_field_opts'
/usr/include/ncurses/form.h:311: warning: data definition has no type or storage class
/usr/include/ncurses/form.h:312: error: parse error before "field_opts_on"
/usr/include/ncurses/form.h:312: warning: type defaults to `int' in declaration of `field_opts_on'
/usr/include/ncurses/form.h:312: warning: data definition has no type or storage class
/usr/include/ncurses/form.h:313: error: parse error before "field_opts_off"
/usr/include/ncurses/form.h:313: warning: type defaults to `int' in declaration of `field_opts_off'
/usr/include/ncurses/form.h:313: warning: data definition has no type or storage class
/usr/include/ncurses/form.h:315: error: parse error before "field_fore"
/usr/include/ncurses/form.h:315: warning: type defaults to `int' in declaration of `field_fore'
/usr/include/ncurses/form.h:315: warning: data definition has no type or storage class
/usr/include/ncurses/form.h:316: error: parse error before "field_back"
/usr/include/ncurses/form.h:316: warning: type defaults to `int' in declaration of `field_back'
/usr/include/ncurses/form.h:316: warning: data definition has no type or storage class
/usr/include/ncurses/form.h:318: error: parse error before "new_page"
/usr/include/ncurses/form.h:318: warning: type defaults to `int' in declaration of `new_page'
/usr/include/ncurses/form.h:318: warning: data definition has no type or storage class
/usr/include/ncurses/form.h:319: error: parse error before "field_status"
/usr/include/ncurses/form.h:319: warning: type defaults to `int' in declaration of `field_status'
/usr/include/ncurses/form.h:319: warning: data definition has no type or storage class
/usr/include/ncurses/form.h:321: error: parse error before "field_arg"
/usr/include/ncurses/form.h:321: warning: type defaults to `int' in declaration of `field_arg'
/usr/include/ncurses/form.h:321: warning: data definition has no type or storage class
/usr/include/ncurses/form.h:323: error: parse error before "field_userptr"
/usr/include/ncurses/form.h:323: warning: type defaults to `int' in declaration of `field_userptr'
/usr/include/ncurses/form.h:323: warning: data definition has no type or storage class
/usr/include/ncurses/form.h:325: error: parse error before "field_type"
/usr/include/ncurses/form.h:325: warning: type defaults to `int' in declaration of `field_type'
/usr/include/ncurses/form.h:325: warning: data definition has no type or storage class
/usr/include/ncurses/form.h:327: error: parse error before "field_buffer"
/usr/include/ncurses/form.h:327: warning: type defaults to `int' in declaration of `field_buffer'
/usr/include/ncurses/form.h:327: warning: data definition has no type or storage class
/usr/include/ncurses/form.h:329: error: parse error before "field_opts"
/usr/include/ncurses/form.h:329: warning: type defaults to `int' in declaration of `field_opts'
/usr/include/ncurses/form.h:329: warning: data definition has no type or storage class
/usr/include/ncurses/form.h:335: error: parse error before "new_form"
/usr/include/ncurses/form.h:335: warning: type defaults to `int' in declaration of `new_form'
/usr/include/ncurses/form.h:335: warning: data definition has no type or storage class
/usr/include/ncurses/form.h:337: error: parse error before "form_fields"
/usr/include/ncurses/form.h:337: warning: type defaults to `int' in declaration of `form_fields'
/usr/include/ncurses/form.h:337: warning: data definition has no type or storage class
/usr/include/ncurses/form.h:338: error: parse error before "current_field"
/usr/include/ncurses/form.h:338: warning: type defaults to `int' in declaration of `current_field'
/usr/include/ncurses/form.h:338: warning: data definition has no type or storage class
/usr/include/ncurses/form.h:340: error: parse error before "form_win"
/usr/include/ncurses/form.h:340: warning: type defaults to `int' in declaration of `form_win'
/usr/include/ncurses/form.h:340: warning: data definition has no type or storage class
/usr/include/ncurses/form.h:341: error: parse error before "form_sub"
/usr/include/ncurses/form.h:341: warning: type defaults to `int' in declaration of `form_sub'
/usr/include/ncurses/form.h:341: warning: data definition has no type or storage class
/usr/include/ncurses/form.h:343: error: parse error before "form_init"
/usr/include/ncurses/form.h:343: warning: type defaults to `int' in declaration of `form_init'
/usr/include/ncurses/form.h:343: warning: data definition has no type or storage class
/usr/include/ncurses/form.h:344: error: parse error before "form_term"
/usr/include/ncurses/form.h:344: warning: type defaults to `int' in declaration of `form_term'
/usr/include/ncurses/form.h:344: warning: data definition has no type or storage class
/usr/include/ncurses/form.h:345: error: parse error before "field_init"
/usr/include/ncurses/form.h:345: warning: type defaults to `int' in declaration of `field_init'
/usr/include/ncurses/form.h:345: warning: data definition has no type or storage class
/usr/include/ncurses/form.h:346: error: parse error before "field_term"
/usr/include/ncurses/form.h:346: warning: type defaults to `int' in declaration of `field_term'
/usr/include/ncurses/form.h:346: warning: data definition has no type or storage class
/usr/include/ncurses/form.h:348: error: parse error before "free_form"
/usr/include/ncurses/form.h:348: warning: type defaults to `int' in declaration of `free_form'
/usr/include/ncurses/form.h:348: warning: data definition has no type or storage class
/usr/include/ncurses/form.h:349: error: parse error before "set_form_fields"
/usr/include/ncurses/form.h:349: warning: type defaults to `int' in declaration of `set_form_fields'
/usr/include/ncurses/form.h:349: warning: data definition has no type or storage class
/usr/include/ncurses/form.h:350: error: parse error before "field_count"
/usr/include/ncurses/form.h:350: warning: type defaults to `int' in declaration of `field_count'
/usr/include/ncurses/form.h:350: warning: data definition has no type or storage class
/usr/include/ncurses/form.h:351: error: parse error before "set_form_win"
/usr/include/ncurses/form.h:351: warning: type defaults to `int' in declaration of `set_form_win'
/usr/include/ncurses/form.h:351: warning: data definition has no type or storage class
/usr/include/ncurses/form.h:352: error: parse error before "set_form_sub"
/usr/include/ncurses/form.h:352: warning: type defaults to `int' in declaration of `set_form_sub'
/usr/include/ncurses/form.h:352: warning: data definition has no type or storage class
/usr/include/ncurses/form.h:353: error: parse error before "set_current_field"
/usr/include/ncurses/form.h:353: warning: type defaults to `int' in declaration of `set_current_field'
/usr/include/ncurses/form.h:353: warning: data definition has no type or storage class
/usr/include/ncurses/form.h:354: error: parse error before "field_index"
/usr/include/ncurses/form.h:354: warning: type defaults to `int' in declaration of `field_index'
/usr/include/ncurses/form.h:354: warning: data definition has no type or storage class
/usr/include/ncurses/form.h:355: error: parse error before "set_form_page"
/usr/include/ncurses/form.h:355: warning: type defaults to `int' in declaration of `set_form_page'
/usr/include/ncurses/form.h:355: warning: data definition has no type or storage class
/usr/include/ncurses/form.h:356: error: parse error before "form_page"
/usr/include/ncurses/form.h:356: warning: type defaults to `int' in declaration of `form_page'
/usr/include/ncurses/form.h:356: warning: data definition has no type or storage class
/usr/include/ncurses/form.h:357: error: parse error before "scale_form"
/usr/include/ncurses/form.h:357: warning: type defaults to `int' in declaration of `scale_form'
/usr/include/ncurses/form.h:357: warning: data definition has no type or storage class
/usr/include/ncurses/form.h:358: error: parse error before "set_form_init"
/usr/include/ncurses/form.h:358: warning: type defaults to `int' in declaration of `set_form_init'
/usr/include/ncurses/form.h:358: warning: data definition has no type or storage class
/usr/include/ncurses/form.h:359: error: parse error before "set_form_term"
/usr/include/ncurses/form.h:359: warning: type defaults to `int' in declaration of `set_form_term'
/usr/include/ncurses/form.h:359: warning: data definition has no type or storage class
/usr/include/ncurses/form.h:360: error: parse error before "set_field_init"
/usr/include/ncurses/form.h:360: warning: type defaults to `int' in declaration of `set_field_init'
/usr/include/ncurses/form.h:360: warning: data definition has no type or storage class
/usr/include/ncurses/form.h:361: error: parse error before "set_field_term"
/usr/include/ncurses/form.h:361: warning: type defaults to `int' in declaration of `set_field_term'
/usr/include/ncurses/form.h:361: warning: data definition has no type or storage class
/usr/include/ncurses/form.h:362: error: parse error before "post_form"
/usr/include/ncurses/form.h:362: warning: type defaults to `int' in declaration of `post_form'
/usr/include/ncurses/form.h:362: warning: data definition has no type or storage class
/usr/include/ncurses/form.h:363: error: parse error before "unpost_form"
/usr/include/ncurses/form.h:363: warning: type defaults to `int' in declaration of `unpost_form'
/usr/include/ncurses/form.h:363: warning: data definition has no type or storage class
/usr/include/ncurses/form.h:364: error: parse error before "pos_form_cursor"
/usr/include/ncurses/form.h:364: warning: type defaults to `int' in declaration of `pos_form_cursor'
/usr/include/ncurses/form.h:364: warning: data definition has no type or storage class
/usr/include/ncurses/form.h:365: error: parse error before "form_driver"
/usr/include/ncurses/form.h:365: warning: type defaults to `int' in declaration of `form_driver'
/usr/include/ncurses/form.h:365: warning: data definition has no type or storage class
/usr/include/ncurses/form.h:366: error: parse error before "set_form_userptr"
/usr/include/ncurses/form.h:366: warning: type defaults to `int' in declaration of `set_form_userptr'
/usr/include/ncurses/form.h:366: warning: data definition has no type or storage class
/usr/include/ncurses/form.h:367: error: parse error before "set_form_opts"
/usr/include/ncurses/form.h:367: warning: type defaults to `int' in declaration of `set_form_opts'
/usr/include/ncurses/form.h:367: warning: data definition has no type or storage class
/usr/include/ncurses/form.h:368: error: parse error before "form_opts_on"
/usr/include/ncurses/form.h:368: warning: type defaults to `int' in declaration of `form_opts_on'
/usr/include/ncurses/form.h:368: warning: data definition has no type or storage class
/usr/include/ncurses/form.h:369: error: parse error before "form_opts_off"
/usr/include/ncurses/form.h:369: warning: type defaults to `int' in declaration of `form_opts_off'
/usr/include/ncurses/form.h:369: warning: data definition has no type or storage class
/usr/include/ncurses/form.h:370: error: parse error before "form_request_by_name"
/usr/include/ncurses/form.h:370: warning: type defaults to `int' in declaration of `form_request_by_name'
/usr/include/ncurses/form.h:370: warning: data definition has no type or storage class
/usr/include/ncurses/form.h:372: error: parse error before "form_request_name"
/usr/include/ncurses/form.h:372: warning: type defaults to `int' in declaration of `form_request_name'
/usr/include/ncurses/form.h:372: warning: data definition has no type or storage class
/usr/include/ncurses/form.h:374: error: parse error before "form_userptr"
/usr/include/ncurses/form.h:374: warning: type defaults to `int' in declaration of `form_userptr'
/usr/include/ncurses/form.h:374: warning: data definition has no type or storage class
/usr/include/ncurses/form.h:376: error: parse error before "form_opts"
/usr/include/ncurses/form.h:376: warning: type defaults to `int' in declaration of `form_opts'
/usr/include/ncurses/form.h:376: warning: data definition has no type or storage class
/usr/include/ncurses/form.h:378: error: parse error before "data_ahead"
/usr/include/ncurses/form.h:378: warning: type defaults to `int' in declaration of `data_ahead'
/usr/include/ncurses/form.h:378: warning: data definition has no type or storage class
/usr/include/ncurses/form.h:379: error: parse error before "data_behind"
/usr/include/ncurses/form.h:379: warning: type defaults to `int' in declaration of `data_behind'
/usr/include/ncurses/form.h:379: warning: data definition has no type or storage class
wdg_input.c: In function `wdg_input_virtualize':
wdg_input.c:350: warning: passing arg 1 of `set_field_back' makes pointer from integer without a cast
wdg_input.c:356: warning: passing arg 1 of `set_field_back' makes pointer from integer without a cast
wdg_input.c: In function `wdg_input_driver':
wdg_input.c:402: warning: passing arg 1 of `set_field_back' makes pointer from integer without a cast
wdg_input.c: In function `wdg_input_form_create':
wdg_input.c:452: warning: assignment makes pointer from integer without a cast
wdg_input.c:470: warning: passing arg 1 of `set_field_back' makes pointer from integer without a cast
wdg_input.c: In function `wdg_input_add':
wdg_input.c:516: warning: assignment makes pointer from integer without a cast
wdg_input.c:522: warning: assignment makes pointer from integer without a cast
wdg_input.c: In function `wdg_input_consolidate':
wdg_input.c:548: warning: assignment makes pointer from integer without a cast
make[7]: *** [libwdg_a-wdg_input.o] Error 1
make[7]: Leaving directory `/root/whiterussian/openwrt/build_mipsel/ettercap-NG-0.7.3/src/interfaces/curses/widgets'
make[6]: *** [all-recursive] Error 1
make[6]: Leaving directory `/root/whiterussian/openwrt/build_mipsel/ettercap-NG-0.7.3/src/interfaces/curses'
make[5]: *** [all-recursive] Error 1
make[5]: Leaving directory `/root/whiterussian/openwrt/build_mipsel/ettercap-NG-0.7.3/src/interfaces'
make[4]: *** [all-recursive] Error 1
make[4]: Leaving directory `/root/whiterussian/openwrt/build_mipsel/ettercap-NG-0.7.3/src'
make[3]: *** [all-recursive] Error 1
make[3]: Leaving directory `/root/whiterussian/openwrt/build_mipsel/ettercap-NG-0.7.3'
make[2]: *** [/root/whiterussian/openwrt/build_mipsel/ettercap-NG-0.7.3/.built] Error 2
make[2]: Leaving directory `/root/whiterussian/openwrt/package/ettercap-NG'
make[1]: *** [ettercap-NG-compile] Error 2
make[1]: Leaving directory `/root/whiterussian/openwrt/package'
make: *** [package/ettercap-NG-compile] Error 2