All pastes #170259 Raw Edit

kojiro

public text v1 · immutable
·published 2006-09-14 14:03 UTC
rendered paste body
***** ncftp-3.1.9-build.patch *****

===================================

PATCH COMMAND:  patch -p0 -g0 -E --no-backup-if-mismatch < /usr/portage/net-ftp/ncftp/files/ncftp-3.1.9-build.patch

===================================
patching file sio/Makefile.in
patching file sio/pch.mk.gcc-gch
Hunk #1 FAILED at 1.
1 out of 1 hunk FAILED -- saving rejects to file sio/pch.mk.gcc-gch.rej
patching file libncftp/Makefile.in
patching file libncftp/pch.mk.gcc-gch
Hunk #1 FAILED at 1.
1 out of 1 hunk FAILED -- saving rejects to file libncftp/pch.mk.gcc-gch.rej
===================================

PATCH COMMAND:  patch -p1 -g0 -E --no-backup-if-mismatch < /usr/portage/net-ftp/ncftp/files/ncftp-3.1.9-build.patch

===================================
patching file Makefile.in
Hunk #1 FAILED at 179.
1 out of 1 hunk FAILED -- saving rejects to file Makefile.in.rej
can't find file to patch at input line 17
Perhaps you used the wrong -p or --strip option?
The text leading up to this was:
--------------------------
|--- sio/pch.mk.gcc-gch
|+++ sio/pch.mk.gcc-gch
--------------------------
No file to patch.  Skipping patch.
1 out of 1 hunk ignored
patching file Makefile.in
Hunk #1 FAILED at 353.
1 out of 1 hunk FAILED -- saving rejects to file Makefile.in.rej
can't find file to patch at input line 36
Perhaps you used the wrong -p or --strip option?
The text leading up to this was:
--------------------------
|--- libncftp/pch.mk.gcc-gch
|+++ libncftp/pch.mk.gcc-gch
--------------------------
No file to patch.  Skipping patch.
1 out of 1 hunk ignored
===================================

PATCH COMMAND:  patch -p2 -g0 -E --no-backup-if-mismatch < /usr/portage/net-ftp/ncftp/files/ncftp-3.1.9-build.patch

===================================
missing header for unified diff at line 7 of patch
can't find file to patch at input line 7
Perhaps you used the wrong -p or --strip option?
The text leading up to this was:
--------------------------
|Fix parallel build bugs
|
|http://bugs.gentoo.org/146214
|
|--- sio/Makefile.in
|+++ sio/Makefile.in
--------------------------
No file to patch.  Skipping patch.
1 out of 1 hunk ignored
missing header for unified diff at line 17 of patch
can't find file to patch at input line 17
Perhaps you used the wrong -p or --strip option?
The text leading up to this was:
--------------------------
|--- sio/pch.mk.gcc-gch
|+++ sio/pch.mk.gcc-gch
--------------------------
No file to patch.  Skipping patch.
1 out of 1 hunk ignored
missing header for unified diff at line 27 of patch
can't find file to patch at input line 27
Perhaps you used the wrong -p or --strip option?
The text leading up to this was:
--------------------------
|--- libncftp/Makefile.in
|+++ libncftp/Makefile.in
--------------------------
No file to patch.  Skipping patch.
1 out of 1 hunk ignored
missing header for unified diff at line 36 of patch
can't find file to patch at input line 36
Perhaps you used the wrong -p or --strip option?
The text leading up to this was:
--------------------------
|--- libncftp/pch.mk.gcc-gch
|+++ libncftp/pch.mk.gcc-gch
--------------------------
No file to patch.  Skipping patch.
1 out of 1 hunk ignored
===================================

PATCH COMMAND:  patch -p3 -g0 -E --no-backup-if-mismatch < /usr/portage/net-ftp/ncftp/files/ncftp-3.1.9-build.patch

===================================
missing header for unified diff at line 7 of patch
can't find file to patch at input line 7
Perhaps you used the wrong -p or --strip option?
The text leading up to this was:
--------------------------
|Fix parallel build bugs
|
|http://bugs.gentoo.org/146214
|
|--- sio/Makefile.in
|+++ sio/Makefile.in
--------------------------
No file to patch.  Skipping patch.
1 out of 1 hunk ignored
missing header for unified diff at line 17 of patch
can't find file to patch at input line 17
Perhaps you used the wrong -p or --strip option?
The text leading up to this was:
--------------------------
|--- sio/pch.mk.gcc-gch
|+++ sio/pch.mk.gcc-gch
--------------------------
No file to patch.  Skipping patch.
1 out of 1 hunk ignored
missing header for unified diff at line 27 of patch
can't find file to patch at input line 27
Perhaps you used the wrong -p or --strip option?
The text leading up to this was:
--------------------------
|--- libncftp/Makefile.in
|+++ libncftp/Makefile.in
--------------------------
No file to patch.  Skipping patch.
1 out of 1 hunk ignored
missing header for unified diff at line 36 of patch
can't find file to patch at input line 36
Perhaps you used the wrong -p or --strip option?
The text leading up to this was:
--------------------------
|--- libncftp/pch.mk.gcc-gch
|+++ libncftp/pch.mk.gcc-gch
--------------------------
No file to patch.  Skipping patch.
1 out of 1 hunk ignored
===================================

PATCH COMMAND:  patch -p4 -g0 -E --no-backup-if-mismatch < /usr/portage/net-ftp/ncftp/files/ncftp-3.1.9-build.patch

===================================
missing header for unified diff at line 7 of patch
can't find file to patch at input line 7
Perhaps you used the wrong -p or --strip option?
The text leading up to this was:
--------------------------
|Fix parallel build bugs
|
|http://bugs.gentoo.org/146214
|
|--- sio/Makefile.in
|+++ sio/Makefile.in
--------------------------
No file to patch.  Skipping patch.
1 out of 1 hunk ignored
missing header for unified diff at line 17 of patch
can't find file to patch at input line 17
Perhaps you used the wrong -p or --strip option?
The text leading up to this was:
--------------------------
|--- sio/pch.mk.gcc-gch
|+++ sio/pch.mk.gcc-gch
--------------------------
No file to patch.  Skipping patch.
1 out of 1 hunk ignored
missing header for unified diff at line 27 of patch
can't find file to patch at input line 27
Perhaps you used the wrong -p or --strip option?
The text leading up to this was:
--------------------------
|--- libncftp/Makefile.in
|+++ libncftp/Makefile.in
--------------------------
No file to patch.  Skipping patch.
1 out of 1 hunk ignored
missing header for unified diff at line 36 of patch
can't find file to patch at input line 36
Perhaps you used the wrong -p or --strip option?
The text leading up to this was:
--------------------------
|--- libncftp/pch.mk.gcc-gch
|+++ libncftp/pch.mk.gcc-gch
--------------------------
No file to patch.  Skipping patch.
1 out of 1 hunk ignored