touch debian/stamp-autotools-files
chmod a+x /tmp/buildd/epsilon-0.3.0.007+cvs20060912/build-tree/epsilon-0.3.0.007/configure
cd build-tree/epsilon-0.3.0.007 && CC="cc" CXX="g++" CFLAGS="-g -Wall -O2" CXXFLAGS="-g -Wall -O2" CPPFLAGS="" LDFLAGS="" /tmp/buildd/epsilon-0.3.0.007+cvs20060912/build-tree/epsilon-0.3.0.007/configure --build=i486-linux-gnu --prefix=/usr --includedir="\${prefix}/include" --mandir="\${prefix}/share/man" --infodir="\${prefix}/share/info" --sysconfdir=/etc --localstatedir=/var --libexecdir="\${prefix}/lib/epsilon" --disable-maintainer-mode --disable-dependency-tracking --srcdir=. --disable-rpath
checking for a BSD-compatible install... /usr/bin/install -c
checking whether build environment is sane... yes
checking for gawk... no
checking for mawk... mawk
checking whether make sets $(MAKE)... yes
checking for style of include used by make... GNU
checking for gcc... cc
checking for C compiler default output file name... a.out
checking whether the C compiler works... yes
checking whether we are cross compiling... no
checking for suffix of executables...
checking for suffix of object files... o
checking whether we are using the GNU C compiler... yes
checking whether cc accepts -g... yes
checking for cc option to accept ANSI C... none needed
checking dependency style of cc... none
checking for library containing strerror... none required
checking for gcc... (cached) cc
checking whether we are using the GNU C compiler... (cached) yes
checking whether cc accepts -g... (cached) yes
checking for cc option to accept ANSI C... (cached) none needed
checking dependency style of cc... (cached) none
checking for gcc... (cached) cc
checking whether we are using the GNU C compiler... (cached) yes
checking whether cc accepts -g... (cached) yes
checking for cc option to accept ANSI C... (cached) none needed
checking dependency style of cc... (cached) none
checking how to run the C preprocessor... cc -E
checking for egrep... grep -E
checking for ANSI C header files... yes
checking whether byte ordering is bigendian... no
checking for an ANSI C-conforming const... yes
checking build system type... i486-pc-linux-gnu
checking host system type... i486-pc-linux-gnu
checking for a sed that does not truncate output... /bin/sed
checking for ld used by cc... /usr/bin/ld
checking if the linker (/usr/bin/ld) is GNU ld... yes
checking for /usr/bin/ld option to reload object files... -r
checking for BSD-compatible nm... /usr/bin/nm -B
checking whether ln -s works... yes
checking how to recognise dependent libraries... pass_all
checking for sys/types.h... yes
checking for sys/stat.h... yes
checking for stdlib.h... yes
checking for string.h... yes
checking for memory.h... yes
checking for strings.h... yes
checking for inttypes.h... yes
checking for stdint.h... yes
checking for unistd.h... yes
checking dlfcn.h usability... yes
checking dlfcn.h presence... yes
checking for dlfcn.h... yes
checking whether we are using the GNU C++ compiler... yes
checking whether g++ accepts -g... yes
checking dependency style of g++... none
checking how to run the C++ preprocessor... g++ -E
checking for g77... no
checking for f77... no
checking for xlf... no
checking for frt... no
checking for pgf77... no
checking for fort77... no
checking for fl32... no
checking for af77... no
checking for f90... no
checking for xlf90... no
checking for pgf90... no
checking for epcf90... no
checking for f95... no
checking for fort... no
checking for xlf95... no
checking for ifc... no
checking for efc... no
checking for pgf95... no
checking for lf95... no
checking for gfortran... no
checking whether we are using the GNU Fortran 77 compiler... no
checking whether accepts -g... no
checking the maximum length of command line arguments... 32768
checking command to parse /usr/bin/nm -B output from cc object... ok
checking for objdir... .libs
checking for ar... ar
checking for ranlib... ranlib
checking for strip... strip
checking if cc supports -fno-rtti -fno-exceptions... no
checking for cc option to produce PIC... -fPIC
checking if cc PIC flag -fPIC works... yes
checking if cc static flag -static works... yes
checking if cc supports -c -o file.o... yes
checking whether the cc linker (/usr/bin/ld) supports shared libraries... yes
checking whether -lc should be explicitly linked in... no
checking dynamic linker characteristics... GNU/Linux ld.so
checking how to hardcode library paths into programs... immediate
checking whether stripping libraries is possible... yes
checking if libtool supports shared libraries... yes
checking whether to build shared libraries... yes
checking whether to build static libraries... yes
configure: creating libtool
appending configuration tag "CXX" to libtool
checking for ld used by g++... /usr/bin/ld
checking if the linker (/usr/bin/ld) is GNU ld... yes
checking whether the g++ linker (/usr/bin/ld) supports shared libraries... yes
checking for g++ option to produce PIC... -fPIC
checking if g++ PIC flag -fPIC works... yes
checking if g++ static flag -static works... yes
checking if g++ supports -c -o file.o... yes
checking whether the g++ linker (/usr/bin/ld) supports shared libraries... yes
checking dynamic linker characteristics... GNU/Linux ld.so
checking how to hardcode library paths into programs... immediate
appending configuration tag "F77" to libtool
checking for imlib2-config... /usr/bin/imlib2-config
checking for imlib2 - version >= 1.0.0... yes
checking for epeg-config... /usr/bin/epeg-config
checking for epeg - version >= 0.9.0... yes
checking for pkg-config... /usr/bin/pkg-config
checking pkg-config is at least version 0.9.0... yes
checking for PNG... yes
checking for perl... /usr/bin/perl
checking for evas-config... /usr/bin/evas-config
checking for evas - version >= 0.9.9... yes
checking for ecore-config... /usr/bin/ecore-config
checking for ecore - version >= 0.9.9... yes
checking Ecore_Evas.h usability... yes
checking Ecore_Evas.h presence... yes
checking for Ecore_Evas.h... yes
checking whether the xine thumbnailer was explicitly disabled... no
checking for xine-config... no
checking for xine - version >= 1.0.0... no
*** The xine-config script installed by xine could not be found
*** If xine was installed in PREFIX, make sure PREFIX/bin is in
*** your path, or set the XINE_CONFIG environment variable to the
*** full path to xine-config.
configure: WARNING: libxine too old; no thumbnails for videos...
/tmp/buildd/epsilon-0.3.0.007+cvs20060912/build-tree/epsilon-0.3.0.007/configure: line 21942: test: =: unary operator expected
checking for edje-config... /usr/bin/edje-config
checking for edje - version >= 0.5.0... yes
configure: creating ./config.status
config.status: creating Makefile
config.status: creating epsilon.pc
config.status: creating epsilon.spec
config.status: creating epsilon-config
config.status: creating src/Makefile
config.status: creating src/include/Makefile
config.status: creating src/lib/Makefile
config.status: creating src/lib/exiftags/Makefile
config.status: creating src/bin/Makefile
config.status: creating src/plugins/Makefile
config.status: creating src/config.h
config.status: executing depfiles commands
config.status: executing default commands
Finished configuring epsilon 0.3.0.007
Support for freedesktop png thumbnailing .... yes
Support for epeg thumbnail extension .... yes
Now type 'make' (gmake on some systems) to compile epsilon
/usr/bin/make -C build-tree/epsilon-0.3.0.007
make[1]: Entering directory `/tmp/buildd/epsilon-0.3.0.007+cvs20060912/build-tree/epsilon-0.3.0.007'
Making all in src
make[2]: Entering directory `/tmp/buildd/epsilon-0.3.0.007+cvs20060912/build-tree/epsilon-0.3.0.007/src'
/usr/bin/make all-recursive
make[3]: Entering directory `/tmp/buildd/epsilon-0.3.0.007+cvs20060912/build-tree/epsilon-0.3.0.007/src'
Making all in lib
make[4]: Entering directory `/tmp/buildd/epsilon-0.3.0.007+cvs20060912/build-tree/epsilon-0.3.0.007/src/lib'
Making all in exiftags
make[5]: Entering directory `/tmp/buildd/epsilon-0.3.0.007+cvs20060912/build-tree/epsilon-0.3.0.007/src/lib/exiftags'
/bin/bash ../../../libtool --tag=CC --mode=compile cc -DHAVE_CONFIG_H -I. -I. -I../../../src -I../../../src -I../../../src -I../../../src/lib -g -Wall -O2 -c -o canon.lo canon.c
mkdir .libs
cc -DHAVE_CONFIG_H -I. -I. -I../../../src -I../../../src -I../../../src -I../../../src/lib -g -Wall -O2 -c canon.c -fPIC -DPIC -o .libs/canon.o
canon.c: In function 'canon_prop01':
canon.c:642: warning: pointer targets in passing argument 1 of 'exif2byte' differ in signedness
canon.c:657: warning: pointer targets in passing argument 1 of 'exif2byte' differ in signedness
canon.c:658: warning: pointer targets in passing argument 1 of 'exif2byte' differ in signedness
canon.c: In function 'canon_subval':
canon.c:744: warning: pointer targets in initialization differ in signedness
canon.c:748: warning: pointer targets in passing argument 1 of 'exif2byte' differ in signedness
canon.c:754: warning: pointer targets in passing argument 1 of 'exif2byte' differ in signedness
canon.c: In function 'canon_custom':
canon.c:808: warning: pointer targets in passing argument 1 of 'exif2byte' differ in signedness
canon.c:809: warning: pointer targets in passing argument 1 of 'exif2byte' differ in signedness
canon.c:815: warning: pointer targets in passing argument 1 of 'exif2byte' differ in signedness
canon.c: In function 'canon_prop':
canon.c:912: warning: pointer targets in assignment differ in signedness
canon.c:913: warning: pointer targets in passing argument 1 of 'exif2byte' differ in signedness
canon.c:914: warning: pointer targets in passing argument 1 of 'exif2byte' differ in signedness
canon.c:915: warning: pointer targets in passing argument 1 of 'exif2byte' differ in signedness
canon.c:977: warning: pointer targets in passing argument 2 of 'canon_custom' differ in signedness
canon.c:982: warning: pointer targets in passing argument 2 of 'canon_custom' differ in signedness
cc -DHAVE_CONFIG_H -I. -I. -I../../../src -I../../../src -I../../../src -I../../../src/lib -g -Wall -O2 -c canon.c -o canon.o >/dev/null 2>&1
/bin/bash ../../../libtool --tag=CC --mode=compile cc -DHAVE_CONFIG_H -I. -I. -I../../../src -I../../../src -I../../../src -I../../../src/lib -g -Wall -O2 -c -o casio.lo casio.c
cc -DHAVE_CONFIG_H -I. -I. -I../../../src -I../../../src -I../../../src -I../../../src/lib -g -Wall -O2 -c casio.c -fPIC -DPIC -o .libs/casio.o
cc -DHAVE_CONFIG_H -I. -I. -I../../../src -I../../../src -I../../../src -I../../../src/lib -g -Wall -O2 -c casio.c -o casio.o >/dev/null 2>&1
/bin/bash ../../../libtool --tag=CC --mode=compile cc -DHAVE_CONFIG_H -I. -I. -I../../../src -I../../../src -I../../../src -I../../../src/lib -g -Wall -O2 -c -o exif.lo exif.c
cc -DHAVE_CONFIG_H -I. -I. -I../../../src -I../../../src -I../../../src -I../../../src/lib -g -Wall -O2 -c exif.c -fPIC -DPIC -o .libs/exif.o
exif.c: In function 'parsetag':
exif.c:503: warning: pointer targets in passing argument 2 of '__builtin_strncpy' differ in signedness
exif.c:543: warning: pointer targets in assignment differ in signedness
exif.c:584: warning: pointer targets in passing argument 2 of '__builtin_strncpy' differ in signedness
cc -DHAVE_CONFIG_H -I. -I. -I../../../src -I../../../src -I../../../src -I../../../src/lib -g -Wall -O2 -c exif.c -o exif.o >/dev/null 2>&1
/bin/bash ../../../libtool --tag=CC --mode=compile cc -DHAVE_CONFIG_H -I. -I. -I../../../src -I../../../src -I../../../src -I../../../src/lib -g -Wall -O2 -c -o exifutil.lo exifutil.c
cc -DHAVE_CONFIG_H -I. -I. -I../../../src -I../../../src -I../../../src -I../../../src/lib -g -Wall -O2 -c exifutil.c -fPIC -DPIC -o .libs/exifutil.o
cc -DHAVE_CONFIG_H -I. -I. -I../../../src -I../../../src -I../../../src -I../../../src/lib -g -Wall -O2 -c exifutil.c -o exifutil.o >/dev/null 2>&1
/bin/bash ../../../libtool --tag=CC --mode=compile cc -DHAVE_CONFIG_H -I. -I. -I../../../src -I../../../src -I../../../src -I../../../src/lib -g -Wall -O2 -c -o fuji.lo fuji.c
cc -DHAVE_CONFIG_H -I. -I. -I../../../src -I../../../src -I../../../src -I../../../src/lib -g -Wall -O2 -c fuji.c -fPIC -DPIC -o .libs/fuji.o
fuji.c: In function 'fuji_ifd':
fuji.c:265: warning: pointer targets in passing argument 1 of 'strlen' differ in signedness
fuji.c:265: warning: pointer targets in passing argument 1 of 'strlen' differ in signedness
fuji.c:265: warning: pointer targets in passing argument 1 of '__builtin_strcmp' differ in signedness
fuji.c:265: warning: pointer targets in passing argument 1 of 'strlen' differ in signedness
fuji.c:265: warning: pointer targets in passing argument 1 of '__builtin_strcmp' differ in signedness
fuji.c:265: warning: pointer targets in passing argument 1 of '__builtin_strcmp' differ in signedness
fuji.c:265: warning: pointer targets in passing argument 1 of '__builtin_strcmp' differ in signedness
fuji.c:265: warning: pointer targets in passing argument 1 of 'strncmp' differ in signedness
cc -DHAVE_CONFIG_H -I. -I. -I../../../src -I../../../src -I../../../src -I../../../src/lib -g -Wall -O2 -c fuji.c -o fuji.o >/dev/null 2>&1
/bin/bash ../../../libtool --tag=CC --mode=compile cc -DHAVE_CONFIG_H -I. -I. -I../../../src -I../../../src -I../../../src -I../../../src/lib -g -Wall -O2 -c -o jpeg.lo jpeg.c
cc -DHAVE_CONFIG_H -I. -I. -I../../../src -I../../../src -I../../../src -I../../../src/lib -g -Wall -O2 -c jpeg.c -fPIC -DPIC -o .libs/jpeg.o
cc -DHAVE_CONFIG_H -I. -I. -I../../../src -I../../../src -I../../../src -I../../../src/lib -g -Wall -O2 -c jpeg.c -o jpeg.o >/dev/null 2>&1
/bin/bash ../../../libtool --tag=CC --mode=compile cc -DHAVE_CONFIG_H -I. -I. -I../../../src -I../../../src -I../../../src -I../../../src/lib -g -Wall -O2 -c -o makers.lo makers.c
cc -DHAVE_CONFIG_H -I. -I. -I../../../src -I../../../src -I../../../src -I../../../src/lib -g -Wall -O2 -c makers.c -fPIC -DPIC -o .libs/makers.o
cc -DHAVE_CONFIG_H -I. -I. -I../../../src -I../../../src -I../../../src -I../../../src/lib -g -Wall -O2 -c makers.c -o makers.o >/dev/null 2>&1
/bin/bash ../../../libtool --tag=CC --mode=compile cc -DHAVE_CONFIG_H -I. -I. -I../../../src -I../../../src -I../../../src -I../../../src/lib -g -Wall -O2 -c -o minolta.lo minolta.c
cc -DHAVE_CONFIG_H -I. -I. -I../../../src -I../../../src -I../../../src -I../../../src/lib -g -Wall -O2 -c minolta.c -fPIC -DPIC -o .libs/minolta.o
minolta.c: In function 'minolta_cprop':
minolta.c:442: warning: pointer targets in passing argument 1 of 'exif4byte' differ in signedness
minolta.c:468: warning: pointer targets in assignment differ in signedness
minolta.c:486: warning: pointer targets in assignment differ in signedness
minolta.c:504: warning: pointer targets in assignment differ in signedness
minolta.c:515: warning: pointer targets in assignment differ in signedness
minolta.c:524: warning: pointer targets in assignment differ in signedness
minolta.c:535: warning: pointer targets in assignment differ in signedness
minolta.c:544: warning: pointer targets in assignment differ in signedness
minolta.c:570: warning: pointer targets in assignment differ in signedness
minolta.c:589: warning: pointer targets in assignment differ in signedness
minolta.c:599: warning: pointer targets in assignment differ in signedness
minolta.c:632: warning: pointer targets in assignment differ in signedness
minolta.c: In function 'minolta_prop':
minolta.c:737: warning: pointer targets in passing argument 2 of 'minolta_cprop' differ in signedness
minolta.c:746: warning: pointer targets in passing argument 2 of 'minolta_cprop' differ in signedness
minolta.c: In function 'minolta_ifd':
minolta.c:815: warning: pointer targets in passing argument 1 of 'strlen' differ in signedness
minolta.c:815: warning: pointer targets in passing argument 1 of '__builtin_strcmp' differ in signedness
minolta.c:815: warning: pointer targets in passing argument 1 of 'strlen' differ in signedness
minolta.c:815: warning: pointer targets in passing argument 1 of '__builtin_strcmp' differ in signedness
minolta.c:815: warning: pointer targets in passing argument 1 of '__builtin_strcmp' differ in signedness
minolta.c:815: warning: pointer targets in passing argument 1 of '__builtin_strcmp' differ in signedness
cc -DHAVE_CONFIG_H -I. -I. -I../../../src -I../../../src -I../../../src -I../../../src/lib -g -Wall -O2 -c minolta.c -o minolta.o >/dev/null 2>&1
/bin/bash ../../../libtool --tag=CC --mode=compile cc -DHAVE_CONFIG_H -I. -I. -I../../../src -I../../../src -I../../../src -I../../../src/lib -g -Wall -O2 -c -o nikon.lo nikon.c
cc -DHAVE_CONFIG_H -I. -I. -I../../../src -I../../../src -I../../../src -I../../../src/lib -g -Wall -O2 -c nikon.c -fPIC -DPIC -o .libs/nikon.o
nikon.c: In function 'nikon_ifd':
nikon.c:301: warning: pointer targets in passing argument 1 of 'strlen' differ in signedness
nikon.c:301: warning: pointer targets in passing argument 1 of '__builtin_strcmp' differ in signedness
nikon.c:301: warning: pointer targets in passing argument 1 of 'strlen' differ in signedness
nikon.c:301: warning: pointer targets in passing argument 1 of '__builtin_strcmp' differ in signedness
nikon.c:301: warning: pointer targets in passing argument 1 of '__builtin_strcmp' differ in signedness
nikon.c:301: warning: pointer targets in passing argument 1 of '__builtin_strcmp' differ in signedness
cc -DHAVE_CONFIG_H -I. -I. -I../../../src -I../../../src -I../../../src -I../../../src/lib -g -Wall -O2 -c nikon.c -o nikon.o >/dev/null 2>&1
/bin/bash ../../../libtool --tag=CC --mode=compile cc -DHAVE_CONFIG_H -I. -I. -I../../../src -I../../../src -I../../../src -I../../../src/lib -g -Wall -O2 -c -o olympus.lo olympus.c
cc -DHAVE_CONFIG_H -I. -I. -I../../../src -I../../../src -I../../../src -I../../../src/lib -g -Wall -O2 -c olympus.c -fPIC -DPIC -o .libs/olympus.o
olympus.c: In function 'olympus_prop':
olympus.c:136: warning: pointer targets in assignment differ in signedness
olympus.c:148: warning: pointer targets in passing argument 1 of 'exif4byte' differ in signedness
olympus.c:156: warning: pointer targets in passing argument 1 of 'exif4byte' differ in signedness
olympus.c:164: warning: pointer targets in passing argument 1 of 'exif4byte' differ in signedness
olympus.c: In function 'olympus_ifd':
olympus.c:209: warning: pointer targets in passing argument 1 of 'strlen' differ in signedness
olympus.c:209: warning: pointer targets in passing argument 1 of '__builtin_strcmp' differ in signedness
olympus.c:209: warning: pointer targets in passing argument 1 of 'strlen' differ in signedness
olympus.c:209: warning: pointer targets in passing argument 1 of '__builtin_strcmp' differ in signedness
olympus.c:209: warning: pointer targets in passing argument 1 of '__builtin_strcmp' differ in signedness
olympus.c:209: warning: pointer targets in passing argument 1 of '__builtin_strcmp' differ in signedness
cc -DHAVE_CONFIG_H -I. -I. -I../../../src -I../../../src -I../../../src -I../../../src/lib -g -Wall -O2 -c olympus.c -o olympus.o >/dev/null 2>&1
/bin/bash ../../../libtool --tag=CC --mode=compile cc -DHAVE_CONFIG_H -I. -I. -I../../../src -I../../../src -I../../../src -I../../../src/lib -g -Wall -O2 -c -o tagdefs.lo tagdefs.c
cc -DHAVE_CONFIG_H -I. -I. -I../../../src -I../../../src -I../../../src -I../../../src/lib -g -Wall -O2 -c tagdefs.c -fPIC -DPIC -o .libs/tagdefs.o
cc -DHAVE_CONFIG_H -I. -I. -I../../../src -I../../../src -I../../../src -I../../../src/lib -g -Wall -O2 -c tagdefs.c -o tagdefs.o >/dev/null 2>&1
/bin/bash ../../../libtool --tag=CC --mode=link cc -g -Wall -O2 -o libepsilon_exiftags.la canon.lo casio.lo exif.lo exifutil.lo fuji.lo jpeg.lo makers.lo minolta.lo nikon.lo olympus.lo tagdefs.lo @imlib_libs@ @epeg_libs@
ar cru .libs/libepsilon_exiftags.a .libs/canon.o .libs/casio.o .libs/exif.o .libs/exifutil.o .libs/fuji.o .libs/jpeg.o .libs/makers.o .libs/minolta.o .libs/nikon.o .libs/olympus.o .libs/tagdefs.o
ranlib .libs/libepsilon_exiftags.a
creating libepsilon_exiftags.la
(cd .libs && rm -f libepsilon_exiftags.la && ln -s ../libepsilon_exiftags.la libepsilon_exiftags.la)
make[5]: Leaving directory `/tmp/buildd/epsilon-0.3.0.007+cvs20060912/build-tree/epsilon-0.3.0.007/src/lib/exiftags'
make[5]: Entering directory `/tmp/buildd/epsilon-0.3.0.007+cvs20060912/build-tree/epsilon-0.3.0.007/src/lib'
/bin/bash ../../libtool --tag=CC --mode=compile cc -DHAVE_CONFIG_H -I. -I. -I../../src -I/usr/include/libpng12 -I../../src/include -DPACKAGE_BIN_DIR=\""/usr/bin"\" -DPACKAGE_LIB_DIR=\""/usr/lib"\" -g -Wall -O2 -c -o Epsilon.lo Epsilon.c
mkdir .libs
cc -DHAVE_CONFIG_H -I. -I. -I../../src -I/usr/include/libpng12 -I../../src/include -DPACKAGE_BIN_DIR=\"/usr/bin\" -DPACKAGE_LIB_DIR=\"/usr/lib\" -g -Wall -O2 -c Epsilon.c -fPIC -DPIC -o .libs/Epsilon.o
In file included from ../../src/include/epsilon_plugin.h:5,
from Epsilon.c:2:
/usr/include/Imlib2.h:108: error: expected ')' before '*' token
/usr/include/Imlib2.h:109: error: expected ')' before '*' token
/usr/include/Imlib2.h:110: error: expected ')' before 'colormap'
/usr/include/Imlib2.h:111: error: expected ')' before 'drawable'
/usr/include/Imlib2.h:112: error: expected ')' before 'mask'
/usr/include/Imlib2.h:137: error: expected '=', ',', ';', 'asm' or '__attribute__' before '*' token
/usr/include/Imlib2.h:138: error: expected '=', ',', ';', 'asm' or '__attribute__' before '*' token
/usr/include/Imlib2.h:139: error: expected '=', ',', ';', 'asm' or '__attribute__' before 'imlib_context_get_colormap'
/usr/include/Imlib2.h:140: error: expected '=', ',', ';', 'asm' or '__attribute__' before 'imlib_context_get_drawable'
/usr/include/Imlib2.h:141: error: expected '=', ',', ';', 'asm' or '__attribute__' before 'imlib_context_get_mask'
/usr/include/Imlib2.h:170: error: expected ')' before '*' token
/usr/include/Imlib2.h:171: error: expected '=', ',', ';', 'asm' or '__attribute__' before '*' token
/usr/include/Imlib2.h:209: error: expected ')' before '*' token
/usr/include/Imlib2.h:211: error: expected ')' before '*' token
/usr/include/Imlib2.h:214: error: expected ')' before 'pixmap'
/usr/include/Imlib2.h:240: error: expected ')' before 'mask'
/usr/include/Imlib2.h:243: error: expected ')' before '*' token
/usr/include/Imlib2.h:246: error: expected ')' before 'mask'
/usr/include/Imlib2.h:256: error: expected ')' before 'mask'
make[5]: *** [Epsilon.lo] Error 1
make[5]: Leaving directory `/tmp/buildd/epsilon-0.3.0.007+cvs20060912/build-tree/epsilon-0.3.0.007/src/lib'
make[4]: *** [all-recursive] Error 1
make[4]: Leaving directory `/tmp/buildd/epsilon-0.3.0.007+cvs20060912/build-tree/epsilon-0.3.0.007/src/lib'
make[3]: *** [all-recursive] Error 1
make[3]: Leaving directory `/tmp/buildd/epsilon-0.3.0.007+cvs20060912/build-tree/epsilon-0.3.0.007/src'
make[2]: *** [all] Error 2
make[2]: Leaving directory `/tmp/buildd/epsilon-0.3.0.007+cvs20060912/build-tree/epsilon-0.3.0.007/src'
make[1]: *** [all-recursive] Error 1
make[1]: Leaving directory `/tmp/buildd/epsilon-0.3.0.007+cvs20060912/build-tree/epsilon-0.3.0.007'
make: *** [debian/stamp-makefile-build] Error 2