All pastes #17017 Raw Edit

Miscellany

public text v1 · immutable
#17017 ·published 2005-07-06 09:38 UTC
rendered paste body
done
| if test -r /tmp/oetmp/work/glibc-2.3.2+cvs20040726-r17/build-arm-linux/csu/abi-tag.h.new; then mv -f /tmp/oetmp/work/glibc-2.3.2+cvs20040726-r17/build-arm-linux/csu/abi-tag.h.new /tmp/oetmp/work/glibc-2.3.2+cvs20040726-r17/build-arm-linux/csu/abi-tag.h; \
| else echo >&2 'This configuration not matched in ../abi-tags'; exit 1; fi
| ccache arm-linux-gcc -march=armv5te -mtune=arm926ej-s ../sysdeps/unix/sysv/linux/init-first.c -c -std=gnu99 -O2 -Wall -Winline -Wstrict-prototypes -Wwrite-strings -fexpensive-optimizations -frename-registers  -fomit-frame-pointer    -I../include -I. -I/tmp/oetmp/work/glibc-2.3.2+cvs20040726-r17/build-arm-linux/csu -I.. -I../libio  -I/tmp/oetmp/work/glibc-2.3.2+cvs20040726-r17/build-arm-linux -I../sysdeps/arm/elf -I../linuxthreads/sysdeps/unix/sysv/linux/arm -I../linuxthreads/sysdeps/unix/sysv/linux -I../linuxthreads/sysdeps/pthread -I../sysdeps/pthread -I../linuxthreads/sysdeps/unix/sysv -I../linuxthreads/sysdeps/unix -I../linuxthreads/sysdeps/arm -I../sysdeps/unix/sysv/linux/arm -I../sysdeps/unix/sysv/linux -I../sysdeps/gnu -I../sysdeps/unix/common -I../sysdeps/unix/mman -I../sysdeps/unix/inet -I../sysdeps/unix/sysv -I../sysdeps/unix/arm -I../sysdeps/unix -I../sysdeps/posix -I../sysdeps/arm/fpu -I../sysdeps/arm -I../sysdeps/wordsize-32 -I../sysdeps/ieee754/flt-32 -I../sysdeps/ieee754/dbl-64 -I../sysdeps/ieee754 -I../sysdeps/generic/elf -I../sysdeps/generic -nostdinc -isystem /tmp/oetmp/cross/lib/gcc/arm-linux/3.4.4/include -isystem /tmp/oetmp/cross/arm-linux/include -D_LIBC_REENTRANT -include ../include/libc-symbols.h       -DHAVE_INITFINI -o /tmp/oetmp/work/glibc-2.3.2+cvs20040726-r17/build-arm-linux/csu/init-first.o -MD -MP -MF /tmp/oetmp/work/glibc-2.3.2+cvs20040726-r17/build-arm-linux/csu/init-first.o.dt -MT /tmp/oetmp/work/glibc-2.3.2+cvs20040726-r17/build-arm-linux/csu/init-first.o
| In file included from ../sysdeps/unix/sysdep.h:21,
|                  from ../sysdeps/unix/arm/sysdep.h:19,
|                  from ../sysdeps/unix/sysv/linux/arm/sysdep.h:25,
|                  from ../sysdeps/unix/sysv/linux/init-first.c:24:
| ../sysdeps/unix/sysv/linux/sys/syscall.h:25:24: asm/unistd.h: No such file or directory
| In file included from ../sysdeps/unix/sysv/linux/sys/param.h:24,
|                  from ../sysdeps/unix/sysv/linux/init-first.c:26:
| /tmp/oetmp/cross/arm-linux/include/linux/param.h:4:23: asm/param.h: No such file or directory
| In file included from ../signal/signal.h:329,
|                  from ../include/signal.h:5,
|                  from ../linuxthreads/internals.h:23,
|                  from ../linuxthreads/sysdeps/pthread/bits/libc-lock.h:27,
|                  from ../sysdeps/generic/ldsodefs.h:38,
|                  from ../sysdeps/unix/sysv/linux/ldsodefs.h:25,
|                  from ../sysdeps/unix/sysv/linux/init-first.c:30:
| ../sysdeps/unix/sysv/linux/bits/sigcontext.h:28:29: asm/sigcontext.h: No such file or directory
| In file included from ../include/signal.h:5,
|                  from ../linuxthreads/internals.h:23,
|                  from ../linuxthreads/sysdeps/pthread/bits/libc-lock.h:27,
|                  from ../sysdeps/generic/ldsodefs.h:38,
|                  from ../sysdeps/unix/sysv/linux/ldsodefs.h:25,
|                  from ../sysdeps/unix/sysv/linux/init-first.c:30:
| ../signal/signal.h:332: warning: "struct sigcontext" declared inside parameter list
| ../signal/signal.h:332: warning: its scope is only this definition or declaration, which is probably not what you want
| In file included from ../linuxthreads/internals.h:23,
|                  from ../linuxthreads/sysdeps/pthread/bits/libc-lock.h:27,
|                  from ../sysdeps/generic/ldsodefs.h:38,
|                  from ../sysdeps/unix/sysv/linux/ldsodefs.h:25,
|                  from ../sysdeps/unix/sysv/linux/init-first.c:30:
| ../include/signal.h:40: warning: "struct sigcontext" declared inside parameter list
| In file included from ../sysdeps/unix/sysv/linux/arm/sigcontextinfo.h:20,
|                  from ../linuxthreads/internals.h:26,
|                  from ../linuxthreads/sysdeps/pthread/bits/libc-lock.h:27,
|                  from ../sysdeps/generic/ldsodefs.h:38,
|                  from ../sysdeps/unix/sysv/linux/ldsodefs.h:25,
|                  from ../sysdeps/unix/sysv/linux/init-first.c:30:
| ../sysdeps/unix/sysv/linux/arm/bits/armsigctx.h:33:24: asm/ptrace.h: No such file or directory
| In file included from ../sysdeps/unix/sysv/linux/arm/sigcontextinfo.h:20,
|                  from ../linuxthreads/internals.h:26,
|                  from ../linuxthreads/sysdeps/pthread/bits/libc-lock.h:27,
|                  from ../sysdeps/generic/ldsodefs.h:38,
|                  from ../sysdeps/unix/sysv/linux/ldsodefs.h:25,
|                  from ../sysdeps/unix/sysv/linux/init-first.c:30:
| ../sysdeps/unix/sysv/linux/arm/bits/armsigctx.h:64: error: field `reg' has incomplete type
| In file included from ../socket/sys/socket.h:35,
|                  from ../include/sys/socket.h:2,
|                  from ../inet/netinet/in.h:24,
|                  from ../include/netinet/in.h:3,
|                  from ../resolv/resolv.h:57,
|                  from ../include/resolv.h:11,
|                  from ../linuxthreads/descr.h:19,
|                  from ../linuxthreads/internals.h:29,
|                  from ../linuxthreads/sysdeps/pthread/bits/libc-lock.h:27,
|                  from ../sysdeps/generic/ldsodefs.h:38,
|                  from ../sysdeps/unix/sysv/linux/ldsodefs.h:25,
|                  from ../sysdeps/unix/sysv/linux/init-first.c:30:
| ../sysdeps/unix/sysv/linux/bits/socket.h:305:24: asm/socket.h: No such file or directory
| make[2]: *** [/tmp/oetmp/work/glibc-2.3.2+cvs20040726-r17/build-arm-linux/csu/init-first.o] Error 1
| make[2]: Leaving directory `/tmp/oetmp/work/glibc-2.3.2+cvs20040726-r17/libc/csu'
| make[1]: *** [csu/subdir_lib] Error 2
| make[1]: Leaving directory `/tmp/oetmp/work/glibc-2.3.2+cvs20040726-r17/libc'
| make: *** [all] Error 2
| FATAL: oe_runmake failed
NOTE: Task failed: /tmp/oetmp/work/glibc-2.3.2+cvs20040726-r17/temp/log.do_compile.4915
NOTE: package glibc-2.3.2+cvs20040726-r17: task do_compile: failed
ERROR: TaskFailed event exception, aborting
NOTE: package glibc-2.3.2+cvs20040726: failed
ERROR: Build of basic-image failed