hook.c: In function ‘call_current_hook’:
hook.c:583: error: ‘struct hook_info’ has no member named ‘id’
hook.c:584: error: ‘struct hook_info’ has no member named ‘pid’
hook.c:587: error: ‘struct hook_info’ has no member named ‘prev_unicode’
hook.c:588: error: ‘struct hook_info’ has no member named ‘next_unicode’
hook.c:593: warning: implicit declaration of function ‘call_hook_interthread’
make[2]: *** [hook.o] Error 1
make[2]: Leaving directory `/home/andras/src/wine/dlls/user'
make[1]: *** [user] Error 2
make[1]: Leaving directory `/home/andras/src/wine/dlls'
make: *** [dlls] Error 2