All pastes #16966 Raw Edit

Stuff

public text v1 · immutable
#16966 ·published 2005-07-05 19:34 UTC
rendered paste body
   -W -Wall -Wwrite-strings -Wstrict-prototypes -Wmissing-prototypes -pedantic -Wno-long-long -Wno-variadic-macros -Wold-style-definition     -DHAVE_CONFIG_H    -I. -I. -I/var/tmp/portage/gcc-4.1.0_beta20050702/work/gcc-4.1-20050702/gcc -I/var/tmp/portage/gcc-4.1.0_beta20050702/work/gcc-4.1-20050702/gcc/. -I/var/tmp/portage/gcc-4.1.0_beta20050702/work/gcc-4.1-20050702/gcc/../include -I/var/tmp/portage/gcc-4.1.0_beta20050702/work/gcc-4.1-20050702/gcc/../libcpp/include  /var/tmp/portage/gcc-4.1.0_beta20050702/work/gcc-4.1-20050702/gcc/tree-complex.c -o tree-complex.o
/var/tmp/portage/gcc-4.1.0_beta20050702/work/gcc-4.1-20050702/gcc/tree-complex.c: In function 'create_components':
/var/tmp/portage/gcc-4.1.0_beta20050702/work/gcc-4.1-20050702/gcc/tree-complex.c:445: error: corrupted profile info: number of executions for edge 9-11 thought to be -64
/var/tmp/portage/gcc-4.1.0_beta20050702/work/gcc-4.1-20050702/gcc/tree-complex.c:445: error: corrupted profile info: number of executions for edge 9-10 thought to be 64
/var/tmp/portage/gcc-4.1.0_beta20050702/work/gcc-4.1-20050702/gcc/tree-complex.c:445: error: corrupted profile info: number of executions for edge 12-31 thought to be 1934
/var/tmp/portage/gcc-4.1.0_beta20050702/work/gcc-4.1-20050702/gcc/tree-complex.c:445: error: corrupted profile info: number of executions for edge 12-13 thought to be -536
/var/tmp/portage/gcc-4.1.0_beta20050702/work/gcc-4.1-20050702/gcc/tree-complex.c:445: error: corrupted profile info: number of iterations for basic block 13 thought to be -536
/var/tmp/portage/gcc-4.1.0_beta20050702/work/gcc-4.1-20050702/gcc/tree-complex.c:445: error: corrupted profile info: number of executions for edge 35-38 thought to be -1374
/var/tmp/portage/gcc-4.1.0_beta20050702/work/gcc-4.1-20050702/gcc/tree-complex.c:445: error: corrupted profile info: number of executions for edge 35-36 thought to be 1374
/var/tmp/portage/gcc-4.1.0_beta20050702/work/gcc-4.1-20050702/gcc/tree-complex.c:445: error: corrupted profile info: number of iterations for basic block 38 thought to be -1374
/var/tmp/portage/gcc-4.1.0_beta20050702/work/gcc-4.1-20050702/gcc/tree-complex.c:445: error: corrupted profile info: number of executions for edge 38-40 thought to be -1386
/var/tmp/portage/gcc-4.1.0_beta20050702/work/gcc-4.1-20050702/gcc/tree-complex.c:445: error: corrupted profile info: number of executions for edge 38-39 thought to be 12
/var/tmp/portage/gcc-4.1.0_beta20050702/work/gcc-4.1-20050702/gcc/tree-complex.c:445: error: corrupted profile info: number of executions for edge 41-44 thought to be -1270
/var/tmp/portage/gcc-4.1.0_beta20050702/work/gcc-4.1-20050702/gcc/tree-complex.c:445: error: corrupted profile info: number of executions for edge 41-42 thought to be 1398
/var/tmp/portage/gcc-4.1.0_beta20050702/work/gcc-4.1-20050702/gcc/tree-complex.c:445: error: corrupted profile info: number of iterations for basic block 44 thought to be -1270
/var/tmp/portage/gcc-4.1.0_beta20050702/work/gcc-4.1-20050702/gcc/tree-complex.c:445: error: corrupted profile info: number of executions for edge 44--2 thought to be -1270
make[2]: *** [tree-complex.o] Error 1
make[2]: Leaving directory `/var/tmp/portage/gcc-4.1.0_beta20050702/work/build/gcc'
make[1]: *** [stagefeedback_build] Error 2
make[1]: Leaving directory `/var/tmp/portage/gcc-4.1.0_beta20050702/work/build/gcc'
make: *** [profiledbootstrap] Error 2