All pastes #168708 Raw Edit

minipanda

public text v1 · immutable
·published 2006-09-13 06:55 UTC
rendered paste body
| ccache gcc -shared  .libs/bindtextdom.o .libs/dcgettext.o .libs/dgettext.o .libs/gettext.o .libs/finddomain.o .libs/loadmsgcat.o .libs/localealias.o .libs/textdomain.o .libs/l10nflist.o .libs/explodename.o .libs/dcigettext.o .libs/dcngettext.o .libs/dngettext.o .libs/ngettext.o .libs/plural.o .libs/plural-exp.o .libs/localcharset.o .libs/relocatable.o .libs/localename.o .libs/log.o .libs/printf.o .libs/osdep.o .libs/intl-compat.o  -L/home/celf/opentestlab/individual/2_11/OE-20060622/omap5912osk_familiar-unstable_ltp-image/20060913-0148/build/tmp/staging/i686-linux/lib -lc  -Wl,-rpath-link -Wl,/home/celf/opentestlab/individual/2_11/OE-20060622/omap5912osk_familiar-unstable_ltp-image/20060913-0148/build/tmp/staging/i686-linux/lib -Wl,-rpath -Wl,/home/celf/opentestlab/individual/2_11/OE-20060622/omap5912osk_familiar-unstable_ltp-image/20060913-0148/build/tmp/staging/i686-linux/lib -Wl,-O1 -Wl,-soname -Wl,libgnuintl.so.3 -o .libs/libgnuintl.so.3.4.0
| (cd .libs && rm -f libgnuintl.so.3 && ln -s libgnuintl.so.3.4.0 libgnuintl.so.3)
| (cd .libs && rm -f libgnuintl.so && ln -s libgnuintl.so.3.4.0 libgnuintl.so)
| ar cru .libs/libgnuintl.a  bindtextdom.o dcgettext.o dgettext.o gettext.o finddomain.o loadmsgcat.o localealias.o textdomain.o l10nflist.o explodename.o dcigettext.o dcngettext.o dngettext.o ngettext.o plural.o plural-exp.o localcharset.o relocatable.o localename.o log.o printf.o osdep.o intl-compat.o
| ranlib .libs/libgnuintl.a
| creating libgnuintl.la
| (cd .libs && rm -f libgnuintl.la && ln -s ../libgnuintl.la libgnuintl.la)
| make[3]: Leaving directory `/home/celf/opentestlab/individual/2_11/OE-20060622/omap5912osk_familiar-unstable_ltp-image/20060913-0148/build/tmp/work/i686-linux/gettext-native-0.14.1-r3/gettext-0.14.1/gettext-runtime/intl'
| Making all in intl-java
| make[3]: Entering directory `/home/celf/opentestlab/individual/2_11/OE-20060622/omap5912osk_familiar-unstable_ltp-image/20060913-0148/build/tmp/work/i686-linux/gettext-native-0.14.1-r3/gettext-0.14.1/gettext-runtime/intl-java'
| /bin/sh ../lib/javacomp.sh -d . /home/celf/opentestlab/individual/2_11/OE-20060622/omap5912osk_familiar-unstable_ltp-image/20060913-0148/build/tmp/work/i686-linux/gettext-native-0.14.1-r3/gettext-0.14.1/gettext-runtime/intl-java/gnu/gettext/GettextResource.java
| ../lib/javacomp.sh: line 42: /etc/java-config-2/current-system-vm/bin/javac: No such file or directory
| ../lib/javacomp.sh: line 42: exec: /etc/java-config-2/current-system-vm/bin/javac: cannot execute: No such file or directory
| make[3]: *** [gnu/gettext/GettextResource.class] Error 126
| make[3]: Leaving directory `/home/celf/opentestlab/individual/2_11/OE-20060622/omap5912osk_familiar-unstable_ltp-image/20060913-0148/build/tmp/work/i686-linux/gettext-native-0.14.1-r3/gettext-0.14.1/gettext-runtime/intl-java'
| make[2]: *** [all-recursive] Error 1
| make[2]: Leaving directory `/home/celf/opentestlab/individual/2_11/OE-20060622/omap5912osk_familiar-unstable_ltp-image/20060913-0148/build/tmp/work/i686-linux/gettext-native-0.14.1-r3/gettext-0.14.1/gettext-runtime'
| make[1]: *** [all] Error 2
| make[1]: Leaving directory `/home/celf/opentestlab/individual/2_11/OE-20060622/omap5912osk_familiar-unstable_ltp-image/20060913-0148/build/tmp/work/i686-linux/gettext-native-0.14.1-r3/gettext-0.14.1/gettext-runtime'
| make: *** [all-recursive] Error 1
| FATAL: oe_runmake failed
NOTE: Task failed: /home/celf/opentestlab/individual/2_11/OE-20060622/omap5912osk_familiar-unstable_ltp-image/20060913-0148/build/tmp/work/i686-linux/gettext-native-0.14.1-r3/temp/log.do_compile.27152
NOTE: package gettext-native-0.14.1-r3: task do_compile: failed
ERROR: TaskFailed event exception, aborting
NOTE: package gettext-native-0.14.1: failed
ERROR: Couldn't build 'bootstrap-image'