t/00-load...........Can't locate Test/Most.pm in @INC (@INC contains: /home/magnet/files/dev/SDL_perl/blib/lib /home/magnet/files/dev/SDL_perl/blib/arch .. make/lib /etc/perl /usr/lib64/perl5/vendor_perl/5.8.8/x86_64-linux /usr/lib64/perl5/vendor_perl/5.8.8/x86_64-linux /usr/lib64/perl5/vendor_perl/5.8.8 /usr/lib64/perl5/vendor_perl/5.8.8/x86_64-linux /usr/lib64/perl5/vendor_perl/5.8.8 /usr/lib64/perl5/vendor_perl /usr/lib64/perl5/site_perl/5.8.8/x86_64-linux /usr/lib64/perl5/site_perl/5.8.8/x86_64-linux /usr/lib64/perl5/site_perl/5.8.8 /usr/lib64/perl5/site_perl/5.8.8/x86_64-linux /usr/lib64/perl5/site_perl/5.8.8 /usr/lib64/perl5/site_perl /usr/lib64/perl5/5.8.8/x86_64-linux /usr/lib64/perl5/5.8.8/x86_64-linux /usr/lib64/perl5/5.8.8 /usr/local/lib/site_perl . /etc/perl /usr/lib64/perl5/vendor_perl/5.8.8/x86_64-linux /usr/lib64/perl5/vendor_perl/5.8.8 /usr/lib64/perl5/vendor_perl /usr/lib64/perl5/site_perl/5.8.8/x86_64-linux /usr/lib64/perl5/site_perl/5.8.8 /usr/lib64/perl5/site_perl /usr/lib64/perl5/5.8.8/x86_64-linux /usr/lib64/perl5/5.8.8 /usr/local/lib/site_perl .) at t/00-load.t line 3.
BEGIN failed--compilation aborted at t/00-load.t line 3.
dubious
Test returned status 2 (wstat 512, 0x200)
t/apppm.............No available video device at t/apppm.t line 61
# Looks like your test died just after 2.
dubious
Test returned status 255 (wstat 65280, 0xff00)
after all the subtests completed successfully
t/cdrompm...........ok
t/colorpm...........ok
t/constantspm.......You tried to run a test without a plan at t/constantspm.t line 9.
# Looks like your test died before it could output anything.
dubious
Test returned status 255 (wstat 65280, 0xff00)
t/core..............
# Failed test '[init] returns 0 on success'
# at t/core.t line 24.
# got: '-1'
# expected: '0'
# Failed test '[was_init] recognizes turned on flags'
# at t/core.t line 26.
# got: '0'
# expected: '32'
# Failed test '[was_init] recognizes turned back on sub system'
# at t/core.t line 35.
# got: '0'
# expected: '32'
# [Percentage Completion] 75% implementation. 9 / 12
# Looks like you failed 3 tests of 13.
dubious
Test returned status 3 (wstat 768, 0x300)
DIED. FAILED tests 3-4, 7
Failed 3/13 tests, 76.92% okay
t/core_audio........Can't locate IO/CaptureOutput.pm in @INC (@INC contains: t/lib /home/magnet/files/dev/SDL_perl/blib/lib /home/magnet/files/dev/SDL_perl/blib/arch .. make/lib /etc/perl /usr/lib64/perl5/vendor_perl/5.8.8/x86_64-linux /usr/lib64/perl5/vendor_perl/5.8.8 /usr/lib64/perl5/vendor_perl /usr/lib64/perl5/site_perl/5.8.8/x86_64-linux /usr/lib64/perl5/site_perl/5.8.8 /usr/lib64/perl5/site_perl /usr/lib64/perl5/5.8.8/x86_64-linux /usr/lib64/perl5/5.8.8 /usr/local/lib/site_perl .) at t/lib/SDL/TestTool.pm line 4.
BEGIN failed--compilation aborted at t/lib/SDL/TestTool.pm line 4.
Compilation failed in require at t/core_audio.t line 10.
BEGIN failed--compilation aborted at t/core_audio.t line 10.
# Looks like your test died before it could output anything.
dubious
Test returned status 255 (wstat 65280, 0xff00)
t/core_cd...........Bareword "done_testing" not allowed while "strict subs" in use at t/core_cd.t line 39.
Execution of t/core_cd.t aborted due to compilation errors.
# Looks like your test died before it could output anything.
dubious
Test returned status 255 (wstat 65280, 0xff00)
t/core_error........
# Failed test '[init] returns 0 on success'
# at t/core_error.t line 7.
# got: '-1'
# expected: '0'
# Looks like you failed 1 test of 5.
dubious
Test returned status 1 (wstat 256, 0x100)
DIED. FAILED test 1
Failed 1/5 tests, 80.00% okay
t/core_events.......Bareword "done_testing" not allowed while "strict subs" in use at t/core_events.t line 266.
Execution of t/core_events.t aborted due to compilation errors.
# Looks like your test died before it could output anything.
dubious
Test returned status 255 (wstat 65280, 0xff00)
t/core_joystick.....Bareword "done_testing" not allowed while "strict subs" in use at t/core_joystick.t line 52.
Execution of t/core_joystick.t aborted due to compilation errors.
# Looks like your test died before it could output anything.
dubious
Test returned status 255 (wstat 65280, 0xff00)
t/core_memleak......skipped
all skipped: Author tests not required for installation
t/core_mouse........Bareword "done_testing" not allowed while "strict subs" in use at t/core_mouse.t line 39.
Execution of t/core_mouse.t aborted due to compilation errors.
# Looks like your test died before it could output anything.
dubious
Test returned status 255 (wstat 65280, 0xff00)
t/core_multi........# 0% done 0/21
ok
1/4 skipped: various reasons
t/core_overlay......
# Failed test 'The object isa SDL::Overlay'
# at t/core_overlay.t line 16.
# The object isn't defined
# Looks like you failed 1 test of 2.
dubious
Test returned status 1 (wstat 256, 0x100)
DIED. FAILED test 2
Failed 1/2 tests, 50.00% okay
t/core_palette......Can't call method "format" on an undefined value at t/core_palette.t line 18.
# Looks like you planned 9 tests but only ran 2.
# Looks like your test died just after 2.
dubious
Test returned status 255 (wstat 65280, 0xff00)
DIED. FAILED tests 3-9
Failed 7/9 tests, 22.22% okay
t/core_rect.........ok
t/core_rwops........Bareword "done_testing" not allowed while "strict subs" in use at t/core_rwops.t line 64.
Execution of t/core_rwops.t aborted due to compilation errors.
# Looks like your test died before it could output anything.
dubious
Test returned status 255 (wstat 65280, 0xff00)
t/core_surface......No available video device at t/core_surface.t line 74
# Looks like you planned 36 tests but only ran 31.
# Looks like your test died just after 31.
dubious
Test returned status 255 (wstat 65280, 0xff00)
DIED. FAILED tests 32-36
Failed 5/36 tests, 86.11% okay
t/core_timer........# [Percentage Completion] 33% implementation. 2 / 6
ok
t/core_ttf..........ok
t/core_version......ok
t/core_video........You tried to run a test without a plan at t/core_video.t line 62.
# Looks like your test died before it could output anything.
dubious
Test returned status 255 (wstat 65280, 0xff00)
t/eventpm...........ok
t/extendingrect.....ok
t/fontpm............ok
t/intergation1......No available video device at t/intergation1.t line 64
# Looks like your test died just after 2.
dubious
Test returned status 255 (wstat 65280, 0xff00)
after all the subtests completed successfully
t/manifest..........skipped
all skipped: Author tests not required for installation
t/mixer.............Bareword "done_testing" not allowed while "strict subs" in use at t/mixer.t line 98.
Execution of t/mixer.t aborted due to compilation errors.
# Looks like your test died before it could output anything.
dubious
Test returned status 255 (wstat 65280, 0xff00)
t/mixer_mixchunk....Can't locate IO/CaptureOutput.pm in @INC (@INC contains: t/lib /home/magnet/files/dev/SDL_perl/blib/lib /home/magnet/files/dev/SDL_perl/blib/arch .. make/lib /etc/perl /usr/lib64/perl5/vendor_perl/5.8.8/x86_64-linux /usr/lib64/perl5/vendor_perl/5.8.8 /usr/lib64/perl5/vendor_perl /usr/lib64/perl5/site_perl/5.8.8/x86_64-linux /usr/lib64/perl5/site_perl/5.8.8 /usr/lib64/perl5/site_perl /usr/lib64/perl5/5.8.8/x86_64-linux /usr/lib64/perl5/5.8.8 /usr/local/lib/site_perl .) at t/lib/SDL/TestTool.pm line 4.
BEGIN failed--compilation aborted at t/lib/SDL/TestTool.pm line 4.
Compilation failed in require at t/mixer_mixchunk.t line 7.
BEGIN failed--compilation aborted at t/mixer_mixchunk.t line 7.
dubious
Test returned status 2 (wstat 512, 0x200)
t/mixer_mixmusic....Can't locate IO/CaptureOutput.pm in @INC (@INC contains: t/lib /home/magnet/files/dev/SDL_perl/blib/lib /home/magnet/files/dev/SDL_perl/blib/arch .. make/lib /etc/perl /usr/lib64/perl5/vendor_perl/5.8.8/x86_64-linux /usr/lib64/perl5/vendor_perl/5.8.8 /usr/lib64/perl5/vendor_perl /usr/lib64/perl5/site_perl/5.8.8/x86_64-linux /usr/lib64/perl5/site_perl/5.8.8 /usr/lib64/perl5/site_perl /usr/lib64/perl5/5.8.8/x86_64-linux /usr/lib64/perl5/5.8.8 /usr/local/lib/site_perl .) at t/lib/SDL/TestTool.pm line 4.
BEGIN failed--compilation aborted at t/lib/SDL/TestTool.pm line 4.
Compilation failed in require at t/mixer_mixmusic.t line 7.
BEGIN failed--compilation aborted at t/mixer_mixmusic.t line 7.
dubious
Test returned status 2 (wstat 512, 0x200)
t/mixerpm...........ALSA lib confmisc.c:768:(parse_card) cannot find card '0'
ALSA lib conf.c:3513:(_snd_config_evaluate) function snd_func_card_driver returned error: No such file or directory
ALSA lib confmisc.c:392:(snd_func_concat) error evaluating strings
ALSA lib conf.c:3513:(_snd_config_evaluate) function snd_func_concat returned error: No such file or directory
ALSA lib confmisc.c:1251:(snd_func_refer) error evaluating name
ALSA lib conf.c:3513:(_snd_config_evaluate) function snd_func_refer returned error: No such file or directory
ALSA lib conf.c:3985:(snd_config_expand) Evaluate error: No such file or directory
ALSA lib pcm.c:2211:(snd_pcm_open_noupdate) Unknown PCM default
Use of inherited AUTOLOAD for non-method SDL::GetError() is deprecated at blib/lib/SDL/Mixer.pm line 56.
Can't locate auto/SDL/GetError.al in @INC (@INC contains: blib/lib blib/arch /home/magnet/files/dev/SDL_perl/blib/lib /home/magnet/files/dev/SDL_perl/blib/arch .. make/lib /etc/perl /usr/lib64/perl5/vendor_perl/5.8.8/x86_64-linux /usr/lib64/perl5/vendor_perl/5.8.8/x86_64-linux /usr/lib64/perl5/vendor_perl/5.8.8 /usr/lib64/perl5/vendor_perl/5.8.8/x86_64-linux /usr/lib64/perl5/vendor_perl/5.8.8 /usr/lib64/perl5/vendor_perl /usr/lib64/perl5/site_perl/5.8.8/x86_64-linux /usr/lib64/perl5/site_perl/5.8.8/x86_64-linux /usr/lib64/perl5/site_perl/5.8.8 /usr/lib64/perl5/site_perl/5.8.8/x86_64-linux /usr/lib64/perl5/site_perl/5.8.8 /usr/lib64/perl5/site_perl /usr/lib64/perl5/5.8.8/x86_64-linux /usr/lib64/perl5/5.8.8/x86_64-linux /usr/lib64/perl5/5.8.8 /usr/local/lib/site_perl . /etc/perl /usr/lib64/perl5/vendor_perl/5.8.8/x86_64-linux /usr/lib64/perl5/vendor_perl/5.8.8 /usr/lib64/perl5/vendor_perl /usr/lib64/perl5/site_perl/5.8.8/x86_64-linux /usr/lib64/perl5/site_perl/5.8.8 /usr/lib64/perl5/site_perl /usr/lib64/perl5/5.8.8/x86_64-linux /usr/lib64/perl5/5.8.8 /usr/local/lib/site_perl .) at blib/lib/SDL/Mixer.pm line 56
# Looks like you planned 3 tests but only ran 2.
# Looks like your test died just after 2.
dubious
Test returned status 255 (wstat 65280, 0xff00)
DIED. FAILED test 3
Failed 1/3 tests, 66.67% okay
t/mpegpm............skipped
all skipped: smpeg support not compiled
t/musicpm...........ok
t/opengl............ok
t/palettepm.........ok
t/sdlgamerect.......ok
t/sdlpm.............ok
t/smpeg.............skipped
all skipped: smpeg support not compiled
t/soundpm...........ok
t/surfaceML.........skipped
all skipped: Author tests not required for installation
t/timerpm...........ok
t/toolfontpm........skipped
all skipped: Failing test due to moving stuff around
t/toolgraphicpm.....ok
t/ttf...............Bareword "done_testing" not allowed while "strict subs" in use at t/ttf.t line 85.
Execution of t/ttf.t aborted due to compilation errors.
# Looks like your test died before it could output anything.
dubious
Test returned status 255 (wstat 65280, 0xff00)
t/ttf_constants.....Bareword "done_testing" not allowed while "strict subs" in use at t/ttf_constants.t line 34.
Execution of t/ttf_constants.t aborted due to compilation errors.
# Looks like your test died before it could output anything.
dubious
Test returned status 255 (wstat 65280, 0xff00)
t/ttfontpm..........skipped
all skipped: Failing test due to moving stuff around
Failed Test Stat Wstat Total Fail List of Failed
-------------------------------------------------------------------------------
t/00-load.t 2 512 ?? ?? ??
t/apppm.t 255 65280 2 0 ??
t/constantspm.t 255 65280 ?? ?? ??
t/core.t 3 768 13 3 3-4 7
t/core_audio.t 255 65280 ?? ?? ??
t/core_cd.t 255 65280 ?? ?? ??
t/core_error.t 1 256 5 1 1
t/core_events.t 255 65280 ?? ?? ??
t/core_joystick.t 255 65280 ?? ?? ??
t/core_mouse.t 255 65280 ?? ?? ??
t/core_overlay.t 1 256 2 1 2
t/core_palette.t 255 65280 9 14 3-9
t/core_rwops.t 255 65280 ?? ?? ??
t/core_surface.t 255 65280 36 10 32-36
t/core_video.t 255 65280 ?? ?? ??
t/intergation1.t 255 65280 2 0 ??
t/mixer.t 255 65280 ?? ?? ??
t/mixer_mixchunk.t 2 512 ?? ?? ??
t/mixer_mixmusic.t 2 512 ?? ?? ??
t/mixerpm.t 255 65280 3 2 3
t/ttf.t 255 65280 ?? ?? ??
t/ttf_constants.t 255 65280 ?? ?? ??
7 tests and 1 subtest skipped.
Failed 22/47 test scripts. 18/250 subtests failed.
Files=47, Tests=250, 4 wallclock secs ( 2.69 cusr + 0.52 csys = 3.21 CPU)
Failed 22/47 test programs. 18/250 subtests failed.